module github.com/edgexfoundry/edgex-go

require (
	bitbucket.org/bertimus9/systemstat v0.0.0-20180207000608-0eeff89b0690
	github.com/BurntSushi/toml v0.3.1
	github.com/OneOfOne/xxhash v1.2.5
	github.com/eclipse/paho.mqtt.golang v1.1.1
	github.com/edgexfoundry/go-mod-core-contracts v0.1.0
	github.com/edgexfoundry/go-mod-messaging v0.1.8
	github.com/edgexfoundry/go-mod-registry v0.1.0
	github.com/globalsign/mgo v0.0.0-20181015135952-eeefdecb41b8
	github.com/go-kit/kit v0.8.0
	github.com/go-stack/stack v1.8.0 // indirect
	github.com/gomodule/redigo v2.0.0+incompatible
	github.com/google/uuid v1.1.0
	github.com/gorilla/context v1.1.1
	github.com/gorilla/mux v1.7.0
	github.com/hashicorp/consul v1.4.2
	github.com/imdario/mergo v0.3.6
	github.com/magiconair/properties v1.8.0
	github.com/mattn/go-xmpp v0.0.0-20190124093244-6093f50721ed
	github.com/mitchellh/consulstructure v0.0.0-20190329231841-56fdc4d2da54
	github.com/pebbe/zmq4 v1.0.0
	github.com/pelletier/go-toml v1.2.0
	github.com/pkg/errors v0.8.1
	github.com/robfig/cron v0.0.0-20180505203441-b41be1df6967
	github.com/stretchr/testify v1.3.0
	github.com/ugorji/go v1.1.4
	github.com/vektra/mockery v0.0.0-20181123154057-e78b021dcbb5 // indirect
	gopkg.in/eapache/queue.v1 v1.1.0
	gopkg.in/yaml.v2 v2.2.2
)
