├── ROS2
│   ├── Node_classification_tsr
│   │   └── _inc
│   │       └── Node_classification_tsr.hpp
│   ├── Node_cominput_tsr
│   │   └── _inc
│   │       └── Node_cominput_tsr.hpp
│   ├── Node_control_behavior_acc
│   │   └── _inc
│   │       └── Node_control_behavior_acc.hpp
│   ├── Node_databroker_acc
│   │   └── _inc
│   │       └── Node_databroker_acc.hpp
│   ├── Node_databroker_ecm
│   │   └── _inc
│   │       └── Node_databroker_ecm.hpp
│   ├── Node_databroker_pcc
│   │   └── _inc
│   │       └── Node_databroker_pcc.hpp
│   ├── Node_detection_tsr
│   │   └── _inc
│   │       └── Node_detection_tsr.hpp
│   ├── Node_gaussian_filter_tsr
│   │   └── _inc
│   │       └── Node_gaussian_filter_tsr.hpp
│   ├── Node_input_acc
│   │   └── _inc
│   │       └── Node_input_acc.hpp
│   ├── Node_isr_10_ecm
│   │   └── _inc
│   │       └── Node_isr_10_ecm.hpp
│   ├── Node_isr_11_ecm
│   │   └── _inc
│   │       └── Node_isr_11_ecm.hpp
│   ├── Node_isr_1_ecm
│   │   └── _inc
│   │       └── Node_isr_1_ecm.hpp
│   ├── Node_isr_2_ecm
│   │   └── _inc
│   │       └── Node_isr_2_ecm.hpp
│   ├── Node_isr_3_ecm
│   │   └── _inc
│   │       └── Node_isr_3_ecm.hpp
│   ├── Node_isr_4_ecm
│   │   └── _inc
│   │       └── Node_isr_4_ecm.hpp
│   ├── Node_isr_5_ecm
│   │   └── _inc
│   │       └── Node_isr_5_ecm.hpp
│   ├── Node_isr_6_ecm
│   │   └── _inc
│   │       └── Node_isr_6_ecm.hpp
│   ├── Node_isr_7_ecm
│   │   └── _inc
│   │       └── Node_isr_7_ecm.hpp
│   ├── Node_isr_8_ecm
│   │   └── _inc
│   │       └── Node_isr_8_ecm.hpp
│   ├── Node_isr_9_ecm
│   │   └── _inc
│   │       └── Node_isr_9_ecm.hpp
│   ├── Node_output_acc
│   │   └── _inc
│   │       └── Node_output_acc.hpp
│   ├── Node_output_tsr
│   │   └── _inc
│   │       └── Node_output_tsr.hpp
│   ├── Node_perception_acc
│   │   └── _inc
│   │       └── Node_perception_acc.hpp
│   ├── Node_prediction_pcc
│   │   └── _inc
│   │       └── Node_prediction_pcc.hpp
│   ├── Node_preprocessing_acc
│   │   └── _inc
│   │       └── Node_preprocessing_acc.hpp
│   ├── Node_resizing_tsr
│   │   └── _inc
│   │       └── Node_resizing_tsr.hpp
│   ├── Node_segmentation_to_background_tsr
│   │   └── _inc
│   │       └── Node_segmentation_to_background_tsr.hpp
│   ├── Node_segmentation_tsr
│   │   └── _inc
│   │       └── Node_segmentation_tsr.hpp
│   ├── Node_task_1000ms_ecm
│   │   └── _inc
│   │       └── Node_task_1000ms_ecm.hpp
│   ├── Node_task_100ms_ecm
│   │   └── _inc
│   │       └── Node_task_100ms_ecm.hpp
│   ├── Node_task_10ms_ecm
│   │   └── _inc
│   │       └── Node_task_10ms_ecm.hpp
│   ├── Node_task_1ms_ecm
│   │   └── _inc
│   │       └── Node_task_1ms_ecm.hpp
│   ├── Node_task_200ms_ecm
│   │   └── _inc
│   │       └── Node_task_200ms_ecm.hpp
│   ├── Node_task_20ms_ecm
│   │   └── _inc
│   │       └── Node_task_20ms_ecm.hpp
│   ├── Node_task_2ms_ecm
│   │   └── _inc
│   │       └── Node_task_2ms_ecm.hpp
│   ├── Node_task_50ms_ecm
│   │   └── _inc
│   │       └── Node_task_50ms_ecm.hpp
│   ├── Node_task_5ms_ecm
│   │   └── _inc
│   │       └── Node_task_5ms_ecm.hpp
│   ├── Node_trajectory_optimizer_pcc
│   │   └── _inc
│   │       └── Node_trajectory_optimizer_pcc.hpp
│   ├── Node_world_model_acc
│   │   └── _inc
│   │       └── Node_world_model_acc.hpp
│   ├── synthetic_gen
│   │   ├── channelSendUtils
│   │   │   ├── _inc
│   │   │   │   └── channelSendUtils.hpp
│   │   │   └── _src
│   │   │       └── channelSendUtils.cpp
│   │   ├── interProcessTriggerUtils
│   │   │   ├── _inc
│   │   │   │   └── interProcessTriggerUtils.hpp
│   │   │   └── _src
│   │   │       └── interProcessTriggerUtils.cpp
│   │   ├── labels
│   │   │   ├── _inc
│   │   │   │   └── labels.hpp
│   │   │   ├── _src
│   │   │   │   └── labels.cpp
│   │   │   └── CMakeLists.txt
│   │   ├── runnables
│   │   │   ├── _inc
│   │   │   │   └── runnables.hpp
│   │   │   └── _src
│   │   │       └── runnables.cpp
│   │   └── ticksUtils
│   │       ├── _inc
│   │       │   └── ticksUtils.hpp
│   │       ├── _src
│   │       │   └── ticksUtils.cpp
│   │       └── CMakeLists.txt
│   ├── utils
│   │   └── aml
│   │       ├── _inc
│   │       │   └── aml.hpp
│   │       └── _src
│   │           └── aml.cpp
│   ├── CMakeLists.txt
│   ├── GPUTicks.cu
│   ├── build.sh
│   ├── launch.py
│   ├── main.cpp
│   └── package.xml
└── services
    ├── classification_service
    │   ├── srv
    │   │   └── ClassificationService.srv
    │   ├── CMakeLists.txt
    │   └── package.xml
    ├── detection_service
    │   ├── srv
    │   │   └── DetectionService.srv
    │   ├── CMakeLists.txt
    │   └── package.xml
    ├── gausian_filter_service
    │   ├── srv
    │   │   └── GausianFilterService.srv
    │   ├── CMakeLists.txt
    │   └── package.xml
    ├── segmentation_service
    │   ├── srv
    │   │   └── SegmentationService.srv
    │   ├── CMakeLists.txt
    │   └── package.xml
    ├── segmentation_to_bckground_service
    │   ├── srv
    │   │   └── SegmentationToBckgroundService.srv
    │   ├── CMakeLists.txt
    │   └── package.xml
    ├── trigger_perception_acc_service
    │   ├── srv
    │   │   └── TriggerPerceptionAccService.srv
    │   ├── CMakeLists.txt
    │   └── package.xml
    ├── trigger_trajectory_optimizer_pcc_service
    │   ├── srv
    │   │   └── TriggerTrajectoryOptimizerPccService.srv
    │   ├── CMakeLists.txt
    │   └── package.xml
    └── trigger_world_model_acc_service
        ├── srv
        │   └── TriggerWorldModelAccService.srv
        ├── CMakeLists.txt
        └── package.xml

116 directories, 83 files
