; NOTE: Assertions have been autogenerated by utils/update_test_checks.py
; RUN: opt %s -ompss-2 -S | FileCheck %s
; ModuleID = 'task_wait.c'
source_filename = "task_wait.c"
target datalayout = "e-m:e-p270:32:32-p271:32:32-p272:64:64-i64:64-f80:128-n8:16:32:64-S128"
target triple = "x86_64-unknown-linux-gnu"

; void foo() {
;     #pragma oss task wait
;     {}
; }

; wait clause adds 1 << 4 -> 16 to flags

; Function Attrs: noinline nounwind optnone
define void @foo() #0 !dbg !6 {
; CHECK-LABEL: @foo(
; CHECK-NEXT:  entry:
; CHECK-NEXT:    [[TMP0:%.*]] = alloca %nanos6_task_args_foo0*, align 8, [[DBG9:!dbg !.*]]
; CHECK-NEXT:    [[TMP1:%.*]] = alloca i8*, align 8, [[DBG9]]
; CHECK-NEXT:    [[NUM_DEPS:%.*]] = alloca i64, align 8, [[DBG9]]
; CHECK-NEXT:    br label [[FINAL_COND:%.*]], [[DBG9]]
; CHECK:       codeRepl:
; CHECK-NEXT:    [[TMP2:%.*]] = bitcast %nanos6_task_args_foo0** [[TMP0]] to i8**, [[DBG9]]
; CHECK-NEXT:    store i64 0, i64* [[NUM_DEPS]], align 8, [[DBG9]]
; CHECK-NEXT:    [[TMP3:%.*]] = load i64, i64* [[NUM_DEPS]], align 8, [[DBG9]]
; CHECK-NEXT:    call void @nanos6_create_task(%nanos6_task_info_t* @task_info_var_foo0, %nanos6_task_invocation_info_t* @task_invocation_info_foo0, i64 0, i8** [[TMP2]], i8** [[TMP1]], i64 16, i64 [[TMP3]]), [[DBG9]]
; CHECK-NEXT:    [[TMP4:%.*]] = load %nanos6_task_args_foo0*, %nanos6_task_args_foo0** [[TMP0]], align 8, [[DBG9]]
; CHECK-NEXT:    [[TMP5:%.*]] = bitcast %nanos6_task_args_foo0* [[TMP4]] to i8*, [[DBG9]]
; CHECK-NEXT:    [[ARGS_END:%.*]] = getelementptr i8, i8* [[TMP5]], i64 0, [[DBG9]]
; CHECK-NEXT:    [[TMP6:%.*]] = load i8*, i8** [[TMP1]], align 8, [[DBG9]]
; CHECK-NEXT:    call void @nanos6_submit_task(i8* [[TMP6]]), [[DBG9]]
; CHECK-NEXT:    br label [[FINAL_END:%.*]], [[DBG9]]
; CHECK:       final.end:
; CHECK-NEXT:    ret void, [[DBG10:!dbg !.*]]
; CHECK:       final.then:
; CHECK-NEXT:    br label [[FINAL_END]], [[DBG10]]
; CHECK:       final.cond:
; CHECK-NEXT:    [[TMP7:%.*]] = call i32 @nanos6_in_final(), [[DBG9]]
; CHECK-NEXT:    [[TMP8:%.*]] = icmp ne i32 [[TMP7]], 0, [[DBG9]]
; CHECK-NEXT:    br i1 [[TMP8]], label [[FINAL_THEN:%.*]], label [[CODEREPL:%.*]], [[DBG9]]
;
entry:
  %0 = call token @llvm.directive.region.entry() [ "DIR.OSS"([5 x i8] c"TASK\00"), "QUAL.OSS.WAIT"(i1 true) ], !dbg !9
  call void @llvm.directive.region.exit(token %0), !dbg !10
  ret void, !dbg !11
}

; Function Attrs: nounwind
declare token @llvm.directive.region.entry() #1

; Function Attrs: nounwind
declare void @llvm.directive.region.exit(token) #1

attributes #0 = { noinline nounwind optnone "correctly-rounded-divide-sqrt-fp-math"="false" "disable-tail-calls"="false" "frame-pointer"="none" "less-precise-fpmad"="false" "min-legal-vector-width"="0" "no-infs-fp-math"="false" "no-jump-tables"="false" "no-nans-fp-math"="false" "no-signed-zeros-fp-math"="false" "no-trapping-math"="false" "stack-protector-buffer-size"="8" "target-features"="+cx8,+mmx,+sse,+sse2,+x87" "unsafe-fp-math"="false" "use-soft-float"="false" }
attributes #1 = { nounwind }

!llvm.dbg.cu = !{!0}
!llvm.module.flags = !{!3, !4}
!llvm.ident = !{!5}

!0 = distinct !DICompileUnit(language: DW_LANG_C99, file: !1, producer: "human", isOptimized: false, runtimeVersion: 0, emissionKind: NoDebug, enums: !2, nameTableKind: None)
!1 = !DIFile(filename: "<stdin>", directory: "")
!2 = !{}
!3 = !{i32 2, !"Debug Info Version", i32 3}
!4 = !{i32 1, !"wchar_size", i32 4}
!5 = !{!"clang version 11.0.0 "}
!6 = distinct !DISubprogram(name: "foo", scope: !7, file: !7, line: 1, type: !8, scopeLine: 1, spFlags: DISPFlagDefinition, unit: !0, retainedNodes: !2)
!7 = !DIFile(filename: "task_wait.c", directory: "")
!8 = !DISubroutineType(types: !2)
!9 = !DILocation(line: 2, scope: !6)
!10 = !DILocation(line: 3, scope: !6)
!11 = !DILocation(line: 4, scope: !6)
