; NOTE: Assertions have been autogenerated by utils/update_test_checks.py
; RUN: opt %s -ompss-2 -S | FileCheck %s
source_filename = "task_if.c"
target datalayout = "e-m:e-p270:32:32-p271:32:32-p272:64:64-i64:64-f80:128-n8:16:32:64-S128"
target triple = "x86_64-unknown-linux-gnu"

; task_flags | (!If << 1)

define void @foo() !dbg !6 {
; CHECK-LABEL: @foo(
; CHECK-NEXT:  entry:
; CHECK-NEXT:    [[TMP0:%.*]] = alloca %nanos6_task_args_foo0*, align 8, [[DBG7:!dbg !.*]]
; CHECK-NEXT:    [[TMP1:%.*]] = alloca i8*, align 8, [[DBG7]]
; CHECK-NEXT:    [[NUM_DEPS:%.*]] = alloca i64, align 8, [[DBG7]]
; CHECK-NEXT:    br label [[FINAL_COND:%.*]], [[DBG7]]
; CHECK:       codeRepl:
; CHECK-NEXT:    [[TMP2:%.*]] = bitcast %nanos6_task_args_foo0** [[TMP0]] to i8**, [[DBG7]]
; CHECK-NEXT:    store i64 0, i64* [[NUM_DEPS]], align 8, [[DBG7]]
; CHECK-NEXT:    [[TMP3:%.*]] = load i64, i64* [[NUM_DEPS]], align 8, [[DBG7]]
; CHECK-NEXT:    call void @nanos6_create_task(%nanos6_task_info_t* @task_info_var_foo0, %nanos6_task_invocation_info_t* @task_invocation_info_foo0, i64 0, i8** [[TMP2]], i8** [[TMP1]], i64 2, i64 [[TMP3]]), [[DBG7]]
; CHECK-NEXT:    [[TMP4:%.*]] = load %nanos6_task_args_foo0*, %nanos6_task_args_foo0** [[TMP0]], align 8, [[DBG7]]
; CHECK-NEXT:    [[TMP5:%.*]] = bitcast %nanos6_task_args_foo0* [[TMP4]] to i8*, [[DBG7]]
; CHECK-NEXT:    [[ARGS_END:%.*]] = getelementptr i8, i8* [[TMP5]], i64 0, [[DBG7]]
; CHECK-NEXT:    [[TMP6:%.*]] = load i8*, i8** [[TMP1]], align 8, [[DBG7]]
; CHECK-NEXT:    call void @nanos6_submit_task(i8* [[TMP6]]), [[DBG7]]
; CHECK-NEXT:    br label [[FINAL_END:%.*]], [[DBG7]]
; CHECK:       final.end:
; CHECK-NEXT:    ret void, [[DBG8:!dbg !.*]]
; CHECK:       final.then:
; CHECK-NEXT:    br label [[FINAL_END]], [[DBG8]]
; CHECK:       final.cond:
; CHECK-NEXT:    [[TMP7:%.*]] = call i32 @nanos6_in_final(), [[DBG7]]
; CHECK-NEXT:    [[TMP8:%.*]] = icmp ne i32 [[TMP7]], 0, [[DBG7]]
; CHECK-NEXT:    br i1 [[TMP8]], label [[FINAL_THEN:%.*]], label [[CODEREPL:%.*]], [[DBG7]]
;
entry:
  %0 = call token @llvm.directive.region.entry() [ "DIR.OSS"([5 x i8] c"TASK\00"), "QUAL.OSS.IF"(i1 false) ], !dbg !9
  call void @llvm.directive.region.exit(token %0), !dbg !10
  ret void, !dbg !11
}

declare token @llvm.directive.region.entry()
declare void @llvm.directive.region.exit(token)

!llvm.module.flags = !{!3, !4}

!0 = distinct !DICompileUnit(language: DW_LANG_C99, file: !1, producer: "human", isOptimized: false, runtimeVersion: 0, emissionKind: NoDebug, enums: !2, nameTableKind: None)
!1 = !DIFile(filename: "task_if.c", directory: "")
!2 = !{}
!3 = !{i32 2, !"Debug Info Version", i32 3}
!4 = !{i32 1, !"wchar_size", i32 4}
!6 = distinct !DISubprogram(name: "foo", scope: !7, file: !7, line: 1, type: !8, scopeLine: 1, spFlags: DISPFlagDefinition, unit: !0, retainedNodes: !2)
!7 = !DIFile(filename: "task_if.c", directory: "")
!8 = !DISubroutineType(types: !2)
!9 = !DILocation(line: 2, scope: !6)
!10 = !DILocation(line: 3, scope: !6)
!11 = !DILocation(line: 4, scope: !6)
