$------------------------------------------------------------
PHYSICAL_PROBLEM
$------------------------------------------------------------ 
PROBLEM_DEFINITION       
  TEMPORAL_DERIVATIVES:     On 
  CONVECTIVE_TERM:          On
  VISCOUS_TERM:             LAPLACIAN
END_PROBLEM_DEFINITION  
$------------------------------------------------------------
END_PHYSICAL_PROBLEM  
$------------------------------------------------------------
NUMERICAL_TREATMENT 
  ELEMENT_LENGTH:           Minimum
  STABILIZATION:            ASGS
  TRACKING:                 TIME
  TIME_INTEGRATION:         Trapezoidal, ORDER= 1, EULER=20
  SAFETY_FACTOR=            100.0
  STEADY_STATE_TOLER=       1.0e-10

  MAXIMUM_NUMBER_OF_IT=     1           $ Navier-Stokes iterations
  CONVERGENCE_TOLERANCE=    1.0e-3      $ useless if MAXIMUM_NUMBER_OF_IT=1

  ALGORITHM:                SCHUR
    SOLVER: ORTHOMIN, CONTINUITY_PRESERVING
    PRECONDITION: DT
  END_ALGORITHM

  MOMENTUM
    ALGEBRAIC_SOLVER     
      SOLVER:                GMRES, KRYLOV=10
      CONVERGENCE:           ITERA=1000, TOLER=1.0e-12, ADAPTIVE, RATIO=0.01
      OUTPUT:                CONVERGENCE
      PRECONDITIONER:        DIAGONAL
    END_ALGEBRAIC_SOLVER        
  END_MOMENTUM

  CONTINUITY 
    ALGEBRAIC_SOLVER
       SOLVER:               DEFLATED_CG, COARSE: SPARSE
       CONVERGENCE:          ITERA=1000, TOLER=1.0e-12, ADAPTIVE, RATIO=0.01
       OUTPUT:               CONVERGENCE
       PRECONDITIONER:       DIAGONAL
    END_ALGEBRAIC_SOLVER        
  END_CONTINUITY

END_NUMERICAL_TREATMENT  
$------------------------------------------------------------
OUTPUT_&_POST_PROCESS
  START_POSTPROCES_AT        STEP  = 0
  POSTPROCESS VELOCITY,      STEPS = 1
  POSTPROCESS PRESSURE,      STEPS = 1
  POSTPROCESS MEAN_PRESSURE, STEPS = 1
  BOUNDARY_SET
    FORCE
    TORQUE, CENTER=0,0,0
    MASS
    MEAN_PRESSURE
  END_BOUNDARY_SET
END_OUTPUT_&_POST_PROCESS
$------------------------------------------------------------
BOUNDARY_CONDITIONS
  PARAMETERS
    VARIATION:         NON_CONSTANT
    INITIAL: COARSE
$    INITIAL: CONSTANT, VALUE=0.0,10.0,0.0
  END_PARAMETERS 
  CODES, NODES
        1  11  1.000000  0.000000, SPACE_TIME_FUNCTION=INFLOW
        2  00  0.000000  0.000000       $ outlet
        3  11  0.000000  0.000000       $ wall
    1 & 3  11  1.000000  0.000000, SPACE_TIME_FUNCTION=INFLOW
    2 & 3  11  0.000000  0.000000
  END_CODES
END_BOUNDARY_CONDITIONS  
$------------------------------------------------------------
