1	741166	809683	NA18976	deletion	4	 1
1	741166	809683	NA18990	duplication	4	 3
1	894235	1019933	NA18965	deletion	65	 1
1	894548	906803	NA12234	deletion	18	 1
1	970591	979826	NA11881	duplication	8	 3
1	977319	1019768	NA12234	deletion	26	 1
1	1219355	1233502	NA11830	duplication	22	 3
1	1221215	1233835	NA12003	duplication	22	 3
1	1221215	1245265	NA18508	deletion	35	 1
1	1221215	1250392	NA18965	deletion	48	 1
1	1256365	1290734	NA18508	deletion	30	 1
1	1259915	1278163	NA11881	duplication	21	 3
1	1262582	1323262	NA18965	deletion	35	 1
1	1389653	1459401	NA18965	deletion	34	 1
1	1394516	1421249	NA19171	deletion	13	 1
1	1509838	1565935	NA11830	duplication	18	 3
1	1509838	1565935	NA12003	duplication	18	 4
1	1576382	1577927	NA12043	deletion	3	 1
1	1580435	1588939	NA19204	duplication	8	 3
1	1606847	1608157	NA12234	deletion	3	 1
1	1606847	1669943	NA18994	duplication	36	 3
1	3389598	3440868	NA18965	deletion	38	 1
1	3410249	3422855	NA07056	deletion	16	 1
1	11097689	11105650	NA19153	deletion	5	 1
1	13108819	13331003	NA12815	deletion	21	 1
1	13140416	13183911	NA19204	deletion	11	 1
1	13172100	13217268	NA19141	deletion	8	 1
1	13379125	13475275	NA12154	deletion	16	 1
1	15447151	15478909	NA12750	deletion	4	 OTHER
1	15447151	15478909	NA19137	deletion	4	 OTHER
1	15793837	15812588	NA18981	deletion	8	 1
1	16349105	16362851	NA19222	deletion	21	 1
1	16350239	16366566	NA19159	duplication	22	 3
1	16354298	16361992	NA18508	duplication	13	 3
1	16363197	16386574	NA12144	duplication	24	 3
1	16366447	16386109	NA12815	duplication	22	 3
1	17007485	17249345	NA11992	duplication	21	 3
1	19600462	19612892	NA19209	deletion	7	 1
1	21751055	21754363	NA11831	deletion	5	 1
1	21805808	21809937	NA12144	duplication	6	 3
1	22149775	22182211	NA18965	deletion	44	 1
1	25712119	25725728	NA19098	duplication	5	 3
1	25712119	25725728	NA19099	duplication	5	 3
1	26211186	26211805	NA19137	deletion	3	 OTHER
1	32124480	32163819	NA18980	duplication	55	 3
1	32126634	32163819	NA12813	duplication	53	 3
1	65849823	65855329	NA19201	duplication	6	 3
1	87099936	87101832	NA18975	deletion	3	 1
1	87597770	87598599	NA12750	deletion	4	 OTHER
1	87597770	87598599	NA19137	deletion	4	 OTHER
1	89270146	89299149	NA18998	duplication	14	 3
1	109369786	109369935	NA18970	deletion	1	 0
1	109428126	109457054	NA12814	deletion	10	 1
1	110203772	110203891	NA19119	deletion	1	 0
1	115399815	115537691	NA18997	duplication	29	 3
1	120539273	120548261	NA19209	duplication	3	 3
1	120539273	120572629	NA19210	duplication	4	 3
1	142813055	142813317	NA19138	deletion	2	 1
1	143209446	143223569	NA18967	deletion	3	 1
1	143209446	143364923	NA19119	deletion	4	 1
1	143364803	143721103	NA19201	deletion	2	 0
1	143905955	143906194	NA18998	deletion	1	 0
1	144220094	144220993	NA18991	duplication	3	 3
1	144615098	144679990	NA12144	deletion	10	 1
1	144621432	144813853	NA19209	duplication	7	 3
1	144823899	144825152	NA11840	deletion	3	 1
1	145311872	145360761	NA19131	deletion	36	 1
1	145312644	145360761	NA12763	duplication	35	 3
1	147594988	148025872	NA12750	deletion	35	 0
1	147851206	147851698	NA19137	deletion	2	 OTHER
1	147954797	148202393	NA12812	deletion	27	 1
1	148876229	149459607	NA18976	duplication	25	 3
1	148891516	149459607	NA11840	deletion	19	 0
1	149755506	149755866	NA12874	deletion	1	 0
1	151336950	151403349	NA18998	duplication	33	 3
1	152538335	152586610	NA11992	deletion	4	 1
1	155184152	155203208	NA19159	duplication	10	 3
1	155184152	155203719	NA19171	duplication	11	 OTHER
1	161561392	161645134	NA18508	duplication	21	 3
1	196794584	196913099	NA11840	duplication	15	 3
1	196963178	196974001	NA19200	deletion	6	 1
1	207700066	207715965	NA19200	deletion	8	 1
1	207737177	207743301	NA19204	duplication	6	 4
1	221507179	221509429	NA19137	deletion	2	 OTHER
1	228333210	228431201	NA18965	deletion	22	 1
1	228557599	228588929	NA18965	deletion	19	 1
1	244227917	244228404	NA19137	deletion	2	 OTHER
1	248604480	248617127	NA19204	deletion	2	 1
1	248604480	248652852	NA18966	duplication	4	 3
2	271813	287660	NA18987	duplication	11	 3
2	8437278	8464762	NA12750	deletion	4	 OTHER
2	8437278	8464762	NA19137	deletion	4	 OTHER
2	11245727	11268925	NA19137	deletion	4	 OTHER
2	38407690	38408117	NA19137	deletion	2	 OTHER
2	55910885	55920997	NA19204	duplication	6	 3
2	55912071	55920997	NA19098	duplication	5	 3
2	69692558	69693207	NA12750	deletion	3	 OTHER
2	69692558	69693207	NA19137	deletion	3	 OTHER
2	75879207	75916371	NA18956	duplication	12	 3
2	87140949	87259378	NA12003	duplication	37	 3
2	87238291	87271151	NA10847	deletion	11	 1
2	87238291	87271151	NA18990	duplication	11	 4
2	87347997	87390172	NA07000	duplication	16	 3
2	87355663	87566187	NA18965	duplication	32	 3
2	87359047	88007475	NA12044	duplication	33	 3
2	87373695	88019553	NA11831	deletion	30	 1
2	87415963	88019553	NA12043	duplication	11	 3
2	88019314	88083894	NA19201	deletion	16	 1
2	88037185	88058290	NA12249	deletion	8	 1
2	88071666	88083894	NA19119	deletion	4	 1
2	88091473	88272887	NA12751	duplication	18	 4
2	88091473	88280330	NA12716	duplication	19	 3
2	89102307	89340048	NA19209	duplication	17	 3
2	89521154	89619711	NA19209	deletion	11	 1
2	89596989	89619888	NA19119	deletion	4	 1
2	91893836	92119787	NA12762	duplication	22	 3
2	96259737	96262184	NA11831	deletion	3	 1
2	97746793	97855051	NA19201	duplication	24	 3
2	98018743	98162369	NA19201	duplication	24	 3
2	98127578	98167988	NA18965	duplication	23	 3
2	98127578	98275997	NA12005	duplication	50	 3
2	98139740	98167988	NA18998	deletion	20	 0
2	98169607	98171762	NA18976	deletion	4	 1
2	107029518	107042558	NA19153	duplication	5	 3
2	107052838	107087443	NA07000	deletion	11	 1
2	108484171	108499351	NA19153	deletion	6	 1
2	108486323	108499351	NA19143	deletion	5	 1
2	108487133	108499351	NA19099	deletion	4	 1
2	109288721	109293167	NA12156	deletion	4	 1
2	110881324	110936181	NA18966	duplication	17	 3
2	113127712	113150808	NA12760	deletion	7	 1
2	113148539	113179733	NA19153	duplication	17	 3
2	113150688	113175496	NA19200	deletion	15	 0
2	113157175	113175496	NA19201	deletion	10	 1
2	114251308	114320913	NA18991	deletion	6	 1
2	114251308	114340763	NA19210	duplication	7	 3
2	114353682	114386297	NA10847	deletion	8	 1
2	130831761	130843470	NA11881	deletion	3	 1
2	130831761	130843470	NA19143	duplication	3	 3
2	130834594	130851106	NA19207	deletion	5	 1
2	130843350	130851106	NA19210	duplication	4	 OTHER
2	130858211	130868304	NA19141	deletion	4	 1
2	130900774	130953952	NA18976	duplication	28	 3
2	131096659	131130823	NA18976	duplication	28	 3
2	131220333	131279736	NA19131	deletion	18	 1
2	131223165	131266714	NA19152	duplication	14	 3
2	131975936	131981649	NA19152	deletion	3	 1
2	131975936	131995849	NA18976	duplication	8	 3
2	131988384	132019479	NA19209	duplication	9	 3
2	132010589	132384895	NA18976	duplication	47	 3
2	179518351	179519276	NA19171	duplication	5	 3
2	179526872	179528094	NA19153	deletion	6	 1
2	183616329	183627588	NA12815	deletion	8	 1
2	231222481	231222720	NA18967	deletion	1	 1
2	233198474	233348941	NA18965	deletion	45	 1
2	233272521	233310403	NA12234	deletion	8	 1
2	239005420	239051625	NA18508	deletion	13	 1
2	239005420	239059760	NA18965	deletion	18	 1
2	241512495	241538142	NA18965	deletion	20	 1
2	241569325	241663482	NA18965	deletion	16	 1
2	241808245	242012789	NA18965	deletion	44	 1
3	14958738	14974715	NA12760	duplication	9	 3
3	48602165	48630409	NA12813	duplication	73	 3
3	48602826	48627211	NA18980	duplication	69	 3
3	48602826	48632010	NA19222	deletion	75	 1
3	70664306	70664763	NA19137	deletion	2	 OTHER
3	75440864	75680021	NA11831	deletion	10	 1
3	75440864	75680021	NA12716	deletion	10	 1
3	123694187	123694426	NA18505	deletion	1	 0
3	141884418	142084220	NA12144	duplication	32	 3
3	151531900	151546021	NA11829	deletion	5	 1
3	197803774	197847604	NA19210	deletion	6	 0
3	197804046	197847604	NA19098	deletion	5	 0
4	949461	1019213	NA18508	deletion	46	 1
4	951588	1019213	NA11830	duplication	45	 3
4	951588	1019213	NA12003	duplication	45	 3
4	3441147	3475367	NA11830	duplication	16	 3
4	9024981	9177952	NA19141	duplication	6	 4
4	9174841	9251871	NA12751	duplication	31	 OTHER
4	9232643	9251871	NA18972	duplication	14	 OTHER
4	27209216	27209706	NA19137	deletion	2	 OTHER
4	48988408	48994149	NA18998	deletion	4	 1
4	53609997	53611687	NA12750	deletion	8	 OTHER
4	53609997	53611687	NA19137	deletion	8	 OTHER
4	69403303	69520916	NA19160	deletion	9	 1
4	69512782	69520916	NA11994	deletion	3	 1
4	70261358	70276761	NA19131	deletion	6	 1
4	75314705	75480928	NA18508	deletion	4	 0
4	79187979	79207745	NA18978	duplication	7	 3
4	89022337	89061165	NA12234	duplication	10	 3
4	144917395	144940481	NA19207	deletion	6	 1
4	144917395	144940481	NA19223	deletion	6	 1
5	251398	304373	NA12156	deletion	6	 1
5	251398	304373	NA19099	duplication	6	 3
5	653066	770252	NA18965	deletion	15	 1
5	1598204	1598423	NA18967	deletion	1	 0
5	23509117	23518074	NA19098	deletion	4	 1
5	54415634	54416435	NA19207	deletion	2	 1
5	68840719	68868384	NA06994	duplication	11	 3
5	68840719	68878284	NA11994	deletion	15	 1
5	68878165	68903098	NA18987	duplication	7	 4
5	69337352	69716196	NA12763	duplication	20	 3
5	69372313	69733449	NA12043	duplication	22	 3
5	69716077	69743240	NA18968	deletion	15	 1
5	70248213	70308758	NA12763	duplication	15	 3
5	70307092	70389066	NA07056	duplication	24	 OTHER
5	70307092	70389066	NA18968	deletion	24	 1
5	70308159	70389066	NA11840	deletion	23	 1
5	96248302	96253327	NA18998	deletion	4	 1
5	140537107	140560028	NA12144	duplication	3	 3
5	175386934	175516583	NA19098	duplication	9	 4
5	175388044	175520297	NA19099	duplication	10	 3
5	175516435	175528659	NA11830	deletion	10	 1
5	175523805	175541065	NA19098	duplication	15	 3
5	177151101	177180252	NA19141	duplication	21	 3
5	177151101	177310869	NA19098	deletion	27	 0
5	177158495	177305867	NA12750	deletion	19	 1
5	177468669	177474135	NA19098	duplication	5	 3
5	178540857	178563096	NA19143	duplication	10	 3
5	180375305	180431808	NA12763	duplication	12	 3
6	292490	350904	NA12005	deletion	8	 1
6	292490	350904	NA18956	deletion	8	 1
6	29857063	29913289	NA18976	duplication	8	 3
6	31378813	31431884	NA18969	deletion	3	 1
6	31378813	31431884	NA19201	deletion	3	 1
6	31994225	31996331	NA18991	duplication	8	 3
6	32006201	32010661	NA12156	duplication	14	 3
6	32006798	32007433	NA12144	deletion	3	 1
6	32007762	32009989	NA18976	duplication	6	 3
6	32007762	32020785	NA18965	deletion	20	 1
6	32411460	32489996	NA12874	duplication	7	 4
6	32485463	32634389	NA11830	deletion	22	 1
6	32548518	32632889	NA18981	deletion	12	 1
6	33132625	33147295	NA19222	deletion	49	 1
6	35543606	35565222	NA19200	duplication	6	 3
6	167786603	167794836	NA12005	deletion	6	 1
6	168343782	168476029	NA12815	duplication	32	 3
6	168343782	168479787	NA06985	duplication	33	 3
6	168343782	168479787	NA12249	duplication	33	 3
6	170190141	170201416	NA12750	deletion	4	 OTHER
6	170190141	170201416	NA19137	deletion	4	 OTHER
7	1015045	1098192	NA11830	duplication	14	 3
7	1477675	1538238	NA18965	deletion	49	 1
7	1498771	1533588	NA11830	duplication	34	 3
7	1498771	1543647	NA12003	duplication	47	 3
7	2564293	2581859	NA18965	deletion	16	 1
7	4798615	4841634	NA11830	duplication	25	 3
7	6781280	6791071	NA19204	duplication	4	 3
7	6781280	6799951	NA12812	deletion	7	 1
7	7398230	7421268	NA19099	deletion	7	 1
7	38284748	38293065	NA12760	duplication	3	 3
7	38393291	38398618	NA19143	deletion	4	 1
7	38398088	38402967	NA19153	deletion	4	 1
7	57007993	57076756	NA18956	deletion	9	 0
7	57071088	57128353	NA18505	duplication	7	 4
7	62904540	63033891	NA19171	deletion	14	 1
7	64613336	65084117	NA11840	deletion	23	 1
7	65546767	65557946	NA19209	duplication	15	 3
7	72040474	72304546	NA18969	duplication	16	 3
7	72411324	72436729	NA19171	duplication	15	 3
7	72416066	72522924	NA18971	deletion	42	 1
7	72416665	72430787	NA18994	deletion	10	 1
7	72606506	72685718	NA18971	deletion	37	 1
7	72643542	72708935	NA18994	deletion	23	 1
7	72682977	72712494	NA19159	deletion	11	 1
7	72707483	72712494	NA18971	deletion	7	 1
7	74159069	74195213	NA18995	duplication	19	 3
7	74301079	74422285	NA07000	deletion	15	 1
7	74310181	74422285	NA11830	deletion	12	 0
7	74312517	74328258	NA19201	duplication	8	 3
7	74422166	74466920	NA11832	deletion	4	 1
7	74466801	74524866	NA12144	deletion	11	 1
7	74563498	74582544	NA11831	duplication	9	 3
7	74563498	74608719	NA12814	duplication	18	 3
7	74699699	74914083	NA19138	deletion	22	 1
7	74765930	74942102	NA12750	deletion	25	 3
7	74970007	74991396	NA18968	deletion	10	 1
7	74970007	74994932	NA12760	deletion	13	 0
7	75034117	75046023	NA19098	duplication	10	 3
7	75034117	75046023	NA19209	duplication	10	 3
7	76109781	76241144	NA19005	duplication	25	 3
7	76121460	76610617	NA12005	duplication	29	 3
7	76239306	76641386	NA11992	deletion	18	 1
7	76247439	76624961	NA19138	duplication	8	 3
7	76619576	76641386	NA12249	duplication	9	 3
7	76619576	76643603	NA18975	duplication	11	 3
7	76671303	76797183	NA19171	deletion	9	 1
7	96113172	96125641	NA19137	deletion	4	 OTHER
7	99909362	99912398	NA19131	deletion	3	 1
7	102112859	102116732	NA18981	deletion	6	 1
7	104766651	105149000	NA12814	duplication	32	 3
7	132409730	132412601	NA19137	deletion	3	 OTHER
7	141755322	141780787	NA18990	duplication	23	 3
7	141759216	141781925	NA12156	duplication	20	 3
7	141760082	141786132	NA12814	duplication	23	 3
7	142378573	142471836	NA12154	deletion	14	 1
7	142457296	142479988	NA12812	deletion	7	 1
7	142479869	142495008	NA12716	deletion	5	 0
7	143452385	143560929	NA19200	deletion	14	 1
7	144015204	144074307	NA18978	deletion	13	 1
7	149477014	149489597	NA18965	deletion	26	 1
7	149557448	149606826	NA18976	duplication	9	 3
7	151164161	151168722	NA18987	duplication	4	 3
8	116075	163645	NA11840	deletion	3	 1
8	116075	408579	NA19209	duplication	15	 3
8	11929168	12041224	NA19171	deletion	16	 1
8	15397889	15621779	NA12234	deletion	13	 1
8	49503110	49504353	NA19137	deletion	3	 OTHER
8	142445168	142490554	NA18965	deletion	21	 1
8	144416851	144512114	NA12874	deletion	17	 1
8	144416851	144512576	NA18508	deletion	19	 1
8	144641923	144688862	NA18965	deletion	45	 1
8	144800890	144904095	NA18965	deletion	54	 1
8	144899737	145052004	NA18508	deletion	58	 1
8	144911402	145052281	NA12003	duplication	51	 3
8	144990528	145114969	NA18965	deletion	76	 1
8	145003240	145058046	NA18956	deletion	33	 1
8	145106180	145133836	NA12234	deletion	24	 1
8	145438608	145479682	NA19005	deletion	14	 0
8	145479443	145479682	NA12812	deletion	1	 0
8	145608237	145652369	NA18965	deletion	54	 1
8	145624655	145650211	NA12003	duplication	23	 3
8	145693691	145730883	NA12234	deletion	21	 1
8	145693691	145750143	NA18965	deletion	52	 1
8	145722527	145735417	NA18508	deletion	17	 1
8	145724128	145746213	NA12003	duplication	37	 3
9	52414	179012	NA12044	duplication	17	 3
9	116710	146190	NA19210	deletion	7	 1
9	116710	152116	NA18991	duplication	8	 3
9	173258	179012	NA06985	deletion	3	 1
9	21201580	21207111	NA19131	deletion	2	 1
9	39078682	39088651	NA19141	deletion	4	 1
9	39238967	39357845	NA19160	duplication	7	 4
9	39238967	39361858	NA19119	deletion	8	 1
9	39886574	39891109	NA19223	deletion	3	 1
9	39887270	40028800	NA18973	duplication	5	 4
9	39887270	40028800	NA18981	deletion	5	 1
9	39887270	40028800	NA19209	deletion	5	 1
9	40292985	40503231	NA12814	duplication	15	 3
9	40292985	40784659	NA19005	duplication	30	 3
9	40701679	40789331	NA12814	duplication	10	 3
9	41306142	41606761	NA19207	duplication	23	 OTHER
9	41311432	41506824	NA19171	deletion	15	 0
9	41502691	41602080	NA19210	duplication	8	 OTHER
9	42368396	42419150	NA19138	duplication	16	 3
9	42368396	42419150	NA19159	deletion	16	 1
9	42371922	42419150	NA19200	duplication	15	 4
9	43082752	43129673	NA12763	duplication	14	 4
9	43095066	43628430	NA12249	deletion	18	 1
9	44100041	44109486	NA19204	duplication	3	 3
9	45376600	45424522	NA12249	deletion	4	 1
9	67272211	67334183	NA18970	deletion	9	 1
9	67273054	67934836	NA18998	deletion	12	 1
9	68778871	68809794	NA19200	deletion	5	 1
9	69416110	69719913	NA19153	deletion	14	 1
9	69423149	70214902	NA19209	duplication	28	 4
9	70086380	70206265	NA19171	duplication	11	 4
9	70144089	70214902	NA19159	deletion	12	 1
9	70483174	70862637	NA12763	duplication	9	 3
9	70889766	70914064	NA18975	deletion	5	 1
9	72046189	72047641	NA19138	duplication	2	 4
9	72046189	72047641	NA19201	duplication	2	 3
9	86464993	86593198	NA12872	duplication	35	 3
9	115407896	115567271	NA19204	duplication	8	 3
9	115407896	115580099	NA19209	duplication	9	 3
9	115407896	115580099	NA19210	duplication	9	 3
9	117085903	117092301	NA18998	duplication	6	 4
9	117092674	117093166	NA12005	deletion	2	 1
9	134305529	134406072	NA18967	duplication	57	 3
9	135937358	135946066	NA18998	duplication	9	 3
9	136131038	136133564	NA19152	deletion	3	 1
9	136307438	136340747	NA18965	deletion	23	 1
9	139228865	139266558	NA12234	deletion	27	 1
9	139231334	139278178	NA18508	deletion	34	 1
9	139258913	139278178	NA18965	deletion	19	 1
9	139390487	139572061	NA12234	deletion	48	 1
9	139390487	139616486	NA18508	deletion	52	 1
9	139393488	139618239	NA18965	deletion	52	 1
9	139730186	139756987	NA18965	deletion	39	 1
9	139734905	139753774	NA12003	duplication	28	 3
9	139889092	139912535	NA12003	duplication	35	 3
9	139902339	139918350	NA18508	deletion	41	 1
9	139906263	139943330	NA12234	deletion	47	 1
9	139914718	139959431	NA18965	deletion	34	 1
9	140055459	140083737	NA12003	duplication	29	 3
9	140166953	140332794	NA18508	deletion	46	 1
9	140201379	140332794	NA18965	deletion	42	 1
9	140289722	140343954	NA12234	deletion	23	 1
9	140347420	140400544	NA18965	deletion	31	 1
9	141000145	141069929	NA12814	duplication	10	 3
10	18087550	18199448	NA11840	deletion	32	 0
10	29578043	29580973	NA19152	deletion	2	 1
10	46193479	46201944	NA19131	deletion	3	 1
10	46194162	46201944	NA19209	deletion	2	 1
10	46201824	46342803	NA19210	duplication	46	 3
10	46242012	46248716	NA19207	deletion	6	 1
10	46246906	46254865	NA18505	deletion	7	 1
10	46254746	46258946	NA18971	deletion	2	 0
10	46671572	46918716	NA19200	deletion	19	 1
10	46671572	46928016	NA19153	deletion	20	 1
10	46918266	47158926	NA07056	duplication	16	 4
10	46927897	47158926	NA12762	duplication	14	 3
10	47158807	47169892	NA18505	deletion	11	 1
10	47158807	47169892	NA19099	duplication	11	 4
10	48029163	48237096	NA19207	deletion	15	 0
10	48032925	48236293	NA19152	duplication	13	 4
10	48048838	48236293	NA19141	deletion	11	 1
10	48739359	48950998	NA19152	deletion	29	 1
10	48917107	48964951	NA18971	deletion	7	 1
10	49199668	49381182	NA12874	deletion	25	 1
10	49259620	49327418	NA06994	duplication	10	 3
10	49313196	49383995	NA19222	deletion	12	 1
10	51748468	51769988	NA19210	duplication	7	 3
10	88985539	88990860	NA19223	duplication	3	 3
10	102222900	102269268	NA06994	duplication	29	 3
10	124340337	124356615	NA18990	duplication	14	 3
10	124359535	124362690	NA18971	deletion	4	 1
10	124361295	124377874	NA19131	deletion	13	 1
10	134742958	134755280	NA12154	duplication	7	 4
10	134912086	135013981	NA18508	deletion	20	 1
10	135340838	135373687	NA18505	duplication	20	 3
10	135340838	135373687	NA19204	duplication	20	 3
10	135345014	135439155	NA12234	duplication	19	 3
10	135350541	135473191	NA19171	duplication	19	 3
11	373011	404339	NA18965	deletion	27	 1
11	487355	563661	NA18965	deletion	46	 1
11	490351	557145	NA12234	deletion	30	 1
11	494848	552280	NA18508	deletion	19	 1
11	597363	626802	NA18965	deletion	36	 1
11	788112	810415	NA12234	deletion	19	 1
11	1019266	1087642	NA18965	deletion	52	 1
11	1213988	1261356	NA12750	duplication	47	 4
11	1244329	1279440	NA18965	deletion	47	 1
11	1248898	1260851	NA11830	duplication	21	 3
11	1266387	1269832	NA19210	deletion	2	 1
11	2181035	2439848	NA18965	deletion	55	 1
11	5270589	5275972	NA19223	duplication	5	 3
11	5270929	5275972	NA18991	duplication	4	 3
11	5443428	5475667	NA18966	deletion	3	 1
11	35198055	35240958	NA19207	deletion	15	 1
11	48327760	48328719	NA19152	deletion	1	 1
11	48442051	48511289	NA12716	deletion	4	 1
11	55432628	55595642	NA19209	deletion	6	 1
11	59620389	59626764	NA18981	deletion	5	 1
11	60388528	60416760	NA19137	deletion	3	 OTHER
11	61015829	61018798	NA19206	deletion	4	 1
11	64645465	64681748	NA18965	deletion	36	 1
11	66618060	66639682	NA18965	deletion	16	 1
11	67048520	67077458	NA18965	deletion	34	 1
11	67200378	67275572	NA18965	deletion	60	 1
11	67258212	67265818	NA07056	deletion	14	 1
11	67559744	67700740	NA18967	deletion	5	 1
11	67559744	67700740	NA18987	deletion	5	 1
11	67786182	67818306	NA18965	deletion	27	 1
11	85431862	85468777	NA12761	deletion	9	 1
12	9571329	9590102	NA18966	duplication	20	 3
12	10571605	10586585	NA19210	duplication	7	 3
12	11138500	11139489	NA19119	deletion	1	 1
12	11505985	11546904	NA11992	duplication	5	 3
12	31256230	31359132	NA12750	duplication	32	 3
12	31267653	31359132	NA12763	duplication	30	 3
12	31267653	31359132	NA19119	duplication	30	 3
12	33529741	34179863	NA07357	duplication	10	 3
12	57584570	57604701	NA18965	deletion	36	 1
12	63954247	64062184	NA11840	duplication	22	 3
12	123461168	123482175	NA18965	deletion	22	 1
12	124114700	124192265	NA12762	duplication	33	 3
12	132322656	132405968	NA18965	deletion	35	 1
13	24463265	24468369	NA19209	deletion	3	 1
13	24465364	24468369	NA12155	deletion	2	 1
13	51580949	51608240	NA12750	deletion	12	 3
14	19377544	19559197	NA11832	duplication	7	 3
14	19377544	19559197	NA19206	duplication	7	 3
14	21359787	21360386	NA19144	deletion	1	 1
14	22928059	22984693	NA12750	duplication	42	 3
14	24429072	24459599	NA19138	deletion	8	 1
14	73712314	73731484	NA18965	deletion	19	 1
14	74004114	74042274	NA18507	deletion	6	 1
14	74008178	74042274	NA19210	duplication	5	 3
14	74422123	74426231	NA19209	deletion	6	 1
14	88401029	88420256	NA06994	duplication	10	 3
14	88401029	88420256	NA11840	deletion	10	 1
14	88401029	88420256	NA12716	deletion	10	 1
14	104563873	104640243	NA18965	deletion	23	 1
14	105609009	105618079	NA11830	duplication	18	 3
14	105930986	106053710	NA12003	duplication	25	 3
14	107178795	107183734	NA18987	deletion	3	 1
15	20169887	20170391	NA18976	deletion	2	 1
15	20169887	20636536	NA19159	deletion	11	 1
15	22705288	22739640	NA06994	duplication	15	 3
15	22833478	23335572	NA18507	deletion	100	 1
15	25472237	25477634	NA19131	deletion	4	 1
15	25472237	25477634	NA19141	deletion	4	 1
15	25472237	25477634	NA19143	deletion	4	 1
15	28475460	28475684	NA19141	deletion	1	 1
15	28771362	28882798	NA19143	duplication	18	 3
15	30381851	30406218	NA18971	deletion	5	 1
15	30381851	31042804	NA18973	deletion	34	 1
15	30654455	30878197	NA11992	deletion	16	 1
15	30902917	31042804	NA18981	deletion	12	 1
15	30905293	30936949	NA11830	deletion	10	 1
15	30918968	31092848	NA18972	deletion	11	 1
15	32455422	32738780	NA19207	deletion	6	 1
15	34659185	34674096	NA06985	duplication	3	 OTHER
15	34673593	34820317	NA19144	deletion	20	 1
15	34673860	34678019	NA12763	duplication	11	 3
15	34675941	34824240	NA18968	deletion	24	 1
15	34781816	34825224	NA19209	deletion	15	 1
15	43864961	43873625	NA18969	duplication	15	 3
15	43870251	43873625	NA19210	duplication	4	 3
15	43870251	43891207	NA18987	deletion	18	 1
15	43888045	43941397	NA12716	deletion	48	 1
15	43888388	43904250	NA06994	duplication	24	 3
15	43922855	43941397	NA18971	duplication	13	 3
15	43922855	43941397	NA19138	deletion	13	 1
15	43969617	43988339	NA12763	duplication	16	 3
15	43970779	43975574	NA12716	deletion	8	 1
15	43987877	44004917	NA06994	deletion	27	 1
15	45248889	45270876	NA19200	duplication	7	 3
15	48623673	48634306	NA11829	duplication	7	 3
15	49659575	49663607	NA18971	deletion	2	 1
15	56676130	56757228	NA18507	deletion	19	 1
15	65677223	65677492	NA19223	deletion	1	 1
15	75585400	75656554	NA12813	duplication	37	 3
15	79227312	79231557	NA19131	deletion	4	 1
15	82932521	83041588	NA18981	deletion	24	 0
15	82933910	83041163	NA19119	duplication	21	 OTHER
15	84909430	85180647	NA19137	deletion	26	 3
15	85085377	85112930	NA12750	deletion	4	 OTHER
15	90627452	90775564	NA19209	duplication	28	 3
15	100341162	100345189	NA19143	deletion	2	 1
15	100514567	100594300	NA19141	duplication	7	 3
15	101523669	101569478	NA12815	duplication	18	 3
15	101775235	101983872	NA12815	duplication	40	 3
16	596782	640436	NA18956	deletion	25	 1
16	596782	781753	NA18965	deletion	153	 1
16	704938	718737	NA18508	deletion	27	 1
16	704938	719639	NA12003	duplication	28	 3
16	733825	772612	NA12003	duplication	24	 3
16	814597	845879	NA11830	duplication	45	 3
16	839165	943099	NA12750	duplication	31	 3
16	1245915	1269169	NA18508	deletion	31	 1
16	1265189	1308414	NA18965	deletion	24	 1
16	1384650	1396705	NA18508	deletion	24	 1
16	1384650	1576828	NA18965	deletion	117	 1
16	1388491	1395154	NA12234	deletion	18	 1
16	1401690	1497745	NA11830	duplication	29	 3
16	1811206	1843705	NA18965	deletion	42	 1
16	1813601	1859393	NA12003	duplication	39	 3
16	2128965	2161922	NA18965	deletion	41	 1
16	2129554	2168487	NA18508	deletion	50	 1
16	2156359	2169403	NA19137	deletion	17	 OTHER
16	2164129	2169403	NA12750	deletion	10	 OTHER
16	2202794	2240182	NA18965	deletion	40	 1
16	2233638	2240182	NA18508	deletion	13	 1
16	2256984	2294599	NA18965	deletion	33	 1
16	2510781	2579579	NA18965	deletion	27	 1
16	2688234	2712814	NA19137	deletion	10	 OTHER
16	2711367	2712814	NA12750	deletion	7	 OTHER
16	3106972	3119413	NA19141	duplication	12	 3
16	14818145	14859274	NA19138	deletion	14	 1
16	14818145	14859274	NA19201	deletion	14	 1
16	14818145	14859274	NA19209	duplication	14	 3
16	14951067	15029318	NA18508	deletion	42	 1
16	15044035	15123920	NA18969	deletion	22	 1
16	15044035	15123920	NA18975	deletion	22	 1
16	15082201	15123920	NA18987	duplication	19	 3
16	15199826	15204688	NA12751	deletion	5	 0
16	15199826	15231815	NA19138	duplication	31	 3
16	15201181	15232337	NA12750	duplication	31	 OTHER
16	16317214	16367951	NA19137	deletion	21	 0
16	16338918	16388210	NA19119	duplication	27	 3
16	16367535	16387615	NA18508	deletion	12	 0
16	16367535	16387615	NA19099	deletion	12	 0
16	16411299	16462600	NA19137	deletion	40	 OTHER
16	18430965	18470775	NA12760	deletion	30	 1
16	21391455	21416661	NA19152	duplication	9	 3
16	21414030	21416661	NA18966	deletion	5	 0
16	21415823	21422472	NA19159	deletion	5	 1
16	21475240	21561754	NA12716	deletion	15	 1
16	21475240	21561754	NA18966	deletion	15	 1
16	21475240	21561754	NA18971	deletion	15	 1
16	21544218	21747766	NA18976	duplication	37	 3
16	21763207	21809184	NA19200	deletion	6	 1
16	21810943	21848009	NA18976	duplication	15	 3
16	21847279	21896365	NA18971	deletion	12	 1
16	21896246	21897847	NA19131	deletion	2	 1
16	22444041	22588027	NA18966	deletion	49	 1
16	22480311	22588027	NA11840	deletion	40	 1
16	22539077	22580015	NA18971	deletion	18	 1
16	28606814	28712891	NA19222	deletion	12	 1
16	28711456	28782380	NA18969	duplication	28	 3
16	28711456	28782380	NA18975	deletion	28	 1
16	28734445	28777832	NA18970	deletion	17	 1
16	28763794	28783558	NA12763	duplication	7	 OTHER
16	29049949	29086458	NA19138	deletion	7	 0
16	29057321	29089310	NA19159	deletion	7	 0
16	29468897	29497201	NA18974	deletion	13	 1
16	29468897	29497201	NA19152	duplication	13	 3
16	29556577	29557597	NA19143	deletion	2	 0
16	30208239	30287530	NA19143	duplication	24	 4
16	30208239	30288786	NA18968	deletion	25	 1
16	32163748	32486826	NA11881	duplication	4	 3
16	33500510	33784363	NA18956	deletion	11	 1
16	33500510	33784363	NA18987	duplication	11	 3
16	33500749	33647871	NA18990	duplication	4	 3
16	47399680	47581461	NA18967	duplication	16	 3
16	58043805	58077308	NA19138	duplication	13	 3
16	69988147	69996984	NA18998	deletion	10	 1
16	70010551	70219893	NA18967	duplication	45	 3
16	70011715	70076346	NA18974	duplication	14	 3
16	70011715	70211443	NA18973	duplication	35	 3
16	70208124	70263837	NA18974	duplication	17	 3
16	70873932	70894159	NA19141	duplication	6	 3
16	72088494	72109140	NA18968	deletion	11	 1
16	72088494	72109140	NA18973	deletion	11	 1
16	74372410	74419669	NA12716	duplication	14	 3
16	81180891	81183514	NA18970	deletion	3	 1
16	88928010	89169209	NA18965	deletion	21	 1
16	89761015	89790132	NA18965	deletion	24	 1
16	90046667	90060244	NA12750	deletion	6	 OTHER
16	90046667	90060244	NA19137	deletion	6	 OTHER
17	15638640	15668117	NA18972	duplication	10	 3
17	15638640	15668117	NA19138	duplication	10	 4
17	16649162	16746262	NA18987	duplication	18	 3
17	18284759	18395875	NA12812	deletion	18	 1
17	18965257	19091586	NA18968	duplication	7	 3
17	18965257	19091586	NA19152	duplication	7	 3
17	20261179	20261422	NA18994	deletion	1	 0
17	20353239	20420456	NA12813	duplication	16	 3
17	36287108	36287770	NA18973	duplication	2	 OTHER
17	36287650	36412966	NA18972	deletion	35	 1
17	36351907	36412966	NA11831	deletion	12	 1
17	36351907	36412966	NA18997	duplication	12	 3
17	41342710	41355810	NA12874	deletion	12	 1
17	44379980	44771309	NA12763	duplication	42	 3
17	44590063	44772054	NA19159	duplication	29	 3
17	44630714	44772054	NA19206	deletion	18	 1
17	45055975	45127752	NA18991	duplication	4	 3
17	57656816	57665455	NA18994	deletion	4	 1
17	61972330	61973270	NA19207	deletion	1	 1
17	61972330	61973926	NA19210	deletion	3	 1
17	73554187	73571029	NA18965	deletion	22	 1
17	73732328	73759580	NA18965	deletion	30	 1
17	79077293	79207536	NA18965	deletion	61	 1
17	79093160	79164640	NA18956	deletion	24	 1
17	79104813	79155103	NA19137	deletion	10	 OTHER
17	79422235	79526483	NA18965	deletion	36	 1
17	79880467	80012709	NA18965	deletion	80	 1
17	80036950	80053391	NA12234	deletion	33	 1
17	80038236	80054377	NA18965	deletion	32	 1
17	80038563	80053391	NA18508	deletion	30	 1
18	683193	690649	NA18967	deletion	4	 1
18	14613240	14613959	NA19206	deletion	2	 1
18	34156401	34424277	NA18971	duplication	31	 3
18	44542699	44550338	NA12716	duplication	4	 OTHER
19	418872	580479	NA12750	duplication	39	 3
19	617209	633528	NA18965	deletion	20	 1
19	619526	652324	NA12234	deletion	25	 1
19	812567	871264	NA11830	duplication	30	 3
19	843424	932752	NA12003	duplication	44	 3
19	971813	1026763	NA11830	duplication	32	 3
19	990774	1026763	NA12003	duplication	27	 3
19	1003125	1052308	NA18965	deletion	46	 1
19	1062092	1084350	NA12003	duplication	24	 3
19	1073649	1105556	NA18965	deletion	26	 1
19	1111971	1124040	NA11830	duplication	18	 3
19	1147304	1257312	NA18965	deletion	31	 1
19	1221917	1257312	NA18508	deletion	23	 1
19	1430141	1650271	NA18965	deletion	86	 1
19	1434678	1487345	NA11830	duplication	33	 3
19	1434678	1497251	NA18508	deletion	43	 1
19	1452951	1506344	NA12234	deletion	39	 1
19	1810592	2046706	NA18965	deletion	68	 1
19	1816049	1913162	NA12003	duplication	24	 3
19	2213767	2253792	NA11830	duplication	33	 3
19	2233812	2344059	NA12003	duplication	46	 3
19	2243361	2344059	NA12750	duplication	41	 3
19	3595629	3667432	NA18965	deletion	29	 1
19	3745984	3834995	NA12750	duplication	51	 3
19	5686897	5696784	NA12234	deletion	13	 1
19	12540922	12551786	NA19207	duplication	4	 3
19	14063247	14079766	NA12003	duplication	20	 3
19	15784289	15807926	NA18505	duplication	12	 3
19	15784289	15807926	NA19171	duplication	12	 4
19	17443697	17450445	NA11831	duplication	10	 3
19	17443697	17450445	NA12815	duplication	10	 3
19	22001840	22157626	NA19152	duplication	6	 3
19	22497274	22605071	NA19152	duplication	10	 3
19	22846555	22941905	NA19131	deletion	5	 1
19	23542309	23557622	NA19144	duplication	3	 3
19	40697920	40830007	NA18967	duplication	33	 3
19	41313682	41356361	NA18980	duplication	15	 3
19	41327340	41328210	NA12144	deletion	2	 1
19	41354474	41387694	NA12815	deletion	11	 1
19	41356122	41386578	NA11829	deletion	8	 1
19	41381569	41388140	NA06985	duplication	9	 3
19	43348439	43586749	NA11832	duplication	39	 3
19	43570641	43773611	NA12155	deletion	27	 1
19	44896447	44936588	NA19159	deletion	4	 1
19	45850650	45900359	NA07357	duplication	37	 3
19	46623549	46652338	NA19160	deletion	5	 1
19	49535725	49539596	NA19119	deletion	4	 1
19	49548203	49558685	NA19119	deletion	7	 1
19	49557525	49565254	NA18991	duplication	4	 3
19	50909389	50931623	NA18965	deletion	23	 1
19	52271900	52550173	NA11832	duplication	31	 3
19	53950469	54006988	NA19153	deletion	8	 1
19	54722910	54726891	NA12156	duplication	8	 OTHER
19	55282259	55370618	NA10847	deletion	39	 0
19	55315067	55370618	NA18990	deletion	31	 0
19	55738500	55777361	NA18965	deletion	26	 1
19	55992545	56154074	NA11881	duplication	18	 3
19	55992545	56154393	NA12003	duplication	19	 4
20	26054407	26063616	NA12815	deletion	3	 0
20	26054407	26063616	NA18978	deletion	3	 0
20	26054407	26063616	NA18998	deletion	3	 0
20	31786019	31792987	NA12750	deletion	5	 OTHER
20	31786019	31792987	NA19137	deletion	5	 OTHER
20	60881687	60928368	NA12003	duplication	67	 3
20	60881687	60937651	NA18965	deletion	68	 1
20	60887181	60902031	NA12234	deletion	22	 1
20	62165467	62222121	NA11830	duplication	26	 3
20	62172763	62222121	NA18965	deletion	21	 1
20	62316853	62327230	NA18965	deletion	20	 1
20	62368892	62496787	NA11830	duplication	20	 3
21	10862585	10952997	NA12005	deletion	19	 1
21	10862585	10998390	NA19206	deletion	27	 1
21	11026661	11029657	NA19201	deletion	2	 1
21	14916875	15013896	NA11994	deletion	13	 1
21	15011778	15149618	NA12751	deletion	4	 0
21	43133044	43134471	NA19137	deletion	4	 OTHER
21	43444421	43444833	NA19137	deletion	2	 OTHER
21	44891481	44898019	NA19137	deletion	3	 OTHER
21	45731963	45755723	NA18965	deletion	24	 1
21	46714053	46724452	NA12750	deletion	5	 OTHER
21	46714053	46724452	NA19137	deletion	5	 OTHER
22	17119467	17179076	NA19206	deletion	8	 1
22	18893880	18918726	NA11829	duplication	18	 3
22	18893880	18918726	NA12006	duplication	18	 3
22	21570741	21724577	NA11831	duplication	9	 3
22	21622886	21741415	NA18998	deletion	7	 1
22	21739256	21827727	NA07056	deletion	5	 1
22	22311427	22599749	NA18990	duplication	29	 3
22	22385541	23247246	NA19204	deletion	66	 1
22	22385541	23248852	NA19210	deletion	67	 1
22	22930831	23256521	NA12874	duplication	32	 3
22	23917152	23974226	NA18505	deletion	15	 1
22	24323123	24384235	NA18968	duplication	10	 3
22	24567642	24584451	NA18965	deletion	16	 1
22	39358101	39388502	NA12873	deletion	11	 1
22	39358447	39410435	NA18974	duplication	11	 3
22	39427658	39445627	NA19207	duplication	8	 3
22	42956172	42970121	NA19152	duplication	5	 3
22	50685260	50756452	NA18965	deletion	84	 1
22	50714295	50722670	NA12234	deletion	20	 1
22	50719739	50726475	NA11881	duplication	16	 3
22	50876515	50944942	NA18965	deletion	61	 1
X	200798	229631	NA19209	duplication	11	 3
X	200798	308079	NA19005	duplication	22	 3
X	200798	322352	NA18965	deletion	25	 1
X	223983	347425	NA12003	duplication	20	 3
X	1314834	1331547	NA12812	duplication	6	 3
X	1314834	1419571	NA19131	duplication	14	 3
X	1401575	1428496	NA10847	duplication	11	 3
X	1734067	1752232	NA11995	duplication	6	 3
X	1734067	1752232	NA19171	duplication	6	 3
X	1734067	1752232	NA19200	duplication	6	 4
X	2609375	3030645	NA18966	duplication	74	 3
X	47867733	47979028	NA19159	deletion	13	 1
X	47917818	47990841	NA12156	duplication	12	 3
X	47970632	48118078	NA11830	deletion	23	 1
X	48136394	48207048	NA11830	deletion	12	 1
X	49179655	49180371	NA19207	deletion	2	 0
X	49179655	49237526	NA18507	deletion	26	 0
X	49227274	49240516	NA18991	deletion	7	 0
X	49227780	49240516	NA18976	duplication	6	 3
X	52673647	52682547	NA19206	duplication	7	 3
X	55116436	55117947	NA19143	deletion	3	 1
X	55116436	55117947	NA19160	deletion	3	 0
X	55116436	55117947	NA19223	deletion	3	 0
X	73040482	73072619	NA18507	deletion	15	 0
X	103182809	103268286	NA10847	duplication	10	 3
X	103216378	103220190	NA19204	duplication	4	 3
X	114347779	114422980	NA12873	duplication	20	 3
X	119037151	119054580	NA19209	duplication	5	 3
X	146360741	146360887	NA11881	deletion	1	 0
X	146360741	146360887	NA12812	deletion	1	 0
X	148851302	148868826	NA19099	deletion	5	 0
X	152913351	152960718	NA18965	deletion	25	 1
X	152938458	153043596	NA19005	duplication	59	 3
X	152990692	153070361	NA18965	deletion	71	 1
X	153170948	153176340	NA18965	deletion	10	 1
X	153217271	153222994	NA18965	deletion	9	 1
X	153418377	153453586	NA12874	duplication	10	 4
X	153418377	153455746	NA18995	deletion	11	 0
X	153420012	153496316	NA12761	duplication	22	 3
X	153577191	153607945	NA18965	deletion	30	 1
X	153676981	153697598	NA18965	deletion	21	 1
X	154721142	154774966	NA12234	duplication	7	 3
Y	14088748	14089831	NA18971	deletion	2	 0
Y	14088748	14089831	NA18974	deletion	2	 0
Y	16941585	16953197	NA12234	deletion	2	 0
Y	24050012	24052620	NA06994	deletion	5	 1
Y	24315661	24315967	NA06994	deletion	2	 0
