[EXECUTOR] executeTask - Begin task execution
WORKER - Parameters of execution:
  * Method type: METHOD
  * Method definition: [DECLARING CLASS=matmul, METHOD NAME=fused_multiply_add]
  * Parameter types: java.lang.String java.lang.String java.lang.String
  * Parameter names: A B C
  * Parameter values: /tmp/worker1/1d6c8abe-282f-4046-b0d6-48d494db66a9/compss-extract-worker-1/d22v2_1733227258602.IT /tmp/worker1/1d6c8abe-282f-4046-b0d6-48d494db66a9/compss-extract-worker-1/d38v2_1733227258602.IT /tmp/worker1/1d6c8abe-282f-4046-b0d6-48d494db66a9/compss-extract-worker-1/d15v6_1733227258602.IT
  * Parameter streams: UNSPECIFIED UNSPECIFIED UNSPECIFIED
  * Parameter prefixes: null null null
  * Has Target: false
  * Has Return: false
[INVOKER] COMPSS_HOSTNAMES: compss-extract-worker-1
[INVOKER] COMPSS_NUM_NODES: 1
[INVOKER] COMPSS_NUM_THREADS: 1
[INVOKER] COMPSS_NUM_PROCS: 1
[EXECUTOR] executeTask - End task execution
r.piper.piper_worker executor - ----------------------------------------------------------------------------------------------------
2024-12-03 12:01:05,699 DEBUG pycompss.worker.piper.piper_worker executor - Received task in process: Process-0
2024-12-03 12:01:05,699 DEBUG pycompss.worker.piper.piper_worker executor - TASK CMD: ['EXECUTE_TASK', '102', '/tmp/worker1/1d6c8abe-282f-4046-b0d6-48d494db66a9/compss-extract-worker-1/sandBox/job_102', '/tmp/worker1/1d6c8abe-282f-4046-b0d6-48d494db66a9/compss-extract-worker-1/jobs/job102_NEW.out', '/tmp/worker1/1d6c8abe-282f-4046-b0d6-48d494db66a9/compss-extract-worker-1/jobs/job102_NEW.err', 'true', '68', 'true', 'null', 'METHOD', 'matmul', 'fused_multiply_add', '0', '1', 'compss-extract-worker-1', '1', 'false', 'null', '0', '3', '10', '3', 'null', 'A', 'Future', '/tmp/worker1/1d6c8abe-282f-4046-b0d6-48d494db66a9/compss-extract-worker-1/d22v2_1733227258602.IT:d22v2_1733227258602.IT:true:false:/tmp/worker1/1d6c8abe-282f-4046-b0d6-48d494db66a9/compss-extract-worker-1/d22v2_1733227258602.IT', '10', '3', 'null', 'B', 'Future', '/tmp/worker1/1d6c8abe-282f-4046-b0d6-48d494db66a9/compss-extract-worker-1/d38v2_1733227258602.IT:d38v2_1733227258602.IT:true:false:/tmp/worker1/1d6c8abe-282f-4046-b0d6-48d494db66a9/compss-extract-worker-1/d38v2_1733227258602.IT', '10', '3', 'null', 'C', 'Future', '/tmp/worker1/1d6c8abe-282f-4046-b0d6-48d494db66a9/compss-extract-worker-1/d15v6_1733227258602.IT:d15v6_1733227258602.IT:false:true:/tmp/worker1/1d6c8abe-282f-4046-b0d6-48d494db66a9/compss-extract-worker-1/d15v6_1733227258602.IT']
2024-12-03 12:01:05,700 DEBUG pycompss.worker.piper.piper_worker executor - Process environment:
2024-12-03 12:01:05,700 DEBUG pycompss.worker.piper.piper_worker executor - 	 - Number of nodes: 1
2024-12-03 12:01:05,700 DEBUG pycompss.worker.piper.piper_worker executor - 	 - Hostnames: compss-extract-worker-1
2024-12-03 12:01:05,700 DEBUG pycompss.worker.piper.piper_worker executor - 	 - Number of threads: 1
2024-12-03 12:01:05,701 DEBUG pycompss.worker.piper.piper_worker worker - BEGIN TASK execution in Process-0
2024-12-03 12:01:05,701 DEBUG pycompss.worker.piper.piper_worker worker - COMPSs parameters:
2024-12-03 12:01:05,701 DEBUG pycompss.worker.piper.piper_worker worker - 	- Storage conf: null
2024-12-03 12:01:05,702 DEBUG pycompss.worker.piper.piper_worker worker - 	- Logger cfg: /opt/COMPSs/Bindings/python/3/pycompss/worker/piper/commons/../../../../log/logging_worker_debug.json
2024-12-03 12:01:05,702 DEBUG pycompss.worker.piper.piper_worker worker - 	- Log out file: /tmp/worker1/1d6c8abe-282f-4046-b0d6-48d494db66a9/compss-extract-worker-1/jobs/job102_NEW.out
2024-12-03 12:01:05,702 DEBUG pycompss.worker.piper.piper_worker worker - 	- Log err file: /tmp/worker1/1d6c8abe-282f-4046-b0d6-48d494db66a9/compss-extract-worker-1/jobs/job102_NEW.err
2024-12-03 12:01:05,702 DEBUG pycompss.worker.piper.piper_worker worker - 	- Params: ['matmul', 'fused_multiply_add', '0', '1', 'compss-extract-worker-1', '1', 'false', 'null', '0', '3', '10', '3', 'null', 'A', 'Future', '/tmp/worker1/1d6c8abe-282f-4046-b0d6-48d494db66a9/compss-extract-worker-1/d22v2_1733227258602.IT:d22v2_1733227258602.IT:true:false:/tmp/worker1/1d6c8abe-282f-4046-b0d6-48d494db66a9/compss-extract-worker-1/d22v2_1733227258602.IT', '10', '3', 'null', 'B', 'Future', '/tmp/worker1/1d6c8abe-282f-4046-b0d6-48d494db66a9/compss-extract-worker-1/d38v2_1733227258602.IT:d38v2_1733227258602.IT:true:false:/tmp/worker1/1d6c8abe-282f-4046-b0d6-48d494db66a9/compss-extract-worker-1/d38v2_1733227258602.IT', '10', '3', 'null', 'C', 'Future', '/tmp/worker1/1d6c8abe-282f-4046-b0d6-48d494db66a9/compss-extract-worker-1/d15v6_1733227258602.IT:d15v6_1733227258602.IT:false:true:/tmp/worker1/1d6c8abe-282f-4046-b0d6-48d494db66a9/compss-extract-worker-1/d15v6_1733227258602.IT']
2024-12-03 12:01:05,702 DEBUG pycompss.worker.piper.piper_worker worker - 	- Path: matmul
2024-12-03 12:01:05,703 DEBUG pycompss.worker.piper.piper_worker worker - 	- Method name: fused_multiply_add
2024-12-03 12:01:05,703 DEBUG pycompss.worker.piper.piper_worker worker - 	- Num slaves: 1
2024-12-03 12:01:05,703 DEBUG pycompss.worker.piper.piper_worker worker - 	- Slaves: ['1']
2024-12-03 12:01:05,703 DEBUG pycompss.worker.piper.piper_worker worker - 	- Cus: 1
2024-12-03 12:01:05,703 DEBUG pycompss.worker.piper.piper_worker worker - 	- Has target: false
2024-12-03 12:01:05,704 DEBUG pycompss.worker.piper.piper_worker worker - 	- Num Params: 3
2024-12-03 12:01:05,704 DEBUG pycompss.worker.piper.piper_worker worker - 	- Return Length: 0
2024-12-03 12:01:05,704 DEBUG pycompss.worker.piper.piper_worker worker - 	- Args: ['10', '3', 'null', 'A', 'Future', '/tmp/worker1/1d6c8abe-282f-4046-b0d6-48d494db66a9/compss-extract-worker-1/d22v2_1733227258602.IT:d22v2_1733227258602.IT:true:false:/tmp/worker1/1d6c8abe-282f-4046-b0d6-48d494db66a9/compss-extract-worker-1/d22v2_1733227258602.IT', '10', '3', 'null', 'B', 'Future', '/tmp/worker1/1d6c8abe-282f-4046-b0d6-48d494db66a9/compss-extract-worker-1/d38v2_1733227258602.IT:d38v2_1733227258602.IT:true:false:/tmp/worker1/1d6c8abe-282f-4046-b0d6-48d494db66a9/compss-extract-worker-1/d38v2_1733227258602.IT', '10', '3', 'null', 'C', 'Future', '/tmp/worker1/1d6c8abe-282f-4046-b0d6-48d494db66a9/compss-extract-worker-1/d15v6_1733227258602.IT:d15v6_1733227258602.IT:false:true:/tmp/worker1/1d6c8abe-282f-4046-b0d6-48d494db66a9/compss-extract-worker-1/d15v6_1733227258602.IT']
2024-12-03 12:01:05,704 DEBUG pycompss.worker.piper.piper_worker worker - 	- COMPSs kwargs:
2024-12-03 12:01:05,704 DEBUG pycompss.worker.piper.piper_worker worker - 	- Is interactive: False
2024-12-03 12:01:05,705 DEBUG pycompss.worker.piper.piper_worker worker - 	- Interactive source: 
2024-12-03 12:01:05,705 DEBUG pycompss.worker.piper.piper_worker worker - 		- compss_key: True
2024-12-03 12:01:05,705 DEBUG pycompss.worker.piper.piper_worker worker - 		- compss_tracing: True
2024-12-03 12:01:05,705 DEBUG pycompss.worker.piper.piper_worker worker - 		- compss_process_name: Process-0
2024-12-03 12:01:05,705 DEBUG pycompss.worker.piper.piper_worker worker - 		- compss_storage_conf: null
2024-12-03 12:01:05,706 DEBUG pycompss.worker.piper.piper_worker worker - 		- compss_return_length: 0
2024-12-03 12:01:05,706 DEBUG pycompss.worker.piper.piper_worker worker - 		- compss_logger: <Logger pycompss.worker.piper.piper_worker (DEBUG)>
2024-12-03 12:01:05,706 DEBUG pycompss.worker.piper.piper_worker worker - 		- compss_log_cfg: /opt/COMPSs/Bindings/python/3/pycompss/worker/piper/commons/../../../../log/logging_worker_debug.json
2024-12-03 12:01:05,706 DEBUG pycompss.worker.piper.piper_worker worker - 		- compss_log_files: ('/tmp/worker1/1d6c8abe-282f-4046-b0d6-48d494db66a9/compss-extract-worker-1/jobs/job102_NEW.out', '/tmp/worker1/1d6c8abe-282f-4046-b0d6-48d494db66a9/compss-extract-worker-1/jobs/job102_NEW.err')
2024-12-03 12:01:05,706 DEBUG pycompss.worker.piper.piper_worker worker - 		- compss_python_MPI: False
2024-12-03 12:01:05,707 DEBUG pycompss.worker.piper.piper_worker worker - 		- compss_collections_layouts: {}
2024-12-03 12:01:05,707 DEBUG pycompss.worker.piper.piper_worker worker - 		- compss_cache: (None, None, None, False)
2024-12-03 12:01:05,707 DEBUG pycompss.worker.piper.piper_worker worker - Processing parameters:
2024-12-03 12:01:05,707 DEBUG pycompss.worker.piper.piper_worker worker - Parameter : 0
2024-12-03 12:01:05,708 DEBUG pycompss.worker.piper.piper_worker worker - 	 * Type : 10
2024-12-03 12:01:05,708 DEBUG pycompss.worker.piper.piper_worker worker - 	 * Std IO Stream : 3
2024-12-03 12:01:05,708 DEBUG pycompss.worker.piper.piper_worker worker - 	 * Prefix : null
2024-12-03 12:01:05,708 DEBUG pycompss.worker.piper.piper_worker worker - 	 * Name : A
2024-12-03 12:01:05,708 DEBUG pycompss.worker.piper.piper_worker worker - 	 * Content Type: 'Future'
2024-12-03 12:01:05,709 DEBUG pycompss.worker.piper.piper_worker worker - 	 * Value: '/tmp/worker1/1d6c8abe-282f-4046-b0d6-48d494db66a9/compss-extract-worker-1/d22v2_1733227258602.IT:d22v2_1733227258602.IT:true:false:/tmp/worker1/1d6c8abe-282f-4046-b0d6-48d494db66a9/compss-extract-worker-1/d22v2_1733227258602.IT'
2024-12-03 12:01:05,709 DEBUG pycompss.worker.piper.piper_worker worker - 	 * Updated type : 10
2024-12-03 12:01:05,709 DEBUG pycompss.worker.piper.piper_worker worker - Parameter : 1
2024-12-03 12:01:05,709 DEBUG pycompss.worker.piper.piper_worker worker - 	 * Type : 10
2024-12-03 12:01:05,710 DEBUG pycompss.worker.piper.piper_worker worker - 	 * Std IO Stream : 3
2024-12-03 12:01:05,710 DEBUG pycompss.worker.piper.piper_worker worker - 	 * Prefix : null
2024-12-03 12:01:05,710 DEBUG pycompss.worker.piper.piper_worker worker - 	 * Name : B
2024-12-03 12:01:05,710 DEBUG pycompss.worker.piper.piper_worker worker - 	 * Content Type: 'Future'
2024-12-03 12:01:05,710 DEBUG pycompss.worker.piper.piper_worker worker - 	 * Value: '/tmp/worker1/1d6c8abe-282f-4046-b0d6-48d494db66a9/compss-extract-worker-1/d38v2_1733227258602.IT:d38v2_1733227258602.IT:true:false:/tmp/worker1/1d6c8abe-282f-4046-b0d6-48d494db66a9/compss-extract-worker-1/d38v2_1733227258602.IT'
2024-12-03 12:01:05,711 DEBUG pycompss.worker.piper.piper_worker worker - 	 * Updated type : 10
2024-12-03 12:01:05,711 DEBUG pycompss.worker.piper.piper_worker worker - Parameter : 2
2024-12-03 12:01:05,711 DEBUG pycompss.worker.piper.piper_worker worker - 	 * Type : 10
2024-12-03 12:01:05,711 DEBUG pycompss.worker.piper.piper_worker worker - 	 * Std IO Stream : 3
2024-12-03 12:01:05,711 DEBUG pycompss.worker.piper.piper_worker worker - 	 * Prefix : null
2024-12-03 12:01:05,712 DEBUG pycompss.worker.piper.piper_worker worker - 	 * Name : C
2024-12-03 12:01:05,712 DEBUG pycompss.worker.piper.piper_worker worker - 	 * Content Type: 'Future'
2024-12-03 12:01:05,712 DEBUG pycompss.worker.piper.piper_worker worker - 	 * Value: '/tmp/worker1/1d6c8abe-282f-4046-b0d6-48d494db66a9/compss-extract-worker-1/d15v6_1733227258602.IT:d15v6_1733227258602.IT:false:true:/tmp/worker1/1d6c8abe-282f-4046-b0d6-48d494db66a9/compss-extract-worker-1/d15v6_1733227258602.IT'
2024-12-03 12:01:05,712 DEBUG pycompss.worker.piper.piper_worker worker - 	 * Updated type : 10
2024-12-03 12:01:05,712 DEBUG pycompss.worker.piper.piper_worker worker - RUN TASK with arguments:
2024-12-03 12:01:05,713 DEBUG pycompss.worker.piper.piper_worker worker - 	- Path: matmul
2024-12-03 12:01:05,713 DEBUG pycompss.worker.piper.piper_worker worker - 	- Method/function name: fused_multiply_add
2024-12-03 12:01:05,713 DEBUG pycompss.worker.piper.piper_worker worker - 	- Has target: false
2024-12-03 12:01:05,713 DEBUG pycompss.worker.piper.piper_worker worker - 	- # parameters: 3
2024-12-03 12:01:05,713 DEBUG pycompss.worker.piper.piper_worker worker - LOAD TASK:
2024-12-03 12:01:05,714 DEBUG pycompss.worker.piper.piper_worker worker - 	- Trying to import the user module: matmul
2024-12-03 12:01:05,714 DEBUG pycompss.worker.piper.piper_worker worker - Module successfully loaded
2024-12-03 12:01:05,714 DEBUG pycompss.worker.piper.piper_worker worker - EXECUTE TASK:
2024-12-03 12:01:05,714 DEBUG pycompss.worker.piper.piper_worker worker - Starting task execution
2024-12-03 12:01:05,715 DEBUG pycompss.worker.piper.piper_worker worker - module        : <module 'matmul' from '/home/omartinez/compss-matmul/matmul-extract/matmul.py'> 
2024-12-03 12:01:05,715 DEBUG pycompss.worker.piper.piper_worker worker - method_name   : fused_multiply_add 
2024-12-03 12:01:05,715 DEBUG pycompss.worker.piper.piper_worker worker - time_out      : 0 
2024-12-03 12:01:05,715 DEBUG pycompss.worker.piper.piper_worker worker - Types         : [10, 10, 10] 
2024-12-03 12:01:05,716 DEBUG pycompss.worker.piper.piper_worker worker - Values        : [Parameter(name=A
          type=10, direction=0, stream=3, prefix=null
          extra_content_type=Future
          file_name=Source: /tmp/worker1/1d6c8abe-282f-4046-b0d6-48d494db66a9/compss-extract-worker-1/d22v2_1733227258602.IT, Destination: d22v2_1733227258602.IT, Keep source: True, Is write final: False, Original path: /tmp/worker1/1d6c8abe-282f-4046-b0d6-48d494db66a9/compss-extract-worker-1/d22v2_1733227258602.IT
          is_future=False
          is_file_collection=False, depth=9223372036854775807
          weight=1.0
          keep_rename=True
          cache=True
          content=), Parameter(name=B
          type=10, direction=0, stream=3, prefix=null
          extra_content_type=Future
          file_name=Source: /tmp/worker1/1d6c8abe-282f-4046-b0d6-48d494db66a9/compss-extract-worker-1/d38v2_1733227258602.IT, Destination: d38v2_1733227258602.IT, Keep source: True, Is write final: False, Original path: /tmp/worker1/1d6c8abe-282f-4046-b0d6-48d494db66a9/compss-extract-worker-1/d38v2_1733227258602.IT
          is_future=False
          is_file_collection=False, depth=9223372036854775807
          weight=1.0
          keep_rename=True
          cache=True
          content=), Parameter(name=C
          type=10, direction=0, stream=3, prefix=null
          extra_content_type=Future
          file_name=Source: /tmp/worker1/1d6c8abe-282f-4046-b0d6-48d494db66a9/compss-extract-worker-1/d15v6_1733227258602.IT, Destination: d15v6_1733227258602.IT, Keep source: False, Is write final: True, Original path: /tmp/worker1/1d6c8abe-282f-4046-b0d6-48d494db66a9/compss-extract-worker-1/d15v6_1733227258602.IT
          is_future=False
          is_file_collection=False, depth=9223372036854775807
          weight=1.0
          keep_rename=True
          cache=True
          content=)] 
2024-12-03 12:01:05,716 DEBUG pycompss.worker.piper.piper_worker worker - P. storage    : False 
2024-12-03 12:01:05,716 DEBUG pycompss.worker.piper.piper_worker worker - Storage cfg   : null 
2024-12-03 12:01:05,716 DEBUG pycompss.worker.piper.piper_worker worker - Is interactive: False 
2024-12-03 12:01:05,719 DEBUG pycompss.runtime.task.worker worker - Starting @task decorator worker call
2024-12-03 12:01:05,719 DEBUG pycompss.runtime.task.worker worker - Redirecting stdout to: /tmp/worker1/1d6c8abe-282f-4046-b0d6-48d494db66a9/compss-extract-worker-1/jobs/job102_NEW.out
2024-12-03 12:01:05,719 DEBUG pycompss.runtime.task.worker worker - Redirecting stderr to: /tmp/worker1/1d6c8abe-282f-4046-b0d6-48d494db66a9/compss-extract-worker-1/jobs/job102_NEW.err
2024-12-03 12:01:05,720 DEBUG pycompss.runtime.task.worker worker - Revealing objects
2024-12-03 12:01:05,722 DEBUG pycompss.runtime.task.worker worker - 	 - Revealing: A
2024-12-03 12:01:05,722 DEBUG pycompss.runtime.task.worker worker - 	 - checking: A
2024-12-03 12:01:05,722 DEBUG pycompss.runtime.task.worker worker - 		 - It is an OBJECT. Deserializing from file: /tmp/worker1/1d6c8abe-282f-4046-b0d6-48d494db66a9/compss-extract-worker-1/d22v2_1733227258602.IT
2024-12-03 12:01:05,723 DEBUG pycompss.runtime.task.worker serializer - Deserializing from handler: /tmp/worker1/1d6c8abe-282f-4046-b0d6-48d494db66a9/compss-extract-worker-1/d22v2_1733227258602.IT
2024-12-03 12:01:05,723 DEBUG pycompss.runtime.task.worker serializer - Using deserializer: numpy
2024-12-03 12:01:05,723 DEBUG pycompss.runtime.task.worker serializer - Numpy available
2024-12-03 12:01:05,723 DEBUG pycompss.runtime.task.worker serializer - Deserializing using numpy
2024-12-03 12:01:05,726 DEBUG pycompss.runtime.task.worker serializer - Deserialization accomplished
2024-12-03 12:01:05,726 DEBUG pycompss.runtime.task.worker worker - 		 - Deserialization finished
2024-12-03 12:01:05,726 DEBUG pycompss.runtime.task.worker worker - 	 - Revealing: B
2024-12-03 12:01:05,727 DEBUG pycompss.runtime.task.worker worker - 	 - checking: B
2024-12-03 12:01:05,727 DEBUG pycompss.runtime.task.worker worker - 		 - It is an OBJECT. Deserializing from file: /tmp/worker1/1d6c8abe-282f-4046-b0d6-48d494db66a9/compss-extract-worker-1/d38v2_1733227258602.IT
2024-12-03 12:01:05,728 DEBUG pycompss.runtime.task.worker serializer - Deserializing from handler: /tmp/worker1/1d6c8abe-282f-4046-b0d6-48d494db66a9/compss-extract-worker-1/d38v2_1733227258602.IT
2024-12-03 12:01:05,728 DEBUG pycompss.runtime.task.worker serializer - Using deserializer: numpy
2024-12-03 12:01:05,728 DEBUG pycompss.runtime.task.worker serializer - Numpy available
2024-12-03 12:01:05,728 DEBUG pycompss.runtime.task.worker serializer - Deserializing using numpy
2024-12-03 12:01:05,731 DEBUG pycompss.runtime.task.worker serializer - Deserialization accomplished
2024-12-03 12:01:05,731 DEBUG pycompss.runtime.task.worker worker - 		 - Deserialization finished
2024-12-03 12:01:05,731 DEBUG pycompss.runtime.task.worker worker - 	 - Revealing: C
2024-12-03 12:01:05,732 DEBUG pycompss.runtime.task.worker worker - 	 - checking: C
2024-12-03 12:01:05,732 DEBUG pycompss.runtime.task.worker worker - 		 - It is an OBJECT. Deserializing from file: /tmp/worker1/1d6c8abe-282f-4046-b0d6-48d494db66a9/compss-extract-worker-1/d15v6_1733227258602.IT
2024-12-03 12:01:05,732 DEBUG pycompss.runtime.task.worker serializer - Deserializing from handler: /tmp/worker1/1d6c8abe-282f-4046-b0d6-48d494db66a9/compss-extract-worker-1/d15v6_1733227258602.IT
2024-12-03 12:01:05,733 DEBUG pycompss.runtime.task.worker serializer - Using deserializer: numpy
2024-12-03 12:01:05,733 DEBUG pycompss.runtime.task.worker serializer - Numpy available
2024-12-03 12:01:05,733 DEBUG pycompss.runtime.task.worker serializer - Deserializing using numpy
2024-12-03 12:01:05,735 DEBUG pycompss.runtime.task.worker serializer - Deserialization accomplished
2024-12-03 12:01:05,736 DEBUG pycompss.runtime.task.worker worker - 		 - Deserialization finished
2024-12-03 12:01:05,736 DEBUG pycompss.runtime.task.worker worker - Finished revealing objects
2024-12-03 12:01:05,736 DEBUG pycompss.runtime.task.worker worker - Building task parameters structures
2024-12-03 12:01:05,737 DEBUG pycompss.runtime.task.worker worker - Finished building parameters structures.
2024-12-03 12:01:05,737 DEBUG pycompss.runtime.task.worker worker - Invoking user code
2024-12-03 12:01:05,791 DEBUG pycompss.runtime.task.worker worker - Finished user code
2024-12-03 12:01:05,791 DEBUG pycompss.runtime.task.worker worker - Dealing with INOUTs and OUTS
2024-12-03 12:01:05,792 DEBUG pycompss.runtime.task.worker worker - Serializing object: C to /tmp/worker1/1d6c8abe-282f-4046-b0d6-48d494db66a9/compss-extract-worker-1/d15v6_1733227258602.IT
2024-12-03 12:01:05,792 DEBUG pycompss.runtime.task.worker serializer - Serializing to handler: /tmp/worker1/1d6c8abe-282f-4046-b0d6-48d494db66a9/compss-extract-worker-1/d15v6_1733227258602.IT
2024-12-03 12:01:05,793 DEBUG pycompss.runtime.task.worker serializer - Get serializer priority for object of type: <class 'numpy.ndarray'>
2024-12-03 12:01:05,793 DEBUG pycompss.runtime.task.worker serializer - Serializer priority: [<module 'numpy' from '/usr/local/lib/python3.8/dist-packages/numpy/__init__.py'>, <module 'pickle' from '/usr/lib/python3.8/pickle.py'>, <module 'dill' from '/usr/local/lib/python3.8/dist-packages/dill/__init__.py'>]
2024-12-03 12:01:05,793 DEBUG pycompss.runtime.task.worker serializer - Trying to serialize using numpy
2024-12-03 12:01:05,793 DEBUG pycompss.runtime.task.worker serializer - Serializing using numpy...
2024-12-03 12:01:05,795 DEBUG pycompss.runtime.task.worker serializer - Serializing using numpy success
2024-12-03 12:01:05,795 DEBUG pycompss.runtime.task.worker serializer - Serialization accomplished
2024-12-03 12:01:05,795 DEBUG pycompss.runtime.task.worker worker - Dealing with returns: 0
2024-12-03 12:01:05,795 DEBUG pycompss.runtime.task.worker worker - Building types update
2024-12-03 12:01:05,811 DEBUG pycompss.runtime.task.worker worker - Finished @task decorator
2024-12-03 12:01:05,811 DEBUG pycompss.worker.piper.piper_worker worker - Exit code: 0 
2024-12-03 12:01:05,811 DEBUG pycompss.worker.piper.piper_worker worker - Return Types: [10, 10, 10] 
2024-12-03 12:01:05,812 DEBUG pycompss.worker.piper.piper_worker worker - Return Values: ['null', 'null', 'null'] 
2024-12-03 12:01:05,812 DEBUG pycompss.worker.piper.piper_worker worker - Return target_direction: INOUT 
2024-12-03 12:01:05,812 DEBUG pycompss.worker.piper.piper_worker worker - Return timed_out: False 
2024-12-03 12:01:05,812 DEBUG pycompss.worker.piper.piper_worker worker - Return exception_message:  
2024-12-03 12:01:05,812 DEBUG pycompss.worker.piper.piper_worker worker - Finished task execution
2024-12-03 12:01:05,813 DEBUG pycompss.worker.piper.piper_worker worker - CLEAN TASK:
2024-12-03 12:01:05,813 DEBUG pycompss.worker.piper.piper_worker worker - END TASK execution. Status: Ok
2024-12-03 12:01:05,813 DEBUG pycompss.worker.piper.piper_worker executor - Process-0 - Pipe /tmp/worker1/1d6c8abe-282f-4046-b0d6-48d494db66a9/compss-extract-worker-1/pipe_788076486_executor0.inbound END TASK MESSAGE: END_TASK 102 0 3 10 null 10 null 10 null

2024-12-03 12:01:05,814 DEBUG pycompss.worker.piper.piper_worker executor - Cleaning environment.
2024-12-03 12:01:05,814 DEBUG pycompss.worker.piper.piper_worker executor - Restoring loggers.
2024-12-03 12:01:05,814 DEBUG pycompss.worker.piper.piper_worker executor - ----------------------------------------------------------------------------------------------------
