Creating prvs 
found trace packages to merge: /root/.COMPSs/matmul.py_01//trace/master_compss_trace.tar.gz
/root/.COMPSs/matmul.py_01//trace/static_compss-extract-worker-1_compss_trace.tar.gz
/root/.COMPSs/matmul.py_01//trace/static_compss-extract-worker-0_compss_trace.tar.gz
Python trace information not found
merger: Output trace format is: Paraver
merger: Extrae 3.8.3
mpi2prv: Assigned nodes < master >
mpi2prv: Assigned size per processor < <1 Mbyte >
mpi2prv: File /tmp/tmp.ErQTy7HFqq/python/set-0/TRACE@compss-extract-worker-1.0000000127000000000000.mpit is object 1.1.1 on node compss-extract-worker-1 assigned to processor 0
mpi2prv: File /tmp/tmp.ErQTy7HFqq/python/set-0/TRACE@compss-extract-worker-1.0000000147000000000000.mpit is object 2.1.1 on node compss-extract-worker-1 assigned to processor 0
mpi2prv: File /tmp/tmp.ErQTy7HFqq/python/set-0/TRACE@compss-extract-worker-1.0000000149000000000000.mpit is object 3.1.1 on node compss-extract-worker-1 assigned to processor 0
mpi2prv: Warning: Couldn't open /tmp/worker1/084b3ccb-8a08-486a-ac16-8b1135453f2e/compss-extract-worker-1/python/.libseqtrace-subprocess.so for reading, addresses may not be translated.
mpi2prv: Warning: Couldn't open /tmp/worker1/084b3ccb-8a08-486a-ac16-8b1135453f2e/compss-extract-worker-1/python/.libseqtrace-subprocess.so for reading, addresses may not be translated.
mpi2prv: Checking for target directory existence... exists, ok!
mpi2prv: Selected output trace format is Paraver
mpi2prv: Stored trace format is Paraver
mpi2prv: Searching synchronization points... done
mpi2prv: Time Synchronization disabled.
mpi2prv: Circular buffer enabled at tracing time? NO
mpi2prv: Parsing intermediate files
mpi2prv: Progress 1 of 2 ... 5% 10% 15% 20% 25% 30% 35% 40% 45% 50% 55% 60% 65% 70% 75% 80% 85% 90% 95% done
mpi2prv: Processor 0 succeeded to translate its assigned files
mpi2prv: Elapsed time translating files: 0 hours 0 minutes 0 seconds
mpi2prv: Elapsed time sorting addresses: 0 hours 0 minutes 0 seconds
mpi2prv: Generating tracefile (intermediate buffers of 2236928 events)
         This process can take a while. Please, be patient.
mpi2prv: Progress 2 of 2 ... 5% 10% 15% 20% 25% 30% 35% 40% 45% 50% 55% 60% 65% 70% 75% 80% 85% 90% 95% done
mpi2prv: Warning! Clock accuracy seems to be in microseconds instead of nanoseconds.
mpi2prv: Elapsed time merge step: 0 hours 0 minutes 0 seconds
mpi2prv: Resulting tracefile occupies 13834 bytes
mpi2prv: Removing temporal files... done
mpi2prv: Elapsed time removing temporal files: 0 hours 0 minutes 0 seconds
mpi2prv: Congratulations! /root/.COMPSs/matmul.py_01//trace/python//2_python_trace.prv has been generated.
merger: Output trace format is: Paraver
merger: Extrae 3.8.3
mpi2prv: Assigned nodes < master >
mpi2prv: Assigned size per processor < <1 Mbyte >
mpi2prv: File /tmp/tmp.v9Gw9nOEgA/python/set-0/TRACE@compss-extract-worker-0.0000000127000000000000.mpit is object 1.1.1 on node compss-extract-worker-0 assigned to processor 0
mpi2prv: File /tmp/tmp.v9Gw9nOEgA/python/set-0/TRACE@compss-extract-worker-0.0000000147000000000000.mpit is object 2.1.1 on node compss-extract-worker-0 assigned to processor 0
mpi2prv: File /tmp/tmp.v9Gw9nOEgA/python/set-0/TRACE@compss-extract-worker-0.0000000149000000000000.mpit is object 3.1.1 on node compss-extract-worker-0 assigned to processor 0
mpi2prv: Warning: Couldn't open /tmp/worker0/084b3ccb-8a08-486a-ac16-8b1135453f2e/compss-extract-worker-0/python/.libseqtrace-subprocess.so for reading, addresses may not be translated.
mpi2prv: Warning: Couldn't open /tmp/worker0/084b3ccb-8a08-486a-ac16-8b1135453f2e/compss-extract-worker-0/python/.libseqtrace-subprocess.so for reading, addresses may not be translated.
mpi2prv: Checking for target directory existence... exists, ok!
mpi2prv: Selected output trace format is Paraver
mpi2prv: Stored trace format is Paraver
mpi2prv: Searching synchronization points... done
mpi2prv: Time Synchronization disabled.
mpi2prv: Circular buffer enabled at tracing time? NO
mpi2prv: Parsing intermediate files
mpi2prv: Progress 1 of 2 ... 5% 10% 15% 20% 25% 30% 35% 40% 45% 50% 55% 60% 65% 70% 75% 80% 85% 90% 95% done
mpi2prv: Processor 0 succeeded to translate its assigned files
mpi2prv: Elapsed time translating files: 0 hours 0 minutes 0 seconds
mpi2prv: Elapsed time sorting addresses: 0 hours 0 minutes 0 seconds
mpi2prv: Generating tracefile (intermediate buffers of 2236928 events)
         This process can take a while. Please, be patient.
mpi2prv: Progress 2 of 2 ... 5% 10% 15% 20% 25% 30% 35% 40% 45% 50% 55% 60% 65% 70% 75% 80% 85% 90% 95% done
mpi2prv: Warning! Clock accuracy seems to be in microseconds instead of nanoseconds.
mpi2prv: Elapsed time merge step: 0 hours 0 minutes 0 seconds
mpi2prv: Resulting tracefile occupies 13824 bytes
mpi2prv: Removing temporal files... done
mpi2prv: Elapsed time removing temporal files: 0 hours 0 minutes 0 seconds
mpi2prv: Congratulations! /root/.COMPSs/matmul.py_01//trace/python//1_python_trace.prv has been generated.
merger: Output trace format is: Paraver
merger: Extrae 3.8.3
mpi2prv: Assigned nodes < master >
mpi2prv: Assigned size per processor < <1 Mbyte >
mpi2prv: File /root/.COMPSs/matmul.py_01//trace//set-0/TRACE@master.0000000108000000000000.mpit is object 1.1.1 on node master assigned to processor 0
mpi2prv: File /root/.COMPSs/matmul.py_01//trace//set-0/TRACE@master.0000000108000000000001.mpit is object 1.1.2 on node master assigned to processor 0
mpi2prv: File /root/.COMPSs/matmul.py_01//trace//set-0/TRACE@master.0000000108000000000002.mpit is object 1.1.3 on node master assigned to processor 0
mpi2prv: File /root/.COMPSs/matmul.py_01//trace//set-0/TRACE@master.0000000108000000000003.mpit is object 1.1.4 on node master assigned to processor 0
mpi2prv: File /root/.COMPSs/matmul.py_01//trace//set-0/TRACE@master.0000000108000000000004.mpit is object 1.1.5 on node master assigned to processor 0
mpi2prv: File /root/.COMPSs/matmul.py_01//trace//set-0/TRACE@compss-extract-worker-1.0000000054000002000000.mpit is object 1.3.1 on node compss-extract-worker-1 assigned to processor 0
mpi2prv: File /root/.COMPSs/matmul.py_01//trace//set-0/TRACE@compss-extract-worker-1.0000000054000002000001.mpit is object 1.3.2 on node compss-extract-worker-1 assigned to processor 0
mpi2prv: File /root/.COMPSs/matmul.py_01//trace//set-0/TRACE@compss-extract-worker-1.0000000054000002000002.mpit is object 1.3.3 on node compss-extract-worker-1 assigned to processor 0
mpi2prv: File /root/.COMPSs/matmul.py_01//trace//set-0/TRACE@compss-extract-worker-1.0000000054000002000003.mpit is object 1.3.4 on node compss-extract-worker-1 assigned to processor 0
mpi2prv: File /root/.COMPSs/matmul.py_01//trace//set-0/TRACE@compss-extract-worker-1.0000000054000002000004.mpit is object 1.3.5 on node compss-extract-worker-1 assigned to processor 0
mpi2prv: File /root/.COMPSs/matmul.py_01//trace//set-0/TRACE@compss-extract-worker-1.0000000054000002000005.mpit is object 1.3.6 on node compss-extract-worker-1 assigned to processor 0
mpi2prv: File /root/.COMPSs/matmul.py_01//trace//set-0/TRACE@compss-extract-worker-0.0000000054000001000000.mpit is object 1.2.1 on node compss-extract-worker-0 assigned to processor 0
mpi2prv: File /root/.COMPSs/matmul.py_01//trace//set-0/TRACE@compss-extract-worker-0.0000000054000001000001.mpit is object 1.2.2 on node compss-extract-worker-0 assigned to processor 0
mpi2prv: File /root/.COMPSs/matmul.py_01//trace//set-0/TRACE@compss-extract-worker-0.0000000054000001000002.mpit is object 1.2.3 on node compss-extract-worker-0 assigned to processor 0
mpi2prv: File /root/.COMPSs/matmul.py_01//trace//set-0/TRACE@compss-extract-worker-0.0000000054000001000003.mpit is object 1.2.4 on node compss-extract-worker-0 assigned to processor 0
mpi2prv: File /root/.COMPSs/matmul.py_01//trace//set-0/TRACE@compss-extract-worker-0.0000000054000001000004.mpit is object 1.2.5 on node compss-extract-worker-0 assigned to processor 0
mpi2prv: File /root/.COMPSs/matmul.py_01//trace//set-0/TRACE@compss-extract-worker-0.0000000054000001000005.mpit is object 1.2.6 on node compss-extract-worker-0 assigned to processor 0
mpi2prv: Checking for target directory existence... exists, ok!
mpi2prv: Selected output trace format is Paraver
mpi2prv: Stored trace format is Paraver
mpi2prv: Searching synchronization points... done
mpi2prv: Time Synchronization disabled.
mpi2prv: Circular buffer enabled at tracing time? NO
mpi2prv: Parsing intermediate files
mpi2prv: Progress 1 of 2 ... 5% 10% 15% 20% 25% 30% 35% 40% 45% 50% 55% 60% 65% 70% 75% 80% 85% 90% 95% done
mpi2prv: Processor 0 succeeded to translate its assigned files
mpi2prv: Elapsed time translating files: 0 hours 0 minutes 0 seconds
mpi2prv: Elapsed time sorting addresses: 0 hours 0 minutes 0 seconds
mpi2prv: Generating tracefile (intermediate buffers of 394752 events)
         This process can take a while. Please, be patient.
mpi2prv: Progress 2 of 2 ... 5% 10% 15% 20% 25% 30% 35% 40% 45% 50% 55% 60% 65% 70% 75% 80% 85% 90% 95% done
mpi2prv: Warning! Clock accuracy seems to be in microseconds instead of nanoseconds.
mpi2prv: Elapsed time merge step: 0 hours 0 minutes 0 seconds
mpi2prv: Resulting tracefile occupies 76241 bytes
mpi2prv: Removing temporal files... done
mpi2prv: Elapsed time removing temporal files: 0 hours 0 minutes 0 seconds
mpi2prv: Congratulations! /root/.COMPSs/matmul.py_01//trace//matmul.py_compss.prv has been generated.
Joining python traces
[(561)(2024-12-03 13:46:26,622)             Tracing]    @<init>           -  Trace's merger initialization successful
[(566)(2024-12-03 13:46:26,627)             Tracing]    @merge            -  Parsing master sync events
[(566)(2024-12-03 13:46:26,627)             Tracing]    @getSyncEvents    -  Getting sync events from: /root/.COMPSs/matmul.py_01/trace/matmul.py_compss.prv for worker -1
[(613)(2024-12-03 13:46:26,674)             Tracing]    @merge            -  Merging task traces into master which contains 2 lines.
[(622)(2024-12-03 13:46:26,683)             Tracing]    @merge            -  Merging worker es.bsc.compss.types.tracing.paraver.PRVTrace@4206a205
[(622)(2024-12-03 13:46:26,683)             Tracing]    @getSyncEvents    -  Getting sync events from: /root/.COMPSs/matmul.py_01/trace/python/1_python_trace.prv for worker 2
[(631)(2024-12-03 13:46:26,692)             Tracing]    @merge            -  Merging worker es.bsc.compss.types.tracing.paraver.PRVTrace@44a664f2
[(631)(2024-12-03 13:46:26,692)             Tracing]    @getSyncEvents    -  Getting sync events from: /root/.COMPSs/matmul.py_01/trace/python/2_python_trace.prv for worker 3
[(636)(2024-12-03 13:46:26,697)             Tracing]    @merge            -  *** Modifications applied to trace matmul.py_compss
[(636)(2024-12-03 13:46:26,697)             Tracing]    @merge            -  *** Modifications applied to trace 1_python_trace
[(636)(2024-12-03 13:46:26,697)             Tracing]    @merge            -  Applying a time offset of 3112286000
[(636)(2024-12-03 13:46:26,697)             Tracing]    @merge            -  Thread identifiers translation:
	 * 1.1.1->1:2:7
	 * 2.1.1->1:2:4
	 * 3.1.1->1:2:3

[(636)(2024-12-03 13:46:26,697)             Tracing]    @merge            -  Applying a CPU offset of 11
[(636)(2024-12-03 13:46:26,697)             Tracing]    @merge            -  *** Modifications applied to trace 2_python_trace
[(637)(2024-12-03 13:46:26,698)             Tracing]    @merge            -  Applying a time offset of 3610725000
[(637)(2024-12-03 13:46:26,698)             Tracing]    @merge            -  Thread identifiers translation:
	 * 1.1.1->1:3:7
	 * 2.1.1->1:3:4
	 * 3.1.1->1:3:3

[(637)(2024-12-03 13:46:26,698)             Tracing]    @merge            -  Applying a CPU offset of 5
[(643)(2024-12-03 13:46:26,704)             Tracing]    @mergeEvents      -  Populating trace content
[(681)(2024-12-03 13:46:26,742)             Tracing]    @merge            -  Merging finished.
Customizing threads
[(560)(2024-12-03 13:46:27,365)             Tracing]    @main             -  Thread identifiers translation:
	 * 1:2:6->2:1:3
	 * 1:3:5->3:1:2
	 * 1:2:5->2:1:2
	 * 1:3:4->3:2:1
	 * 1:3:7->3:1:5
	 * 1:2:7->2:1:5
	 * 1:3:6->3:1:3
	 * 1:1:3->1:1:2
	 * 1:2:2->2:1:4
	 * 1:3:1->3:1:1
	 * 1:1:2->1:1:3
	 * 1:2:1->2:1:1
	 * 1:1:5->1:1:5
	 * 1:2:4->2:2:1
	 * 1:3:3->3:2:2
	 * 1:1:4->1:1:4
	 * 1:2:3->2:2:2
	 * 1:3:2->3:1:4
	 * 1:1:1->1:1:1

