[EXECUTOR] executeTask - Begin task execution
WORKER - Parameters of execution:
  * Method type: METHOD
  * Method definition: [DECLARING CLASS=matmul, METHOD NAME=generate_block]
  * Parameter types: int int int int boolean
  * Parameter names: count size num_blocks #kwarg_seed #kwarg_set_to_zero
  * Parameter values: 4 128 2 0 false
  * Parameter streams: UNSPECIFIED UNSPECIFIED UNSPECIFIED UNSPECIFIED UNSPECIFIED
  * Parameter prefixes: null null null null null
  * Has Target: false
  * Has Return: true
[INVOKER] COMPSS_HOSTNAMES: compss-extract-worker-0
[INVOKER] COMPSS_NUM_NODES: 1
[INVOKER] COMPSS_NUM_THREADS: 1
[INVOKER] COMPSS_NUM_PROCS: 1
[EXECUTOR] executeTask - End task execution
r.piper.piper_worker executor - ----------------------------------------------------------------------------------------------------
2024-12-03 11:56:38,033 DEBUG pycompss.worker.piper.piper_worker executor - Received task in process: Process-1
2024-12-03 11:56:38,034 DEBUG pycompss.worker.piper.piper_worker executor - TASK CMD: ['EXECUTE_TASK', '12', '/tmp/worker0/e8595566-d779-472e-bb9a-2628ff3fd90f/compss-extract-worker-0/sandBox/job_12', '/tmp/worker0/e8595566-d779-472e-bb9a-2628ff3fd90f/compss-extract-worker-0/jobs/job12_NEW.out', '/tmp/worker0/e8595566-d779-472e-bb9a-2628ff3fd90f/compss-extract-worker-0/jobs/job12_NEW.err', 'true', '7', 'true', 'null', 'METHOD', 'matmul', 'generate_block', '0', '1', 'compss-extract-worker-0', '1', 'false', '10', '1', '6', '4', '3', 'null', 'count', '#UNDEFINED#:#UNDEFINED#', '4', '4', '3', 'null', 'size', '#UNDEFINED#:#UNDEFINED#', '128', '4', '3', 'null', 'num_blocks', '#UNDEFINED#:#UNDEFINED#', '2', '4', '3', 'null', '#kwarg_seed', '#UNDEFINED#:#UNDEFINED#', '0', '0', '3', 'null', '#kwarg_set_to_zero', '#UNDEFINED#:#UNDEFINED#', 'false', '10', '3', '#', '$return_0', 'FILE', 'null:d7v2_1733226994663.IT:false:true:/tmp/worker0/e8595566-d779-472e-bb9a-2628ff3fd90f/compss-extract-worker-0/d7v2_1733226994663.IT']
2024-12-03 11:56:38,034 DEBUG pycompss.worker.piper.piper_worker executor - Process environment:
2024-12-03 11:56:38,034 DEBUG pycompss.worker.piper.piper_worker executor - 	 - Number of nodes: 1
2024-12-03 11:56:38,034 DEBUG pycompss.worker.piper.piper_worker executor - 	 - Hostnames: compss-extract-worker-0
2024-12-03 11:56:38,034 DEBUG pycompss.worker.piper.piper_worker executor - 	 - Number of threads: 1
2024-12-03 11:56:38,035 DEBUG pycompss.worker.piper.piper_worker worker - BEGIN TASK execution in Process-1
2024-12-03 11:56:38,035 DEBUG pycompss.worker.piper.piper_worker worker - COMPSs parameters:
2024-12-03 11:56:38,035 DEBUG pycompss.worker.piper.piper_worker worker - 	- Storage conf: null
2024-12-03 11:56:38,035 DEBUG pycompss.worker.piper.piper_worker worker - 	- Logger cfg: /opt/COMPSs/Bindings/python/3/pycompss/worker/piper/commons/../../../../log/logging_worker_debug.json
2024-12-03 11:56:38,035 DEBUG pycompss.worker.piper.piper_worker worker - 	- Log out file: /tmp/worker0/e8595566-d779-472e-bb9a-2628ff3fd90f/compss-extract-worker-0/jobs/job12_NEW.out
2024-12-03 11:56:38,035 DEBUG pycompss.worker.piper.piper_worker worker - 	- Log err file: /tmp/worker0/e8595566-d779-472e-bb9a-2628ff3fd90f/compss-extract-worker-0/jobs/job12_NEW.err
2024-12-03 11:56:38,035 DEBUG pycompss.worker.piper.piper_worker worker - 	- Params: ['matmul', 'generate_block', '0', '1', 'compss-extract-worker-0', '1', 'false', '10', '1', '6', '4', '3', 'null', 'count', '#UNDEFINED#:#UNDEFINED#', '4', '4', '3', 'null', 'size', '#UNDEFINED#:#UNDEFINED#', '128', '4', '3', 'null', 'num_blocks', '#UNDEFINED#:#UNDEFINED#', '2', '4', '3', 'null', '#kwarg_seed', '#UNDEFINED#:#UNDEFINED#', '0', '0', '3', 'null', '#kwarg_set_to_zero', '#UNDEFINED#:#UNDEFINED#', 'false', '10', '3', '#', '$return_0', 'FILE', 'null:d7v2_1733226994663.IT:false:true:/tmp/worker0/e8595566-d779-472e-bb9a-2628ff3fd90f/compss-extract-worker-0/d7v2_1733226994663.IT']
2024-12-03 11:56:38,036 DEBUG pycompss.worker.piper.piper_worker worker - 	- Path: matmul
2024-12-03 11:56:38,036 DEBUG pycompss.worker.piper.piper_worker worker - 	- Method name: generate_block
2024-12-03 11:56:38,036 DEBUG pycompss.worker.piper.piper_worker worker - 	- Num slaves: 1
2024-12-03 11:56:38,036 DEBUG pycompss.worker.piper.piper_worker worker - 	- Slaves: ['1']
2024-12-03 11:56:38,036 DEBUG pycompss.worker.piper.piper_worker worker - 	- Cus: 1
2024-12-03 11:56:38,036 DEBUG pycompss.worker.piper.piper_worker worker - 	- Has target: false
2024-12-03 11:56:38,036 DEBUG pycompss.worker.piper.piper_worker worker - 	- Num Params: 6
2024-12-03 11:56:38,037 DEBUG pycompss.worker.piper.piper_worker worker - 	- Return Length: 1
2024-12-03 11:56:38,037 DEBUG pycompss.worker.piper.piper_worker worker - 	- Args: ['4', '3', 'null', 'count', '#UNDEFINED#:#UNDEFINED#', '4', '4', '3', 'null', 'size', '#UNDEFINED#:#UNDEFINED#', '128', '4', '3', 'null', 'num_blocks', '#UNDEFINED#:#UNDEFINED#', '2', '4', '3', 'null', '#kwarg_seed', '#UNDEFINED#:#UNDEFINED#', '0', '0', '3', 'null', '#kwarg_set_to_zero', '#UNDEFINED#:#UNDEFINED#', 'false', '10', '3', '#', '$return_0', 'FILE', 'null:d7v2_1733226994663.IT:false:true:/tmp/worker0/e8595566-d779-472e-bb9a-2628ff3fd90f/compss-extract-worker-0/d7v2_1733226994663.IT']
2024-12-03 11:56:38,037 DEBUG pycompss.worker.piper.piper_worker worker - 	- COMPSs kwargs:
2024-12-03 11:56:38,037 DEBUG pycompss.worker.piper.piper_worker worker - 	- Is interactive: False
2024-12-03 11:56:38,037 DEBUG pycompss.worker.piper.piper_worker worker - 	- Interactive source: 
2024-12-03 11:56:38,037 DEBUG pycompss.worker.piper.piper_worker worker - 		- compss_key: True
2024-12-03 11:56:38,037 DEBUG pycompss.worker.piper.piper_worker worker - 		- compss_tracing: True
2024-12-03 11:56:38,038 DEBUG pycompss.worker.piper.piper_worker worker - 		- compss_process_name: Process-1
2024-12-03 11:56:38,038 DEBUG pycompss.worker.piper.piper_worker worker - 		- compss_storage_conf: null
2024-12-03 11:56:38,038 DEBUG pycompss.worker.piper.piper_worker worker - 		- compss_return_length: 1
2024-12-03 11:56:38,038 DEBUG pycompss.worker.piper.piper_worker worker - 		- compss_logger: <Logger pycompss.worker.piper.piper_worker (DEBUG)>
2024-12-03 11:56:38,038 DEBUG pycompss.worker.piper.piper_worker worker - 		- compss_log_cfg: /opt/COMPSs/Bindings/python/3/pycompss/worker/piper/commons/../../../../log/logging_worker_debug.json
2024-12-03 11:56:38,038 DEBUG pycompss.worker.piper.piper_worker worker - 		- compss_log_files: ('/tmp/worker0/e8595566-d779-472e-bb9a-2628ff3fd90f/compss-extract-worker-0/jobs/job12_NEW.out', '/tmp/worker0/e8595566-d779-472e-bb9a-2628ff3fd90f/compss-extract-worker-0/jobs/job12_NEW.err')
2024-12-03 11:56:38,038 DEBUG pycompss.worker.piper.piper_worker worker - 		- compss_python_MPI: False
2024-12-03 11:56:38,039 DEBUG pycompss.worker.piper.piper_worker worker - 		- compss_collections_layouts: {}
2024-12-03 11:56:38,039 DEBUG pycompss.worker.piper.piper_worker worker - 		- compss_cache: (None, None, None, False)
2024-12-03 11:56:38,039 DEBUG pycompss.worker.piper.piper_worker worker - Processing parameters:
2024-12-03 11:56:38,039 DEBUG pycompss.worker.piper.piper_worker worker - Parameter : 0
2024-12-03 11:56:38,039 DEBUG pycompss.worker.piper.piper_worker worker - 	 * Type : 4
2024-12-03 11:56:38,039 DEBUG pycompss.worker.piper.piper_worker worker - 	 * Std IO Stream : 3
2024-12-03 11:56:38,039 DEBUG pycompss.worker.piper.piper_worker worker - 	 * Prefix : null
2024-12-03 11:56:38,040 DEBUG pycompss.worker.piper.piper_worker worker - 	 * Name : count
2024-12-03 11:56:38,040 DEBUG pycompss.worker.piper.piper_worker worker - 	 * Content Type: '#UNDEFINED#:#UNDEFINED#'
2024-12-03 11:56:38,040 DEBUG pycompss.worker.piper.piper_worker worker - 	 * Value: '4'
2024-12-03 11:56:38,040 DEBUG pycompss.worker.piper.piper_worker worker - 	 * Updated type : 4
2024-12-03 11:56:38,040 DEBUG pycompss.worker.piper.piper_worker worker - Parameter : 1
2024-12-03 11:56:38,040 DEBUG pycompss.worker.piper.piper_worker worker - 	 * Type : 4
2024-12-03 11:56:38,040 DEBUG pycompss.worker.piper.piper_worker worker - 	 * Std IO Stream : 3
2024-12-03 11:56:38,041 DEBUG pycompss.worker.piper.piper_worker worker - 	 * Prefix : null
2024-12-03 11:56:38,041 DEBUG pycompss.worker.piper.piper_worker worker - 	 * Name : size
2024-12-03 11:56:38,041 DEBUG pycompss.worker.piper.piper_worker worker - 	 * Content Type: '#UNDEFINED#:#UNDEFINED#'
2024-12-03 11:56:38,041 DEBUG pycompss.worker.piper.piper_worker worker - 	 * Value: '128'
2024-12-03 11:56:38,041 DEBUG pycompss.worker.piper.piper_worker worker - 	 * Updated type : 4
2024-12-03 11:56:38,041 DEBUG pycompss.worker.piper.piper_worker worker - Parameter : 2
2024-12-03 11:56:38,041 DEBUG pycompss.worker.piper.piper_worker worker - 	 * Type : 4
2024-12-03 11:56:38,042 DEBUG pycompss.worker.piper.piper_worker worker - 	 * Std IO Stream : 3
2024-12-03 11:56:38,042 DEBUG pycompss.worker.piper.piper_worker worker - 	 * Prefix : null
2024-12-03 11:56:38,042 DEBUG pycompss.worker.piper.piper_worker worker - 	 * Name : num_blocks
2024-12-03 11:56:38,042 DEBUG pycompss.worker.piper.piper_worker worker - 	 * Content Type: '#UNDEFINED#:#UNDEFINED#'
2024-12-03 11:56:38,042 DEBUG pycompss.worker.piper.piper_worker worker - 	 * Value: '2'
2024-12-03 11:56:38,042 DEBUG pycompss.worker.piper.piper_worker worker - 	 * Updated type : 4
2024-12-03 11:56:38,042 DEBUG pycompss.worker.piper.piper_worker worker - Parameter : 3
2024-12-03 11:56:38,042 DEBUG pycompss.worker.piper.piper_worker worker - 	 * Type : 4
2024-12-03 11:56:38,043 DEBUG pycompss.worker.piper.piper_worker worker - 	 * Std IO Stream : 3
2024-12-03 11:56:38,043 DEBUG pycompss.worker.piper.piper_worker worker - 	 * Prefix : null
2024-12-03 11:56:38,043 DEBUG pycompss.worker.piper.piper_worker worker - 	 * Name : #kwarg_seed
2024-12-03 11:56:38,043 DEBUG pycompss.worker.piper.piper_worker worker - 	 * Content Type: '#UNDEFINED#:#UNDEFINED#'
2024-12-03 11:56:38,043 DEBUG pycompss.worker.piper.piper_worker worker - 	 * Value: '0'
2024-12-03 11:56:38,043 DEBUG pycompss.worker.piper.piper_worker worker - 	 * Updated type : 4
2024-12-03 11:56:38,043 DEBUG pycompss.worker.piper.piper_worker worker - Parameter : 4
2024-12-03 11:56:38,044 DEBUG pycompss.worker.piper.piper_worker worker - 	 * Type : 0
2024-12-03 11:56:38,044 DEBUG pycompss.worker.piper.piper_worker worker - 	 * Std IO Stream : 3
2024-12-03 11:56:38,044 DEBUG pycompss.worker.piper.piper_worker worker - 	 * Prefix : null
2024-12-03 11:56:38,044 DEBUG pycompss.worker.piper.piper_worker worker - 	 * Name : #kwarg_set_to_zero
2024-12-03 11:56:38,044 DEBUG pycompss.worker.piper.piper_worker worker - 	 * Content Type: '#UNDEFINED#:#UNDEFINED#'
2024-12-03 11:56:38,044 DEBUG pycompss.worker.piper.piper_worker worker - 	 * Value: 'false'
2024-12-03 11:56:38,045 DEBUG pycompss.worker.piper.piper_worker worker - 	 * Updated type : 0
2024-12-03 11:56:38,045 DEBUG pycompss.worker.piper.piper_worker worker - Parameter : 5
2024-12-03 11:56:38,045 DEBUG pycompss.worker.piper.piper_worker worker - 	 * Type : 10
2024-12-03 11:56:38,045 DEBUG pycompss.worker.piper.piper_worker worker - 	 * Std IO Stream : 3
2024-12-03 11:56:38,045 DEBUG pycompss.worker.piper.piper_worker worker - 	 * Prefix : #
2024-12-03 11:56:38,045 DEBUG pycompss.worker.piper.piper_worker worker - 	 * Name : $return_0
2024-12-03 11:56:38,045 DEBUG pycompss.worker.piper.piper_worker worker - 	 * Content Type: 'FILE'
2024-12-03 11:56:38,046 DEBUG pycompss.worker.piper.piper_worker worker - 	 * Value: 'null:d7v2_1733226994663.IT:false:true:/tmp/worker0/e8595566-d779-472e-bb9a-2628ff3fd90f/compss-extract-worker-0/d7v2_1733226994663.IT'
2024-12-03 11:56:38,046 DEBUG pycompss.worker.piper.piper_worker worker - 	 * Updated type : 10
2024-12-03 11:56:38,046 DEBUG pycompss.worker.piper.piper_worker worker - RUN TASK with arguments:
2024-12-03 11:56:38,046 DEBUG pycompss.worker.piper.piper_worker worker - 	- Path: matmul
2024-12-03 11:56:38,046 DEBUG pycompss.worker.piper.piper_worker worker - 	- Method/function name: generate_block
2024-12-03 11:56:38,046 DEBUG pycompss.worker.piper.piper_worker worker - 	- Has target: false
2024-12-03 11:56:38,046 DEBUG pycompss.worker.piper.piper_worker worker - 	- # parameters: 6
2024-12-03 11:56:38,047 DEBUG pycompss.worker.piper.piper_worker worker - LOAD TASK:
2024-12-03 11:56:38,047 DEBUG pycompss.worker.piper.piper_worker worker - 	- Trying to import the user module: matmul
2024-12-03 11:56:38,047 DEBUG pycompss.worker.piper.piper_worker worker - Module successfully loaded
2024-12-03 11:56:38,047 DEBUG pycompss.worker.piper.piper_worker worker - EXECUTE TASK:
2024-12-03 11:56:38,047 DEBUG pycompss.worker.piper.piper_worker worker - Starting task execution
2024-12-03 11:56:38,047 DEBUG pycompss.worker.piper.piper_worker worker - module        : <module 'matmul' from '/home/omartinez/compss-matmul/matmul-extract/matmul.py'> 
2024-12-03 11:56:38,048 DEBUG pycompss.worker.piper.piper_worker worker - method_name   : generate_block 
2024-12-03 11:56:38,048 DEBUG pycompss.worker.piper.piper_worker worker - time_out      : 0 
2024-12-03 11:56:38,048 DEBUG pycompss.worker.piper.piper_worker worker - Types         : [4, 4, 4, 4, 0, 10] 
2024-12-03 11:56:38,048 DEBUG pycompss.worker.piper.piper_worker worker - Values        : [Parameter(name=count
          type=4, direction=0, stream=3, prefix=null
          extra_content_type=#UNDEFINED#:#UNDEFINED#
          file_name=Source: None, Destination: None, Keep source: False, Is write final: False, Original path: None
          is_future=False
          is_file_collection=False, depth=9223372036854775807
          weight=1.0
          keep_rename=True
          cache=True
          content=4), Parameter(name=size
          type=4, direction=0, stream=3, prefix=null
          extra_content_type=#UNDEFINED#:#UNDEFINED#
          file_name=Source: None, Destination: None, Keep source: False, Is write final: False, Original path: None
          is_future=False
          is_file_collection=False, depth=9223372036854775807
          weight=1.0
          keep_rename=True
          cache=True
          content=128), Parameter(name=num_blocks
          type=4, direction=0, stream=3, prefix=null
          extra_content_type=#UNDEFINED#:#UNDEFINED#
          file_name=Source: None, Destination: None, Keep source: False, Is write final: False, Original path: None
          is_future=False
          is_file_collection=False, depth=9223372036854775807
          weight=1.0
          keep_rename=True
          cache=True
          content=2), Parameter(name=#kwarg_seed
          type=4, direction=0, stream=3, prefix=null
          extra_content_type=#UNDEFINED#:#UNDEFINED#
          file_name=Source: None, Destination: None, Keep source: False, Is write final: False, Original path: None
          is_future=False
          is_file_collection=False, depth=9223372036854775807
          weight=1.0
          keep_rename=True
          cache=True
          content=0), Parameter(name=#kwarg_set_to_zero
          type=0, direction=0, stream=3, prefix=null
          extra_content_type=#UNDEFINED#:#UNDEFINED#
          file_name=Source: None, Destination: None, Keep source: False, Is write final: False, Original path: None
          is_future=False
          is_file_collection=False, depth=9223372036854775807
          weight=1.0
          keep_rename=True
          cache=True
          content=False), Parameter(name=$return_0
          type=10, direction=0, stream=3, prefix=#
          extra_content_type=FILE
          file_name=Source: null, Destination: d7v2_1733226994663.IT, Keep source: False, Is write final: True, Original path: /tmp/worker0/e8595566-d779-472e-bb9a-2628ff3fd90f/compss-extract-worker-0/d7v2_1733226994663.IT
          is_future=False
          is_file_collection=False, depth=9223372036854775807
          weight=1.0
          keep_rename=True
          cache=True
          content=)] 
2024-12-03 11:56:38,048 DEBUG pycompss.worker.piper.piper_worker worker - P. storage    : False 
2024-12-03 11:56:38,048 DEBUG pycompss.worker.piper.piper_worker worker - Storage cfg   : null 
2024-12-03 11:56:38,048 DEBUG pycompss.worker.piper.piper_worker worker - Is interactive: False 
2024-12-03 11:56:38,050 DEBUG pycompss.runtime.task.worker worker - Starting @task decorator worker call
2024-12-03 11:56:38,050 DEBUG pycompss.runtime.task.worker worker - Redirecting stdout to: /tmp/worker0/e8595566-d779-472e-bb9a-2628ff3fd90f/compss-extract-worker-0/jobs/job12_NEW.out
2024-12-03 11:56:38,050 DEBUG pycompss.runtime.task.worker worker - Redirecting stderr to: /tmp/worker0/e8595566-d779-472e-bb9a-2628ff3fd90f/compss-extract-worker-0/jobs/job12_NEW.err
2024-12-03 11:56:38,051 DEBUG pycompss.runtime.task.worker worker - Revealing objects
2024-12-03 11:56:38,052 DEBUG pycompss.runtime.task.worker worker - 	 - Revealing: count
2024-12-03 11:56:38,052 DEBUG pycompss.runtime.task.worker worker - 	 - checking: count
2024-12-03 11:56:38,053 DEBUG pycompss.runtime.task.worker worker - 	 - Revealing: size
2024-12-03 11:56:38,053 DEBUG pycompss.runtime.task.worker worker - 	 - checking: size
2024-12-03 11:56:38,054 DEBUG pycompss.runtime.task.worker worker - 	 - Revealing: num_blocks
2024-12-03 11:56:38,055 DEBUG pycompss.runtime.task.worker worker - 	 - checking: num_blocks
2024-12-03 11:56:38,055 DEBUG pycompss.runtime.task.worker worker - 	 - Revealing: #kwarg_seed
2024-12-03 11:56:38,056 DEBUG pycompss.runtime.task.worker worker - 	 - checking: seed
2024-12-03 11:56:38,056 DEBUG pycompss.runtime.task.worker worker - 	 - Revealing: #kwarg_set_to_zero
2024-12-03 11:56:38,057 DEBUG pycompss.runtime.task.worker worker - 	 - checking: set_to_zero
2024-12-03 11:56:38,057 DEBUG pycompss.runtime.task.worker worker - Finished revealing objects
2024-12-03 11:56:38,058 DEBUG pycompss.runtime.task.worker worker - Building task parameters structures
2024-12-03 11:56:38,058 DEBUG pycompss.runtime.task.worker worker - Finished building parameters structures.
2024-12-03 11:56:38,058 DEBUG pycompss.runtime.task.worker worker - Invoking user code
2024-12-03 11:56:38,060 DEBUG pycompss.runtime.task.worker worker - Finished user code
2024-12-03 11:56:38,060 DEBUG pycompss.runtime.task.worker worker - Dealing with INOUTs and OUTS
2024-12-03 11:56:38,061 DEBUG pycompss.runtime.task.worker worker - Dealing with returns: 1
2024-12-03 11:56:38,061 DEBUG pycompss.runtime.task.worker worker - Serializing return: /tmp/worker0/e8595566-d779-472e-bb9a-2628ff3fd90f/compss-extract-worker-0/d7v2_1733226994663.IT
2024-12-03 11:56:38,061 DEBUG pycompss.runtime.task.worker serializer - Serializing to handler: /tmp/worker0/e8595566-d779-472e-bb9a-2628ff3fd90f/compss-extract-worker-0/d7v2_1733226994663.IT
2024-12-03 11:56:38,061 DEBUG pycompss.runtime.task.worker serializer - Get serializer priority for object of type: <class 'numpy.ndarray'>
2024-12-03 11:56:38,062 DEBUG pycompss.runtime.task.worker serializer - Serializer priority: [<module 'numpy' from '/usr/local/lib/python3.8/dist-packages/numpy/__init__.py'>, <module 'pickle' from '/usr/lib/python3.8/pickle.py'>, <module 'dill' from '/usr/local/lib/python3.8/dist-packages/dill/__init__.py'>]
2024-12-03 11:56:38,062 DEBUG pycompss.runtime.task.worker serializer - Trying to serialize using numpy
2024-12-03 11:56:38,062 DEBUG pycompss.runtime.task.worker serializer - Serializing using numpy...
2024-12-03 11:56:38,062 DEBUG pycompss.runtime.task.worker serializer - Serializing using numpy success
2024-12-03 11:56:38,063 DEBUG pycompss.runtime.task.worker serializer - Serialization accomplished
2024-12-03 11:56:38,063 DEBUG pycompss.runtime.task.worker worker - Building types update
2024-12-03 11:56:38,075 DEBUG pycompss.runtime.task.worker worker - Finished @task decorator
2024-12-03 11:56:38,076 DEBUG pycompss.worker.piper.piper_worker worker - Exit code: 0 
2024-12-03 11:56:38,076 DEBUG pycompss.worker.piper.piper_worker worker - Return Types: [4, 4, 4, 4, 0, 10] 
2024-12-03 11:56:38,076 DEBUG pycompss.worker.piper.piper_worker worker - Return Values: ['null', 'null', 'null', 'null', 'null', 'null'] 
2024-12-03 11:56:38,076 DEBUG pycompss.worker.piper.piper_worker worker - Return target_direction: INOUT 
2024-12-03 11:56:38,076 DEBUG pycompss.worker.piper.piper_worker worker - Return timed_out: False 
2024-12-03 11:56:38,076 DEBUG pycompss.worker.piper.piper_worker worker - Return exception_message:  
2024-12-03 11:56:38,077 DEBUG pycompss.worker.piper.piper_worker worker - Finished task execution
2024-12-03 11:56:38,077 DEBUG pycompss.worker.piper.piper_worker worker - CLEAN TASK:
2024-12-03 11:56:38,077 DEBUG pycompss.worker.piper.piper_worker worker - END TASK execution. Status: Ok
2024-12-03 11:56:38,077 DEBUG pycompss.worker.piper.piper_worker executor - Process-1 - Pipe /tmp/worker0/e8595566-d779-472e-bb9a-2628ff3fd90f/compss-extract-worker-0/pipe_1080938191_executor1.inbound END TASK MESSAGE: END_TASK 12 0 6 4 null 4 null 4 null 4 null 0 null 10 null

2024-12-03 11:56:38,077 DEBUG pycompss.worker.piper.piper_worker executor - Cleaning environment.
2024-12-03 11:56:38,077 DEBUG pycompss.worker.piper.piper_worker executor - Restoring loggers.
2024-12-03 11:56:38,078 DEBUG pycompss.worker.piper.piper_worker executor - ----------------------------------------------------------------------------------------------------
