[EXECUTOR] executeTask - Begin task execution
WORKER - Parameters of execution:
  * Method type: METHOD
  * Method definition: [DECLARING CLASS=matmul, METHOD NAME=fused_multiply_add]
  * Parameter types: java.lang.String java.lang.String java.lang.String
  * Parameter names: A B C
  * Parameter values: /tmp/worker1/1d6c8abe-282f-4046-b0d6-48d494db66a9/compss-extract-worker-1/d25v2_1733227258602.IT /tmp/worker1/1d6c8abe-282f-4046-b0d6-48d494db66a9/compss-extract-worker-1/d8v2_1733227258602.IT /tmp/worker1/1d6c8abe-282f-4046-b0d6-48d494db66a9/compss-extract-worker-1/d33v3_1733227258602.IT
  * Parameter streams: UNSPECIFIED UNSPECIFIED UNSPECIFIED
  * Parameter prefixes: null null null
  * Has Target: false
  * Has Return: false
[INVOKER] COMPSS_HOSTNAMES: compss-extract-worker-1
[INVOKER] COMPSS_NUM_NODES: 1
[INVOKER] COMPSS_NUM_THREADS: 1
[INVOKER] COMPSS_NUM_PROCS: 1
[EXECUTOR] executeTask - End task execution
r.piper.piper_worker executor - ----------------------------------------------------------------------------------------------------
2024-12-03 12:01:03,829 DEBUG pycompss.worker.piper.piper_worker executor - Received task in process: Process-1
2024-12-03 12:01:03,829 DEBUG pycompss.worker.piper.piper_worker executor - TASK CMD: ['EXECUTE_TASK', '59', '/tmp/worker1/1d6c8abe-282f-4046-b0d6-48d494db66a9/compss-extract-worker-1/sandBox/job_59', '/tmp/worker1/1d6c8abe-282f-4046-b0d6-48d494db66a9/compss-extract-worker-1/jobs/job59_NEW.out', '/tmp/worker1/1d6c8abe-282f-4046-b0d6-48d494db66a9/compss-extract-worker-1/jobs/job59_NEW.err', 'true', '89', 'true', 'null', 'METHOD', 'matmul', 'fused_multiply_add', '0', '1', 'compss-extract-worker-1', '1', 'false', 'null', '0', '3', '10', '3', 'null', 'A', 'Future', '/tmp/worker1/1d6c8abe-282f-4046-b0d6-48d494db66a9/compss-extract-worker-1/d25v2_1733227258602.IT:d25v2_1733227258602.IT:true:false:/tmp/worker1/1d6c8abe-282f-4046-b0d6-48d494db66a9/compss-extract-worker-1/d25v2_1733227258602.IT', '10', '3', 'null', 'B', 'Future', '/tmp/worker1/1d6c8abe-282f-4046-b0d6-48d494db66a9/compss-extract-worker-1/d8v2_1733227258602.IT:d8v2_1733227258602.IT:true:false:/tmp/worker1/1d6c8abe-282f-4046-b0d6-48d494db66a9/compss-extract-worker-1/d8v2_1733227258602.IT', '10', '3', 'null', 'C', 'Future', '/tmp/worker1/1d6c8abe-282f-4046-b0d6-48d494db66a9/compss-extract-worker-1/d33v3_1733227258602.IT:d33v3_1733227258602.IT:false:true:/tmp/worker1/1d6c8abe-282f-4046-b0d6-48d494db66a9/compss-extract-worker-1/d33v3_1733227258602.IT']
2024-12-03 12:01:03,829 DEBUG pycompss.worker.piper.piper_worker executor - Process environment:
2024-12-03 12:01:03,829 DEBUG pycompss.worker.piper.piper_worker executor - 	 - Number of nodes: 1
2024-12-03 12:01:03,830 DEBUG pycompss.worker.piper.piper_worker executor - 	 - Hostnames: compss-extract-worker-1
2024-12-03 12:01:03,830 DEBUG pycompss.worker.piper.piper_worker executor - 	 - Number of threads: 1
2024-12-03 12:01:03,830 DEBUG pycompss.worker.piper.piper_worker worker - BEGIN TASK execution in Process-1
2024-12-03 12:01:03,831 DEBUG pycompss.worker.piper.piper_worker worker - COMPSs parameters:
2024-12-03 12:01:03,831 DEBUG pycompss.worker.piper.piper_worker worker - 	- Storage conf: null
2024-12-03 12:01:03,831 DEBUG pycompss.worker.piper.piper_worker worker - 	- Logger cfg: /opt/COMPSs/Bindings/python/3/pycompss/worker/piper/commons/../../../../log/logging_worker_debug.json
2024-12-03 12:01:03,831 DEBUG pycompss.worker.piper.piper_worker worker - 	- Log out file: /tmp/worker1/1d6c8abe-282f-4046-b0d6-48d494db66a9/compss-extract-worker-1/jobs/job59_NEW.out
2024-12-03 12:01:03,831 DEBUG pycompss.worker.piper.piper_worker worker - 	- Log err file: /tmp/worker1/1d6c8abe-282f-4046-b0d6-48d494db66a9/compss-extract-worker-1/jobs/job59_NEW.err
2024-12-03 12:01:03,832 DEBUG pycompss.worker.piper.piper_worker worker - 	- Params: ['matmul', 'fused_multiply_add', '0', '1', 'compss-extract-worker-1', '1', 'false', 'null', '0', '3', '10', '3', 'null', 'A', 'Future', '/tmp/worker1/1d6c8abe-282f-4046-b0d6-48d494db66a9/compss-extract-worker-1/d25v2_1733227258602.IT:d25v2_1733227258602.IT:true:false:/tmp/worker1/1d6c8abe-282f-4046-b0d6-48d494db66a9/compss-extract-worker-1/d25v2_1733227258602.IT', '10', '3', 'null', 'B', 'Future', '/tmp/worker1/1d6c8abe-282f-4046-b0d6-48d494db66a9/compss-extract-worker-1/d8v2_1733227258602.IT:d8v2_1733227258602.IT:true:false:/tmp/worker1/1d6c8abe-282f-4046-b0d6-48d494db66a9/compss-extract-worker-1/d8v2_1733227258602.IT', '10', '3', 'null', 'C', 'Future', '/tmp/worker1/1d6c8abe-282f-4046-b0d6-48d494db66a9/compss-extract-worker-1/d33v3_1733227258602.IT:d33v3_1733227258602.IT:false:true:/tmp/worker1/1d6c8abe-282f-4046-b0d6-48d494db66a9/compss-extract-worker-1/d33v3_1733227258602.IT']
2024-12-03 12:01:03,832 DEBUG pycompss.worker.piper.piper_worker worker - 	- Path: matmul
2024-12-03 12:01:03,832 DEBUG pycompss.worker.piper.piper_worker worker - 	- Method name: fused_multiply_add
2024-12-03 12:01:03,832 DEBUG pycompss.worker.piper.piper_worker worker - 	- Num slaves: 1
2024-12-03 12:01:03,832 DEBUG pycompss.worker.piper.piper_worker worker - 	- Slaves: ['1']
2024-12-03 12:01:03,833 DEBUG pycompss.worker.piper.piper_worker worker - 	- Cus: 1
2024-12-03 12:01:03,833 DEBUG pycompss.worker.piper.piper_worker worker - 	- Has target: false
2024-12-03 12:01:03,833 DEBUG pycompss.worker.piper.piper_worker worker - 	- Num Params: 3
2024-12-03 12:01:03,833 DEBUG pycompss.worker.piper.piper_worker worker - 	- Return Length: 0
2024-12-03 12:01:03,833 DEBUG pycompss.worker.piper.piper_worker worker - 	- Args: ['10', '3', 'null', 'A', 'Future', '/tmp/worker1/1d6c8abe-282f-4046-b0d6-48d494db66a9/compss-extract-worker-1/d25v2_1733227258602.IT:d25v2_1733227258602.IT:true:false:/tmp/worker1/1d6c8abe-282f-4046-b0d6-48d494db66a9/compss-extract-worker-1/d25v2_1733227258602.IT', '10', '3', 'null', 'B', 'Future', '/tmp/worker1/1d6c8abe-282f-4046-b0d6-48d494db66a9/compss-extract-worker-1/d8v2_1733227258602.IT:d8v2_1733227258602.IT:true:false:/tmp/worker1/1d6c8abe-282f-4046-b0d6-48d494db66a9/compss-extract-worker-1/d8v2_1733227258602.IT', '10', '3', 'null', 'C', 'Future', '/tmp/worker1/1d6c8abe-282f-4046-b0d6-48d494db66a9/compss-extract-worker-1/d33v3_1733227258602.IT:d33v3_1733227258602.IT:false:true:/tmp/worker1/1d6c8abe-282f-4046-b0d6-48d494db66a9/compss-extract-worker-1/d33v3_1733227258602.IT']
2024-12-03 12:01:03,834 DEBUG pycompss.worker.piper.piper_worker worker - 	- COMPSs kwargs:
2024-12-03 12:01:03,834 DEBUG pycompss.worker.piper.piper_worker worker - 	- Is interactive: False
2024-12-03 12:01:03,834 DEBUG pycompss.worker.piper.piper_worker worker - 	- Interactive source: 
2024-12-03 12:01:03,834 DEBUG pycompss.worker.piper.piper_worker worker - 		- compss_key: True
2024-12-03 12:01:03,834 DEBUG pycompss.worker.piper.piper_worker worker - 		- compss_tracing: True
2024-12-03 12:01:03,835 DEBUG pycompss.worker.piper.piper_worker worker - 		- compss_process_name: Process-1
2024-12-03 12:01:03,835 DEBUG pycompss.worker.piper.piper_worker worker - 		- compss_storage_conf: null
2024-12-03 12:01:03,835 DEBUG pycompss.worker.piper.piper_worker worker - 		- compss_return_length: 0
2024-12-03 12:01:03,835 DEBUG pycompss.worker.piper.piper_worker worker - 		- compss_logger: <Logger pycompss.worker.piper.piper_worker (DEBUG)>
2024-12-03 12:01:03,835 DEBUG pycompss.worker.piper.piper_worker worker - 		- compss_log_cfg: /opt/COMPSs/Bindings/python/3/pycompss/worker/piper/commons/../../../../log/logging_worker_debug.json
2024-12-03 12:01:03,836 DEBUG pycompss.worker.piper.piper_worker worker - 		- compss_log_files: ('/tmp/worker1/1d6c8abe-282f-4046-b0d6-48d494db66a9/compss-extract-worker-1/jobs/job59_NEW.out', '/tmp/worker1/1d6c8abe-282f-4046-b0d6-48d494db66a9/compss-extract-worker-1/jobs/job59_NEW.err')
2024-12-03 12:01:03,836 DEBUG pycompss.worker.piper.piper_worker worker - 		- compss_python_MPI: False
2024-12-03 12:01:03,836 DEBUG pycompss.worker.piper.piper_worker worker - 		- compss_collections_layouts: {}
2024-12-03 12:01:03,836 DEBUG pycompss.worker.piper.piper_worker worker - 		- compss_cache: (None, None, None, False)
2024-12-03 12:01:03,836 DEBUG pycompss.worker.piper.piper_worker worker - Processing parameters:
2024-12-03 12:01:03,837 DEBUG pycompss.worker.piper.piper_worker worker - Parameter : 0
2024-12-03 12:01:03,837 DEBUG pycompss.worker.piper.piper_worker worker - 	 * Type : 10
2024-12-03 12:01:03,837 DEBUG pycompss.worker.piper.piper_worker worker - 	 * Std IO Stream : 3
2024-12-03 12:01:03,837 DEBUG pycompss.worker.piper.piper_worker worker - 	 * Prefix : null
2024-12-03 12:01:03,837 DEBUG pycompss.worker.piper.piper_worker worker - 	 * Name : A
2024-12-03 12:01:03,838 DEBUG pycompss.worker.piper.piper_worker worker - 	 * Content Type: 'Future'
2024-12-03 12:01:03,838 DEBUG pycompss.worker.piper.piper_worker worker - 	 * Value: '/tmp/worker1/1d6c8abe-282f-4046-b0d6-48d494db66a9/compss-extract-worker-1/d25v2_1733227258602.IT:d25v2_1733227258602.IT:true:false:/tmp/worker1/1d6c8abe-282f-4046-b0d6-48d494db66a9/compss-extract-worker-1/d25v2_1733227258602.IT'
2024-12-03 12:01:03,838 DEBUG pycompss.worker.piper.piper_worker worker - 	 * Updated type : 10
2024-12-03 12:01:03,838 DEBUG pycompss.worker.piper.piper_worker worker - Parameter : 1
2024-12-03 12:01:03,839 DEBUG pycompss.worker.piper.piper_worker worker - 	 * Type : 10
2024-12-03 12:01:03,839 DEBUG pycompss.worker.piper.piper_worker worker - 	 * Std IO Stream : 3
2024-12-03 12:01:03,839 DEBUG pycompss.worker.piper.piper_worker worker - 	 * Prefix : null
2024-12-03 12:01:03,839 DEBUG pycompss.worker.piper.piper_worker worker - 	 * Name : B
2024-12-03 12:01:03,839 DEBUG pycompss.worker.piper.piper_worker worker - 	 * Content Type: 'Future'
2024-12-03 12:01:03,840 DEBUG pycompss.worker.piper.piper_worker worker - 	 * Value: '/tmp/worker1/1d6c8abe-282f-4046-b0d6-48d494db66a9/compss-extract-worker-1/d8v2_1733227258602.IT:d8v2_1733227258602.IT:true:false:/tmp/worker1/1d6c8abe-282f-4046-b0d6-48d494db66a9/compss-extract-worker-1/d8v2_1733227258602.IT'
2024-12-03 12:01:03,840 DEBUG pycompss.worker.piper.piper_worker worker - 	 * Updated type : 10
2024-12-03 12:01:03,840 DEBUG pycompss.worker.piper.piper_worker worker - Parameter : 2
2024-12-03 12:01:03,840 DEBUG pycompss.worker.piper.piper_worker worker - 	 * Type : 10
2024-12-03 12:01:03,840 DEBUG pycompss.worker.piper.piper_worker worker - 	 * Std IO Stream : 3
2024-12-03 12:01:03,841 DEBUG pycompss.worker.piper.piper_worker worker - 	 * Prefix : null
2024-12-03 12:01:03,841 DEBUG pycompss.worker.piper.piper_worker worker - 	 * Name : C
2024-12-03 12:01:03,841 DEBUG pycompss.worker.piper.piper_worker worker - 	 * Content Type: 'Future'
2024-12-03 12:01:03,841 DEBUG pycompss.worker.piper.piper_worker worker - 	 * Value: '/tmp/worker1/1d6c8abe-282f-4046-b0d6-48d494db66a9/compss-extract-worker-1/d33v3_1733227258602.IT:d33v3_1733227258602.IT:false:true:/tmp/worker1/1d6c8abe-282f-4046-b0d6-48d494db66a9/compss-extract-worker-1/d33v3_1733227258602.IT'
2024-12-03 12:01:03,841 DEBUG pycompss.worker.piper.piper_worker worker - 	 * Updated type : 10
2024-12-03 12:01:03,842 DEBUG pycompss.worker.piper.piper_worker worker - RUN TASK with arguments:
2024-12-03 12:01:03,842 DEBUG pycompss.worker.piper.piper_worker worker - 	- Path: matmul
2024-12-03 12:01:03,842 DEBUG pycompss.worker.piper.piper_worker worker - 	- Method/function name: fused_multiply_add
2024-12-03 12:01:03,842 DEBUG pycompss.worker.piper.piper_worker worker - 	- Has target: false
2024-12-03 12:01:03,842 DEBUG pycompss.worker.piper.piper_worker worker - 	- # parameters: 3
2024-12-03 12:01:03,843 DEBUG pycompss.worker.piper.piper_worker worker - LOAD TASK:
2024-12-03 12:01:03,843 DEBUG pycompss.worker.piper.piper_worker worker - 	- Trying to import the user module: matmul
2024-12-03 12:01:03,843 DEBUG pycompss.worker.piper.piper_worker worker - Module successfully loaded
2024-12-03 12:01:03,843 DEBUG pycompss.worker.piper.piper_worker worker - EXECUTE TASK:
2024-12-03 12:01:03,844 DEBUG pycompss.worker.piper.piper_worker worker - Starting task execution
2024-12-03 12:01:03,845 DEBUG pycompss.worker.piper.piper_worker worker - module        : <module 'matmul' from '/home/omartinez/compss-matmul/matmul-extract/matmul.py'> 
2024-12-03 12:01:03,846 DEBUG pycompss.worker.piper.piper_worker worker - method_name   : fused_multiply_add 
2024-12-03 12:01:03,848 DEBUG pycompss.worker.piper.piper_worker worker - time_out      : 0 
2024-12-03 12:01:03,848 DEBUG pycompss.worker.piper.piper_worker worker - Types         : [10, 10, 10] 
2024-12-03 12:01:03,849 DEBUG pycompss.worker.piper.piper_worker worker - Values        : [Parameter(name=A
          type=10, direction=0, stream=3, prefix=null
          extra_content_type=Future
          file_name=Source: /tmp/worker1/1d6c8abe-282f-4046-b0d6-48d494db66a9/compss-extract-worker-1/d25v2_1733227258602.IT, Destination: d25v2_1733227258602.IT, Keep source: True, Is write final: False, Original path: /tmp/worker1/1d6c8abe-282f-4046-b0d6-48d494db66a9/compss-extract-worker-1/d25v2_1733227258602.IT
          is_future=False
          is_file_collection=False, depth=9223372036854775807
          weight=1.0
          keep_rename=True
          cache=True
          content=), Parameter(name=B
          type=10, direction=0, stream=3, prefix=null
          extra_content_type=Future
          file_name=Source: /tmp/worker1/1d6c8abe-282f-4046-b0d6-48d494db66a9/compss-extract-worker-1/d8v2_1733227258602.IT, Destination: d8v2_1733227258602.IT, Keep source: True, Is write final: False, Original path: /tmp/worker1/1d6c8abe-282f-4046-b0d6-48d494db66a9/compss-extract-worker-1/d8v2_1733227258602.IT
          is_future=False
          is_file_collection=False, depth=9223372036854775807
          weight=1.0
          keep_rename=True
          cache=True
          content=), Parameter(name=C
          type=10, direction=0, stream=3, prefix=null
          extra_content_type=Future
          file_name=Source: /tmp/worker1/1d6c8abe-282f-4046-b0d6-48d494db66a9/compss-extract-worker-1/d33v3_1733227258602.IT, Destination: d33v3_1733227258602.IT, Keep source: False, Is write final: True, Original path: /tmp/worker1/1d6c8abe-282f-4046-b0d6-48d494db66a9/compss-extract-worker-1/d33v3_1733227258602.IT
          is_future=False
          is_file_collection=False, depth=9223372036854775807
          weight=1.0
          keep_rename=True
          cache=True
          content=)] 
2024-12-03 12:01:03,849 DEBUG pycompss.worker.piper.piper_worker worker - P. storage    : False 
2024-12-03 12:01:03,850 DEBUG pycompss.worker.piper.piper_worker worker - Storage cfg   : null 
2024-12-03 12:01:03,850 DEBUG pycompss.worker.piper.piper_worker worker - Is interactive: False 
2024-12-03 12:01:03,854 DEBUG pycompss.runtime.task.worker worker - Starting @task decorator worker call
2024-12-03 12:01:03,854 DEBUG pycompss.runtime.task.worker worker - Redirecting stdout to: /tmp/worker1/1d6c8abe-282f-4046-b0d6-48d494db66a9/compss-extract-worker-1/jobs/job59_NEW.out
2024-12-03 12:01:03,854 DEBUG pycompss.runtime.task.worker worker - Redirecting stderr to: /tmp/worker1/1d6c8abe-282f-4046-b0d6-48d494db66a9/compss-extract-worker-1/jobs/job59_NEW.err
2024-12-03 12:01:03,855 DEBUG pycompss.runtime.task.worker worker - Revealing objects
2024-12-03 12:01:03,857 DEBUG pycompss.runtime.task.worker worker - 	 - Revealing: A
2024-12-03 12:01:03,858 DEBUG pycompss.runtime.task.worker worker - 	 - checking: A
2024-12-03 12:01:03,858 DEBUG pycompss.runtime.task.worker worker - 		 - It is an OBJECT. Deserializing from file: /tmp/worker1/1d6c8abe-282f-4046-b0d6-48d494db66a9/compss-extract-worker-1/d25v2_1733227258602.IT
2024-12-03 12:01:03,858 DEBUG pycompss.runtime.task.worker serializer - Deserializing from handler: /tmp/worker1/1d6c8abe-282f-4046-b0d6-48d494db66a9/compss-extract-worker-1/d25v2_1733227258602.IT
2024-12-03 12:01:03,859 DEBUG pycompss.runtime.task.worker serializer - Using deserializer: numpy
2024-12-03 12:01:03,859 DEBUG pycompss.runtime.task.worker serializer - Numpy available
2024-12-03 12:01:03,859 DEBUG pycompss.runtime.task.worker serializer - Deserializing using numpy
2024-12-03 12:01:03,862 DEBUG pycompss.runtime.task.worker serializer - Deserialization accomplished
2024-12-03 12:01:03,862 DEBUG pycompss.runtime.task.worker worker - 		 - Deserialization finished
2024-12-03 12:01:03,862 DEBUG pycompss.runtime.task.worker worker - 	 - Revealing: B
2024-12-03 12:01:03,863 DEBUG pycompss.runtime.task.worker worker - 	 - checking: B
2024-12-03 12:01:03,863 DEBUG pycompss.runtime.task.worker worker - 		 - It is an OBJECT. Deserializing from file: /tmp/worker1/1d6c8abe-282f-4046-b0d6-48d494db66a9/compss-extract-worker-1/d8v2_1733227258602.IT
2024-12-03 12:01:03,863 DEBUG pycompss.runtime.task.worker serializer - Deserializing from handler: /tmp/worker1/1d6c8abe-282f-4046-b0d6-48d494db66a9/compss-extract-worker-1/d8v2_1733227258602.IT
2024-12-03 12:01:03,863 DEBUG pycompss.runtime.task.worker serializer - Using deserializer: numpy
2024-12-03 12:01:03,864 DEBUG pycompss.runtime.task.worker serializer - Numpy available
2024-12-03 12:01:03,864 DEBUG pycompss.runtime.task.worker serializer - Deserializing using numpy
2024-12-03 12:01:03,866 DEBUG pycompss.runtime.task.worker serializer - Deserialization accomplished
2024-12-03 12:01:03,867 DEBUG pycompss.runtime.task.worker worker - 		 - Deserialization finished
2024-12-03 12:01:03,867 DEBUG pycompss.runtime.task.worker worker - 	 - Revealing: C
2024-12-03 12:01:03,867 DEBUG pycompss.runtime.task.worker worker - 	 - checking: C
2024-12-03 12:01:03,867 DEBUG pycompss.runtime.task.worker worker - 		 - It is an OBJECT. Deserializing from file: /tmp/worker1/1d6c8abe-282f-4046-b0d6-48d494db66a9/compss-extract-worker-1/d33v3_1733227258602.IT
2024-12-03 12:01:03,868 DEBUG pycompss.runtime.task.worker serializer - Deserializing from handler: /tmp/worker1/1d6c8abe-282f-4046-b0d6-48d494db66a9/compss-extract-worker-1/d33v3_1733227258602.IT
2024-12-03 12:01:03,868 DEBUG pycompss.runtime.task.worker serializer - Using deserializer: numpy
2024-12-03 12:01:03,868 DEBUG pycompss.runtime.task.worker serializer - Numpy available
2024-12-03 12:01:03,869 DEBUG pycompss.runtime.task.worker serializer - Deserializing using numpy
2024-12-03 12:01:03,871 DEBUG pycompss.runtime.task.worker serializer - Deserialization accomplished
2024-12-03 12:01:03,871 DEBUG pycompss.runtime.task.worker worker - 		 - Deserialization finished
2024-12-03 12:01:03,872 DEBUG pycompss.runtime.task.worker worker - Finished revealing objects
2024-12-03 12:01:03,872 DEBUG pycompss.runtime.task.worker worker - Building task parameters structures
2024-12-03 12:01:03,872 DEBUG pycompss.runtime.task.worker worker - Finished building parameters structures.
2024-12-03 12:01:03,873 DEBUG pycompss.runtime.task.worker worker - Invoking user code
2024-12-03 12:01:03,932 DEBUG pycompss.runtime.task.worker worker - Finished user code
2024-12-03 12:01:03,933 DEBUG pycompss.runtime.task.worker worker - Dealing with INOUTs and OUTS
2024-12-03 12:01:03,933 DEBUG pycompss.runtime.task.worker worker - Serializing object: C to /tmp/worker1/1d6c8abe-282f-4046-b0d6-48d494db66a9/compss-extract-worker-1/d33v3_1733227258602.IT
2024-12-03 12:01:03,934 DEBUG pycompss.runtime.task.worker serializer - Serializing to handler: /tmp/worker1/1d6c8abe-282f-4046-b0d6-48d494db66a9/compss-extract-worker-1/d33v3_1733227258602.IT
2024-12-03 12:01:03,934 DEBUG pycompss.runtime.task.worker serializer - Get serializer priority for object of type: <class 'numpy.ndarray'>
2024-12-03 12:01:03,935 DEBUG pycompss.runtime.task.worker serializer - Serializer priority: [<module 'numpy' from '/usr/local/lib/python3.8/dist-packages/numpy/__init__.py'>, <module 'pickle' from '/usr/lib/python3.8/pickle.py'>, <module 'dill' from '/usr/local/lib/python3.8/dist-packages/dill/__init__.py'>]
2024-12-03 12:01:03,935 DEBUG pycompss.runtime.task.worker serializer - Trying to serialize using numpy
2024-12-03 12:01:03,935 DEBUG pycompss.runtime.task.worker serializer - Serializing using numpy...
2024-12-03 12:01:03,936 DEBUG pycompss.runtime.task.worker serializer - Serializing using numpy success
2024-12-03 12:01:03,936 DEBUG pycompss.runtime.task.worker serializer - Serialization accomplished
2024-12-03 12:01:03,937 DEBUG pycompss.runtime.task.worker worker - Dealing with returns: 0
2024-12-03 12:01:03,938 DEBUG pycompss.runtime.task.worker worker - Building types update
2024-12-03 12:01:03,971 DEBUG pycompss.runtime.task.worker worker - Finished @task decorator
2024-12-03 12:01:03,971 DEBUG pycompss.worker.piper.piper_worker worker - Exit code: 0 
2024-12-03 12:01:03,972 DEBUG pycompss.worker.piper.piper_worker worker - Return Types: [10, 10, 10] 
2024-12-03 12:01:03,972 DEBUG pycompss.worker.piper.piper_worker worker - Return Values: ['null', 'null', 'null'] 
2024-12-03 12:01:03,972 DEBUG pycompss.worker.piper.piper_worker worker - Return target_direction: INOUT 
2024-12-03 12:01:03,973 DEBUG pycompss.worker.piper.piper_worker worker - Return timed_out: False 
2024-12-03 12:01:03,973 DEBUG pycompss.worker.piper.piper_worker worker - Return exception_message:  
2024-12-03 12:01:03,973 DEBUG pycompss.worker.piper.piper_worker worker - Finished task execution
2024-12-03 12:01:03,974 DEBUG pycompss.worker.piper.piper_worker worker - CLEAN TASK:
2024-12-03 12:01:03,974 DEBUG pycompss.worker.piper.piper_worker worker - END TASK execution. Status: Ok
2024-12-03 12:01:03,975 DEBUG pycompss.worker.piper.piper_worker executor - Process-1 - Pipe /tmp/worker1/1d6c8abe-282f-4046-b0d6-48d494db66a9/compss-extract-worker-1/pipe_788076486_executor1.inbound END TASK MESSAGE: END_TASK 59 0 3 10 null 10 null 10 null

2024-12-03 12:01:03,975 DEBUG pycompss.worker.piper.piper_worker executor - Cleaning environment.
2024-12-03 12:01:03,975 DEBUG pycompss.worker.piper.piper_worker executor - Restoring loggers.
2024-12-03 12:01:03,975 DEBUG pycompss.worker.piper.piper_worker executor - ----------------------------------------------------------------------------------------------------
