client_order=agx15
-----------------------------------------------------------
Server listening on 5201
-----------------------------------------------------------
Accepted connection from 10.244.2.73, port 43012
[  5] local 10.244.1.53 port 5201 connected to 10.244.2.73 port 43018
[ ID] Interval           Transfer     Bitrate
[  5]   0.00-1.00   sec   103 MBytes   103 MBytes/sec                  
[  5]   1.00-2.00   sec   108 MBytes   108 MBytes/sec                  
[  5]   2.00-3.00   sec   108 MBytes   108 MBytes/sec                  
[  5]   3.00-4.00   sec   108 MBytes   108 MBytes/sec                  
[  5]   4.00-5.00   sec   108 MBytes   108 MBytes/sec                  
[  5]   5.00-6.00   sec   108 MBytes   108 MBytes/sec                  
[  5]   6.00-7.00   sec   108 MBytes   108 MBytes/sec                  
[  5]   7.00-8.00   sec   108 MBytes   108 MBytes/sec                  
[  5]   8.00-9.00   sec   108 MBytes   108 MBytes/sec                  
[  5]   9.00-10.00  sec   108 MBytes   108 MBytes/sec                  
[  5]  10.00-10.07  sec  7.17 MBytes   107 MBytes/sec                  
- - - - - - - - - - - - - - - - - - - - - - - - -
[ ID] Interval           Transfer     Bitrate
[  5]   0.00-10.07  sec  1.06 GBytes   108 MBytes/sec                  receiver
