#define isize 16 
#define bsize  16 
// Input_f 
static float input_f[isize] = {6.125, 6.5, 7.625, 1.25, -4.53125, -3.4375, -0.125, 6.25, 8.5, -0.5, 4.6875, 2.1875, 0, 5.625, -2.8125, -7.34375};

// Input_nn 
static uint16_t input_nn[isize] = {16580, 16592, 16628, 16288, 49297, 49244, 48640, 16584, 16648, 48896, 16534, 16396, 0, 16564, 49204, 49387};

// Weight_f 
static float weight_f[isize] [bsize] = {
    {-2.34375, -2.03125, 6.5, 0.5, 8, 7.75, 1.875, -6.5625, -2.5, 5.3125, 8.125, 7.25, -1.375, 9.375, 8.875, -7.1875},
    {5, 5, -8.875, -6.25, 8.625, -8.25, 0.3125, -7.8125, 3.875, -3.125, 9.375, -8.625, 0.9375, 0.3125, -1.75, 5.625},
    {2.8125, -1.125, 7.625, 8, -9.375, -0.75, 6.5, -8.4375, -7.03125, -7.03125, 2.625, 3.875, -3.125, -1.5625, -6.5625, -5.46875},
    {2.8125, -1.5625, 2.1875, 6.875, -1.5625, 3.875, -2.8125, -5.3125, 3.125, 7.5, -5.15625, 4.375, 5.75, 3.875, 2.1875, -8.875},
    {-5.3125, 9.875, 8.125, -1.75, -2.1875, 7.5, 7.5, 3.125, 8.25, -9.25, 6.875, 3, -6.71875, -9.5, -5, -4.21875},
    {-9.6875, 4.25, -1.375, -2.1875, -5.3125, -4.84375, 2, 4.6875, -7.1875, -9.875, 3.75, -4.0625, 3, 4.5, -5.46875, -9.0625},
    {-4.21875, 7, 5, 4.6875, -0.9375, -9.875, -9.6875, 4.0625, 5.125, -1.25, -7.34375, 8.5, -5.3125, 8.125, -6.09375, 2.625},
    {-0.3125, -5.78125, 8.125, -2.1875, 0.5, -2.96875, 9.875, -7.03125, -8.4375, -4.0625, -1.25, -6.25, 5, -6.40625, 5.625, -6.25},
    {0, -0.625, 2.5, -6.875, 7.75, -0.75, 5.125, -5.46875, 6.125, -2.5, -5.78125, 5.5, -7.1875, 3.4375, -0.3125, -8.25},
    {5.125, 5.5, -0.9375, -1.5625, 2.8125, 8.125, -8.875, -3.28125, -0.75, 3.4375, -4.0625, 6.75, 1.75, 4.375, 4.5, -6.71875},
    {5.625, 0.625, -0.5, 4.875, -6.875, 6.5, -7.65625, -2.5, 2, -5, 9.5, 6.25, 7.625, 1.75, -1.875, 0},
    {3, -4.21875, 4.25, 4.6875, -2.03125, 6.125, 3, -3.90625, -3.90625, 1.5625, -2.1875, 5, -6.875, -1.25, -3.28125, 1.25},
    {4.0625, -2.65625, -7.96875, -3.59375, -0.3125, -8.25, 7.75, 4.5, -10, -10, 9.375, 1.375, -0.125, -4.375, -4.6875, -5.46875},
    {9, 8.125, 8.875, -9.375, -2.96875, 0.75, -0.5, 9, 8.625, -0.9375, -9.5, 2.375, 8.75, 8.25, 0.5, -4.6875},
    {-4.84375, 1.375, 0, 9.375, 7, 9.875, -7.03125, 2.1875, 3.875, 4.25, -4.84375, 9, -3.59375, -4.6875, -4.375, -5.46875},
    {-4.53125, -4.53125, 3.875, 8.75, 3.25, -4.0625, 5.75, -3.59375, -1.375, 8.875, -1.875, -5.46875, 3, -9.25, 0.625, -7.5},
};
// Weight_nn 
static uint16_t   weight_nn[8] [32] = {
    {49174, 49154, 16592, 16128, 16544, 16544, 49422, 49352, 16436, 49040, 16628, 16640, 16436, 49096, 16396, 16604, 16640, 16632, 16368, 49362, 16650, 49412, 16032, 49402, 49430, 48960, 16592, 49415, 49096, 16504, 49204, 49322},
    {49322, 16670, 16642, 49120, 49435, 16520, 49072, 49164, 49287, 16608, 16544, 16534, 48800, 49337, 16642, 49164, 49164, 16624, 16624, 16456, 49322, 49307, 16384, 16534, 49008, 49438, 49435, 16514, 16128, 49214, 16670, 49377},
    {49184, 16554, 16642, 16616, 16504, 49224, 16662, 49418, 49377, 49377, 16424, 16504, 16456, 16624, 49317, 16524, 49072, 16662, 16654, 49382, 16240, 16032, 49120, 16564, 49224, 49096, 49362, 49327, 16568, 16504, 16396, 49422},
    {16644, 49428, 16604, 16448, 49382, 49438, 16496, 49282, 16548, 49056, 49387, 16648, 49415, 49282, 49056, 49352, 49367, 49432, 49312, 49287, 16448, 16528, 49327, 49425, 49322, 16642, 49347, 16424, 16544, 49357, 16564, 49352},
    {0, 48928, 16416, 49372, 16548, 16560, 49008, 49096, 16564, 16160, 48896, 16540, 16448, 49287, 16520, 16534, 16632, 48960, 16548, 49327, 16436, 16642, 49422, 49234, 49372, 16592, 49397, 49184, 49154, 16580, 16448, 49274},
    {16514, 49194, 49407, 49254, 16656, 16642, 16654, 49430, 49307, 16304, 0, 16662, 49297, 49297, 16504, 16652, 48800, 49412, 16632, 16528, 49214, 16192, 48896, 16656, 16608, 16670, 49377, 16396, 16464, 49282, 16568, 49254},
    {16580, 49184, 49337, 16560, 48960, 16476, 49282, 16600, 16384, 49312, 16664, 16584, 49274, 16328, 49164, 16544, 49382, 16476, 48800, 49412, 16352, 16524, 16528, 49367, 16628, 16352, 49136, 0, 49372, 49056, 49234, 16288},
    {49440, 49440, 16662, 16304, 16650, 49008, 49432, 16408, 16504, 16520, 49307, 16656, 49072, 16654, 49136, 49327, 48640, 49292, 49302, 49327, 16652, 16644, 16128, 49302, 49254, 49302, 49292, 49327, 16448, 49428, 16160, 49392},
};
// Bias_f 
static float bias_f[bsize] = {2.5, 6.875, -4.6875, -3.59375, -7.34375, 2.8125, -5.15625, 4.5, -2.34375, -2.65625, 4.875, -8.4375, -7.34375, -7.96875, -7.1875, -9.875};

// Bias_nn 
static uint16_t bias_nn[isize] = {16416, 16604, 49302, 49254, 49387, 16436, 49317, 16528, 49174, 49194, 16540, 49415, 49387, 49407, 49382, 49438};

// Output_f 
volatile float output_f[bsize] = {0, 0, 0, 0, 0, 0, 0, 0, 0, 0, 0, 0, 0, 0, 0, 0};

// Output_nn 
volatile uint16_t output_nn[bsize] = {1, 1, 1, 1, 1, 1, 1, 0, 0, 0, 0, 0, 0, 0, 1, 1};

// expected_f 
static float expected_f[bsize] = {229.44434, -19.20996, 106.515625, -138.28125, 23.242188, 0.8359375, 69.88672, -226.42285, -7.2441406, -109.43359, 44.802734, 86.98535, 21.762695, 190.95703, 55.51953, -79.19043};

// expected_nn 
volatile uint16_t expected_nn[bsize] = {17254, 49558, 17109, 49930, 16831, 16182, 17036, 50019, 49369, 49883, 16950, 17071, 16816, 17214, 16990, 49824};

static float expected_nn_bfloat[bsize] = {230.0, -18.75, 106.5, -138.0, 23.875, 0.7109375, 70.0, -227.0, -6.78125, -109.5, 45.5, 87.5, 22.0, 190.0, 55.5, -80.0};

// 							      229.444336 -19.209961 106.515625 -138.281250 23.242188 0.835938 69.886719 -226.422852 -7.244141 -109.433594 44.802734 86.985352 21.762695 190.957031 55.519531 -79.190430