"No","year","month","day","hour","PM2.5","PM10","SO2","NO2","CO","O3","TEMP","PRES","DEWP","RAIN","wd","WSPM","station"
1,2013,3,1,0,4,4,4,7,300,77,-0.7,1023,-18.8,0,"NNW",4.4,"Aotizhongxin"
2,2013,3,1,1,8,8,4,7,300,77,-1.1,1023.2,-18.2,0,"N",4.7,"Aotizhongxin"
3,2013,3,1,2,7,7,5,10,300,73,-1.1,1023.5,-18.2,0,"NNW",5.6,"Aotizhongxin"
4,2013,3,1,3,6,6,11,11,300,72,-1.4,1024.5,-19.4,0,"NW",3.1,"Aotizhongxin"
5,2013,3,1,4,3,3,12,12,300,72,-2,1025.2,-19.5,0,"N",2,"Aotizhongxin"
6,2013,3,1,5,5,5,18,18,400,66,-2.2,1025.6,-19.6,0,"N",3.7,"Aotizhongxin"
7,2013,3,1,6,3,3,18,32,500,50,-2.6,1026.5,-19.1,0,"NNE",2.5,"Aotizhongxin"
8,2013,3,1,7,3,6,19,41,500,43,-1.6,1027.4,-19.1,0,"NNW",3.8,"Aotizhongxin"
9,2013,3,1,8,3,6,16,43,500,45,0.1,1028.3,-19.2,0,"NNW",4.1,"Aotizhongxin"
10,2013,3,1,9,3,8,12,28,400,59,1.2,1028.5,-19.3,0,"N",2.6,"Aotizhongxin"
11,2013,3,1,10,3,6,9,12,400,72,1.9,1028.2,-19.4,0,"NNW",3.6,"Aotizhongxin"
12,2013,3,1,11,3,6,9,14,400,71,2.9,1028.2,-20.5,0,"N",3.7,"Aotizhongxin"
13,2013,3,1,12,3,6,7,13,300,74,3.9,1027.3,-19.7,0,"NNW",5.1,"Aotizhongxin"
14,2013,3,1,13,3,6,7,12,400,76,5.3,1026.2,-19.3,0,"NW",4.3,"Aotizhongxin"
15,2013,3,1,14,6,9,7,11,400,77,6,1025.9,-19.6,0,"NW",4.4,"Aotizhongxin"
16,2013,3,1,15,8,15,7,14,400,76,6.2,1025.7,-18.6,0,"NNE",2.8,"Aotizhongxin"
17,2013,3,1,16,9,19,9,13,400,76,5.9,1025.6,-18.1,0,"NNW",3.9,"Aotizhongxin"
18,2013,3,1,17,10,23,11,15,400,74,4.3,1026.3,-18.7,0,"NNE",2.8,"Aotizhongxin"
19,2013,3,1,18,11,20,8,20,500,70,3.1,1027.4,-18.4,0,"NNE",2.1,"Aotizhongxin"
20,2013,3,1,19,8,14,12,30,500,60,2.3,1028.3,-18.4,0,"N",2.8,"Aotizhongxin"
21,2013,3,1,20,11,17,13,33,600,55,1.7,1029.1,-17.3,0,"N",2.1,"Aotizhongxin"
22,2013,3,1,21,12,18,16,35,500,50,0.6,1030.1,-16.7,0,"ENE",0.8,"Aotizhongxin"
23,2013,3,1,22,15,19,21,57,700,32,0.9,1030.5,-17.4,0,"ENE",1.8,"Aotizhongxin"
24,2013,3,1,23,24,24,26,54,600,36,-0.2,1030.5,-17.4,0,"ENE",1.4,"Aotizhongxin"
25,2013,3,2,0,22,24,24,44,500,44,-0.4,1031,-17.6,0,"ENE",1.4,"Aotizhongxin"
26,2013,3,2,1,14,17,21,36,400,50,-1,1031.3,-17.3,0,"NNE",1.1,"Aotizhongxin"
27,2013,3,2,2,13,13,20,37,400,47,-1.5,1030.9,-16.9,0,"E",1.7,"Aotizhongxin"
28,2013,3,2,3,3,9,13,34,400,52,-1.4,1030.6,-17.6,0,"NNE",1.4,"Aotizhongxin"
29,2013,3,2,4,3,7,18,43,400,43,-1.5,1030.8,-17.7,0,"NNW",0.9,"Aotizhongxin"
30,2013,3,2,5,9,11,19,70,500,20,-1.8,1030.1,-17.5,0,"NNE",2,"Aotizhongxin"
31,2013,3,2,6,4,10,28,46,500,39,-2.5,1029.6,-17.7,0,"NW",0.7,"Aotizhongxin"
32,2013,3,2,7,3,11,34,58,500,27,-1.7,1029.8,-17,0,"NE",1.2,"Aotizhongxin"
33,2013,3,2,8,3,7,21,49,500,43,-0.4,1029.6,-17.6,0,"NE",1.8,"Aotizhongxin"
34,2013,3,2,9,10,14,47,62,700,29,0.6,1029.7,-16.7,0,"NE",1.7,"Aotizhongxin"
35,2013,3,2,10,11,19,36,60,600,34,1.7,1028.9,-16.3,0,"W",1.6,"Aotizhongxin"
36,2013,3,2,11,18,29,36,70,800,27,2.2,1028.2,-16.8,0,"SSW",3.1,"Aotizhongxin"
37,2013,3,2,12,26,30,25,76,900,22,2.7,1027.3,-16.4,0,"WSW",2.7,"Aotizhongxin"
38,2013,3,2,13,25,33,20,57,700,39,3.3,1025.7,-16.4,0,"W",1.5,"Aotizhongxin"
39,2013,3,2,14,26,35,22,54,700,43,3.8,1024.8,-16,0,"SE",1.3,"Aotizhongxin"
40,2013,3,2,15,37,40,24,55,700,44,3.9,1024.1,-16.5,0,"WNW",1.2,"Aotizhongxin"
41,2013,3,2,16,37,46,29,63,1000,38,3.5,1023.6,-15.2,0,"WSW",2.5,"Aotizhongxin"
42,2013,3,2,17,44,58,45,77,1200,30,2.2,1023.4,-13.6,0,"SSE",0.4,"Aotizhongxin"
43,2013,3,2,18,54,79,50,80,1100,24,1.2,1023.2,-12.3,0,"W",0.9,"Aotizhongxin"
44,2013,3,2,19,61,86,50,97,1300,10,1.5,1022.9,-13.8,0,"NE",1.2,"Aotizhongxin"
45,2013,3,2,20,67,96,54,108,1399,2,1.2,1022.9,-14.1,0,"NNE",1.2,"Aotizhongxin"
46,2013,3,2,21,74,103,72,107,1399,2,0.6,1022.6,-14.2,0,"NE",1.3,"Aotizhongxin"
47,2013,3,2,22,81,113,84,110,1500,3,-0.6,1022.3,-13.9,0,"NNE",1.4,"Aotizhongxin"
48,2013,3,2,23,93,120,87,107,1700,2,-0.8,1021.1,-13.4,0,"N",1.3,"Aotizhongxin"
49,2013,3,3,0,112,130,73,100,1899,2,-1.4,1020.4,-13,0,"NNE",1.2,"Aotizhongxin"
50,2013,3,3,1,109,132,80,101,2200,2,-2,1019.4,-13.2,0,"NE",1.2,"Aotizhongxin"
51,2013,3,3,2,110,132,98,99,2399,2,-2.8,1018.3,-12.3,0,"NE",1.4,"Aotizhongxin"
52,2013,3,3,3,105,129,88,100,2500,2,-2.6,1017.2,-13.2,0,"NE",1.2,"Aotizhongxin"
53,2013,3,3,4,106,136,79,92,2799,2,-4.3,1016.9,-11.8,0,"NNE",0.9,"Aotizhongxin"
54,2013,3,3,5,101,135,64,87,2399,2,-5.6,1016.3,-10.9,0,"N",0.8,"Aotizhongxin"
55,2013,3,3,6,91,142,67,87,2100,2,-5.8,1016.2,-11,0,"NNE",0.8,"Aotizhongxin"
56,2013,3,3,7,79,116,83,91,2000,2,-3.1,1016.5,-11.1,0,"NE",1.5,"Aotizhongxin"
57,2013,3,3,8,77,110,123,90,2299,2,0.7,1016.2,-13,0,"NNE",2.3,"Aotizhongxin"
58,2013,3,3,9,83,119,135,90,2600,3,3.5,1015.8,-13.8,0,"NNE",0.4,"Aotizhongxin"
59,2013,3,3,10,94,122,116,90,1800,9,6.5,1014.9,-13.2,0,"N",1.3,"Aotizhongxin"
60,2013,3,3,11,96,117,89,93,1600,14,11.4,1013.8,-10.8,0,"ESE",0.9,"Aotizhongxin"
61,2013,3,3,12,91,108,77,99,1600,14,13.8,1012.5,-13.3,0,"W",1.1,"Aotizhongxin"
62,2013,3,3,13,98,134,50,81,1200,33,16,1011.5,-13.5,0,"W",5.9,"Aotizhongxin"
63,2013,3,3,14,72,106,31,57,900,51,16.7,1010.8,-14,0,"WNW",4.3,"Aotizhongxin"
64,2013,3,3,15,48,114,14,17,500,77,16.9,1010.5,-12.7,0,"WNW",2,"Aotizhongxin"
65,2013,3,3,16,28,100,12,17,400,77,16.4,1010.6,-15.4,0,"NW",2.9,"Aotizhongxin"
66,2013,3,3,17,26,103,9,19,400,73,13.1,1011.1,-10.1,0,"WSW",1.7,"Aotizhongxin"
67,2013,3,3,18,24,82,8,27,500,66,8.7,1012.3,-11.3,0,"NW",1.6,"Aotizhongxin"
68,2013,3,3,19,19,71,26,98,1300,11,12.2,1013.4,-13.7,0,"NNW",2,"Aotizhongxin"
69,2013,3,3,20,60,175,64,135,2000,4,11.7,1013.5,-12.6,0,"N",0.9,"Aotizhongxin"
70,2013,3,3,21,117,181,28,100,1100,5,5.3,1013.6,-10.9,0,"N",0,"Aotizhongxin"
71,2013,3,3,22,54,105,28,90,1200,2,3.1,1014.1,-10.2,0,"NNE",1.8,"Aotizhongxin"
72,2013,3,3,23,46,94,29,84,1200,2,5.2,1014.8,-10.6,0,"NNW",1.7,"Aotizhongxin"
73,2013,3,4,0,42,83,51,86,1300,4,7.7,1015.7,-11.1,0,"N",2.6,"Aotizhongxin"
74,2013,3,4,1,49,80,39,64,1000,25,8.2,1016.7,-11.7,0,"N",2.8,"Aotizhongxin"
75,2013,3,4,2,34,62,NA,14,300,68,8.1,1016.7,-11.8,0,"N",4.3,"Aotizhongxin"
76,2013,3,4,3,12,34,6,12,NA,77,7.2,1016.9,-11.6,0,"N",2.8,"Aotizhongxin"
77,2013,3,4,4,7,18,14,NA,400,42,6,1018,-11.6,0,"NNW",1,"Aotizhongxin"
78,2013,3,4,5,10,24,18,45,400,40,2.7,1018.6,-10.9,0,"SSE",0.5,"Aotizhongxin"
79,2013,3,4,6,13,32,24,65,500,22,3.8,1018.9,-11.4,0,"N",2.3,"Aotizhongxin"
80,2013,3,4,7,14,36,30,70,600,17,6.5,1019.7,-10.7,0,"N",2.3,"Aotizhongxin"
81,2013,3,4,8,13,35,38,70,700,21,9,1020.7,-12.2,0,"NE",3.1,"Aotizhongxin"
82,2013,3,4,9,15,32,26,36,500,52,10.6,1020.8,-12.1,0,"NNE",1.3,"Aotizhongxin"
83,2013,3,4,10,16,24,22,36,600,57,11.9,1020.4,-12.4,0,"NE",2.1,"Aotizhongxin"
84,2013,3,4,11,18,33,18,27,400,68,13.1,1020,-13,0,"NE",3,"Aotizhongxin"
85,2013,3,4,12,13,28,12,14,400,77,14.2,1018.9,-13.9,0,"N",2.7,"Aotizhongxin"
86,2013,3,4,13,3,12,7,12,300,82,15.3,1017.8,-13,0,"S",2,"Aotizhongxin"
87,2013,3,4,14,3,10,8,13,400,84,15.2,1017,-13.1,0,"SW",0.7,"Aotizhongxin"
88,2013,3,4,15,10,13,9,15,400,84,15.3,1016.3,-13,0,"SSW",2.4,"Aotizhongxin"
89,2013,3,4,16,14,20,10,34,500,70,14.5,1015.7,-13.7,0,"S",2.6,"Aotizhongxin"
90,2013,3,4,17,20,33,14,40,500,78,12.7,1015.9,-11.8,0,"SW",2.6,"Aotizhongxin"
91,2013,3,4,18,25,44,13,43,600,75,11.6,1016.5,-11.3,0,"SSW",3.4,"Aotizhongxin"
92,2013,3,4,19,31,63,17,61,700,53,10.9,1016.6,-10.6,0,"SW",3.5,"Aotizhongxin"
93,2013,3,4,20,34,84,18,76,800,40,9.9,1016.9,-10.3,0,"SSW",3.1,"Aotizhongxin"
94,2013,3,4,21,40,85,40,76,800,39,8.4,1016.9,-10,0,"SSW",2.1,"Aotizhongxin"
95,2013,3,4,22,51,91,46,85,1000,31,8.6,1016.3,-9.9,0,"SSW",2.4,"Aotizhongxin"
96,2013,3,4,23,58,94,46,86,1100,84,7.7,1015.7,-9.3,0,"SW",2.1,"Aotizhongxin"
97,2013,3,5,0,71,108,66,78,1100,84,4.7,1015.2,-9.1,0,"SW",1.6,"Aotizhongxin"
98,2013,3,5,1,91,127,75,75,1200,84,1.1,1014.7,-7.9,0,"SW",0,"Aotizhongxin"
99,2013,3,5,2,100,129,58,79,1200,84,-0.6,1014.4,-8.1,0,"S",0,"Aotizhongxin"
