; NOTE: Assertions have been autogenerated by utils/update_test_checks.py
; RUN: opt -mtriple riscv64 -mattr +m,+a,+f,+d,+experimental-v \
; RUN:    -prefer-predicate-over-epilogue=predicate-dont-vectorize -S -O2 -vector-register-width-factor=8 < %s  -o - | FileCheck %s
; RUN: opt -mtriple riscv64 -mattr +m,+a,+f,+d,+experimental-v \
; RUN:    -prefer-predicate-over-epilogue=predicate-dont-vectorize -S -O2 < %s  -o - | FileCheck %s --check-prefix=CHECK1
; ModuleID = './cast-float-trunc.c'
source_filename = "./cast-float-trunc.c"
target datalayout = "e-m:e-p:64:64-i64:64-i128:128-n64-S128-v128:128:128-v256:128:128-v512:128:128-v1024:128:128"
target triple = "riscv64-unknown-linux-gnu"

; Function Attrs: nofree norecurse nounwind
define dso_local void @bar(i32 signext %N, float* noalias nocapture %c, double* noalias nocapture readonly %a, double* noalias nocapture readonly %b) local_unnamed_addr {
; CHECK-LABEL: @bar(
; CHECK-NEXT:  entry:
; CHECK-NEXT:    [[CMP10:%.*]] = icmp sgt i32 [[N:%.*]], 0
; CHECK-NEXT:    br i1 [[CMP10]], label [[FOR_BODY_PREHEADER:%.*]], label [[FOR_END:%.*]]
; CHECK:       for.body.preheader:
; CHECK-NEXT:    [[WIDE_TRIP_COUNT:%.*]] = zext i32 [[N]] to i64
; CHECK-NEXT:    br label [[VECTOR_BODY:%.*]]
; CHECK:       vector.body:
; CHECK-NEXT:    [[INDEX:%.*]] = phi i64 [ 0, [[FOR_BODY_PREHEADER]] ], [ [[INDEX_NEXT:%.*]], [[VECTOR_BODY]] ]
; CHECK-NEXT:    [[TMP0:%.*]] = getelementptr inbounds double, double* [[A:%.*]], i64 [[INDEX]]
; CHECK-NEXT:    [[TMP1:%.*]] = sub i64 [[WIDE_TRIP_COUNT]], [[INDEX]]
; CHECK-NEXT:    [[TMP2:%.*]] = call i64 @llvm.epi.vsetvl(i64 [[TMP1]], i64 3, i64 3)
; CHECK-NEXT:    [[TMP3:%.*]] = trunc i64 [[TMP2]] to i32
; CHECK-NEXT:    [[TMP4:%.*]] = bitcast double* [[TMP0]] to <vscale x 8 x double>*
; CHECK-NEXT:    [[VP_OP_LOAD:%.*]] = call <vscale x 8 x double> @llvm.vp.load.nxv8f64.p0nxv8f64(<vscale x 8 x double>* [[TMP4]], i32 8, <vscale x 8 x i1> shufflevector (<vscale x 8 x i1> insertelement (<vscale x 8 x i1> undef, i1 true, i32 0), <vscale x 8 x i1> undef, <vscale x 8 x i32> zeroinitializer), i32 [[TMP3]])
; CHECK-NEXT:    [[TMP5:%.*]] = getelementptr inbounds double, double* [[B:%.*]], i64 [[INDEX]]
; CHECK-NEXT:    [[TMP6:%.*]] = bitcast double* [[TMP5]] to <vscale x 8 x double>*
; CHECK-NEXT:    [[VP_OP_LOAD9:%.*]] = call <vscale x 8 x double> @llvm.vp.load.nxv8f64.p0nxv8f64(<vscale x 8 x double>* [[TMP6]], i32 8, <vscale x 8 x i1> shufflevector (<vscale x 8 x i1> insertelement (<vscale x 8 x i1> undef, i1 true, i32 0), <vscale x 8 x i1> undef, <vscale x 8 x i32> zeroinitializer), i32 [[TMP3]])
; CHECK-NEXT:    [[VP_OP:%.*]] = call <vscale x 8 x double> @llvm.vp.fadd.nxv8f64(<vscale x 8 x double> [[VP_OP_LOAD]], <vscale x 8 x double> [[VP_OP_LOAD9]], metadata !"round.tonearest", metadata !"fpexcept.ignore", <vscale x 8 x i1> shufflevector (<vscale x 8 x i1> insertelement (<vscale x 8 x i1> undef, i1 true, i32 0), <vscale x 8 x i1> undef, <vscale x 8 x i32> zeroinitializer), i32 [[TMP3]])
; CHECK-NEXT:    [[VP_CAST:%.*]] = call <vscale x 8 x float> @llvm.vp.fptrunc.nxv8f32.nxv8f64(<vscale x 8 x double> [[VP_OP]], metadata !"round.tonearest", metadata !"fpexcept.ignore", <vscale x 8 x i1> shufflevector (<vscale x 8 x i1> insertelement (<vscale x 8 x i1> undef, i1 true, i32 0), <vscale x 8 x i1> undef, <vscale x 8 x i32> zeroinitializer), i32 [[TMP3]])
; CHECK-NEXT:    [[TMP7:%.*]] = getelementptr inbounds float, float* [[C:%.*]], i64 [[INDEX]]
; CHECK-NEXT:    [[TMP8:%.*]] = bitcast float* [[TMP7]] to <vscale x 8 x float>*
; CHECK-NEXT:    call void @llvm.vp.store.nxv8f32.p0nxv8f32(<vscale x 8 x float> [[VP_CAST]], <vscale x 8 x float>* [[TMP8]], i32 4, <vscale x 8 x i1> shufflevector (<vscale x 8 x i1> insertelement (<vscale x 8 x i1> undef, i1 true, i32 0), <vscale x 8 x i1> undef, <vscale x 8 x i32> zeroinitializer), i32 [[TMP3]])
; CHECK-NEXT:    [[TMP9:%.*]] = and i64 [[TMP2]], 4294967295
; CHECK-NEXT:    [[INDEX_NEXT]] = add i64 [[INDEX]], [[TMP9]]
; CHECK-NEXT:    [[TMP10:%.*]] = icmp eq i64 [[INDEX_NEXT]], [[WIDE_TRIP_COUNT]]
; CHECK-NEXT:    br i1 [[TMP10]], label [[FOR_END]], label [[VECTOR_BODY]], [[LOOP0:!llvm.loop !.*]]
; CHECK:       for.end:
; CHECK-NEXT:    ret void
;
; CHECK1-LABEL: @bar(
; CHECK1-NEXT:  entry:
; CHECK1-NEXT:    [[CMP10:%.*]] = icmp sgt i32 [[N:%.*]], 0
; CHECK1-NEXT:    br i1 [[CMP10]], label [[FOR_BODY_PREHEADER:%.*]], label [[FOR_END:%.*]]
; CHECK1:       for.body.preheader:
; CHECK1-NEXT:    [[WIDE_TRIP_COUNT:%.*]] = zext i32 [[N]] to i64
; CHECK1-NEXT:    br label [[VECTOR_BODY:%.*]]
; CHECK1:       vector.body:
; CHECK1-NEXT:    [[INDEX:%.*]] = phi i64 [ 0, [[FOR_BODY_PREHEADER]] ], [ [[INDEX_NEXT:%.*]], [[VECTOR_BODY]] ]
; CHECK1-NEXT:    [[TMP0:%.*]] = getelementptr inbounds double, double* [[A:%.*]], i64 [[INDEX]]
; CHECK1-NEXT:    [[TMP1:%.*]] = sub i64 [[WIDE_TRIP_COUNT]], [[INDEX]]
; CHECK1-NEXT:    [[TMP2:%.*]] = call i64 @llvm.epi.vsetvl(i64 [[TMP1]], i64 3, i64 1)
; CHECK1-NEXT:    [[TMP3:%.*]] = trunc i64 [[TMP2]] to i32
; CHECK1-NEXT:    [[TMP4:%.*]] = bitcast double* [[TMP0]] to <vscale x 2 x double>*
; CHECK1-NEXT:    [[VP_OP_LOAD:%.*]] = call <vscale x 2 x double> @llvm.vp.load.nxv2f64.p0nxv2f64(<vscale x 2 x double>* [[TMP4]], i32 8, <vscale x 2 x i1> shufflevector (<vscale x 2 x i1> insertelement (<vscale x 2 x i1> undef, i1 true, i32 0), <vscale x 2 x i1> undef, <vscale x 2 x i32> zeroinitializer), i32 [[TMP3]])
; CHECK1-NEXT:    [[TMP5:%.*]] = getelementptr inbounds double, double* [[B:%.*]], i64 [[INDEX]]
; CHECK1-NEXT:    [[TMP6:%.*]] = bitcast double* [[TMP5]] to <vscale x 2 x double>*
; CHECK1-NEXT:    [[VP_OP_LOAD9:%.*]] = call <vscale x 2 x double> @llvm.vp.load.nxv2f64.p0nxv2f64(<vscale x 2 x double>* [[TMP6]], i32 8, <vscale x 2 x i1> shufflevector (<vscale x 2 x i1> insertelement (<vscale x 2 x i1> undef, i1 true, i32 0), <vscale x 2 x i1> undef, <vscale x 2 x i32> zeroinitializer), i32 [[TMP3]])
; CHECK1-NEXT:    [[VP_OP:%.*]] = call <vscale x 2 x double> @llvm.vp.fadd.nxv2f64(<vscale x 2 x double> [[VP_OP_LOAD]], <vscale x 2 x double> [[VP_OP_LOAD9]], metadata !"round.tonearest", metadata !"fpexcept.ignore", <vscale x 2 x i1> shufflevector (<vscale x 2 x i1> insertelement (<vscale x 2 x i1> undef, i1 true, i32 0), <vscale x 2 x i1> undef, <vscale x 2 x i32> zeroinitializer), i32 [[TMP3]])
; CHECK1-NEXT:    [[VP_CAST:%.*]] = call <vscale x 2 x float> @llvm.vp.fptrunc.nxv2f32.nxv2f64(<vscale x 2 x double> [[VP_OP]], metadata !"round.tonearest", metadata !"fpexcept.ignore", <vscale x 2 x i1> shufflevector (<vscale x 2 x i1> insertelement (<vscale x 2 x i1> undef, i1 true, i32 0), <vscale x 2 x i1> undef, <vscale x 2 x i32> zeroinitializer), i32 [[TMP3]])
; CHECK1-NEXT:    [[TMP7:%.*]] = getelementptr inbounds float, float* [[C:%.*]], i64 [[INDEX]]
; CHECK1-NEXT:    [[TMP8:%.*]] = bitcast float* [[TMP7]] to <vscale x 2 x float>*
; CHECK1-NEXT:    call void @llvm.vp.store.nxv2f32.p0nxv2f32(<vscale x 2 x float> [[VP_CAST]], <vscale x 2 x float>* [[TMP8]], i32 4, <vscale x 2 x i1> shufflevector (<vscale x 2 x i1> insertelement (<vscale x 2 x i1> undef, i1 true, i32 0), <vscale x 2 x i1> undef, <vscale x 2 x i32> zeroinitializer), i32 [[TMP3]])
; CHECK1-NEXT:    [[TMP9:%.*]] = and i64 [[TMP2]], 4294967295
; CHECK1-NEXT:    [[INDEX_NEXT]] = add i64 [[INDEX]], [[TMP9]]
; CHECK1-NEXT:    [[TMP10:%.*]] = icmp eq i64 [[INDEX_NEXT]], [[WIDE_TRIP_COUNT]]
; CHECK1-NEXT:    br i1 [[TMP10]], label [[FOR_END]], label [[VECTOR_BODY]], [[LOOP0:!llvm.loop !.*]]
; CHECK1:       for.end:
; CHECK1-NEXT:    ret void
;
entry:
  %cmp10 = icmp sgt i32 %N, 0
  br i1 %cmp10, label %for.body.preheader, label %for.end

for.body.preheader:                               ; preds = %entry
  %wide.trip.count = zext i32 %N to i64
  br label %for.body

for.body:                                         ; preds = %for.body, %for.body.preheader
  %indvars.iv = phi i64 [ 0, %for.body.preheader ], [ %indvars.iv.next, %for.body ]
  %arrayidx = getelementptr inbounds double, double* %a, i64 %indvars.iv
  %0 = load double, double* %arrayidx
  %arrayidx2 = getelementptr inbounds double, double* %b, i64 %indvars.iv
  %1 = load double, double* %arrayidx2
  %add = fadd double %0, %1
  %conv = fptrunc double %add to float
  %arrayidx4 = getelementptr inbounds float, float* %c, i64 %indvars.iv
  store float %conv, float* %arrayidx4
  %indvars.iv.next = add nuw nsw i64 %indvars.iv, 1
  %exitcond = icmp eq i64 %indvars.iv.next, %wide.trip.count
  br i1 %exitcond, label %for.end.loopexit, label %for.body

for.end.loopexit:                                 ; preds = %for.body
  br label %for.end

for.end:                                          ; preds = %for.end.loopexit, %entry
  ret void
}
