; NOTE: Assertions have been autogenerated by utils/update_llc_test_checks.py
; RUN: llc -mtriple=riscv64 -mattr=+m,+a,+f,+d,+c,+experimental-v -o - < %s \
; RUN:     --verify-machineinstrs | FileCheck %s

define <vscale x 1 x i1> @test_1xi1(<vscale x 1 x i1> %in, <vscale x 1 x i1> %in2) nounwind {
; CHECK-LABEL: test_1xi1:
; CHECK:       # %bb.0: # %entry
; CHECK-NEXT:    #APP
; CHECK-NEXT:    vmand.mm v0, v0, v16
; CHECK-NEXT:    #NO_APP
; CHECK-NEXT:    ret
entry:
  %0 = tail call <vscale x 1 x i1> asm "vmand.mm $0, $1, $2", "=v,v,v"(<vscale x 1 x i1> %in, <vscale x 1 x i1> %in2)
  ret <vscale x 1 x i1> %0
}

define <vscale x 2 x i1> @test_2xi1(<vscale x 2 x i1> %in, <vscale x 2 x i1> %in2) nounwind {
; CHECK-LABEL: test_2xi1:
; CHECK:       # %bb.0: # %entry
; CHECK-NEXT:    #APP
; CHECK-NEXT:    vmand.mm v0, v0, v16
; CHECK-NEXT:    #NO_APP
; CHECK-NEXT:    ret
entry:
  %0 = tail call <vscale x 2 x i1> asm "vmand.mm $0, $1, $2", "=v,v,v"(<vscale x 2 x i1> %in, <vscale x 2 x i1> %in2)
  ret <vscale x 2 x i1> %0
}

define <vscale x 1 x i64> @test_1xi64(<vscale x 1 x i64> %in, <vscale x 1 x i64> %in2) nounwind {
; CHECK-LABEL: test_1xi64:
; CHECK:       # %bb.0: # %entry
; CHECK-NEXT:    #APP
; CHECK-NEXT:    vadd.vv v16, v16, v17
; CHECK-NEXT:    #NO_APP
; CHECK-NEXT:    ret
entry:
  %0 = tail call <vscale x 1 x i64> asm "vadd.vv $0, $1, $2", "=v,v,v"(<vscale x 1 x i64> %in, <vscale x 1 x i64> %in2)
  ret <vscale x 1 x i64> %0
}

define <vscale x 2 x i32> @test_2xi32(<vscale x 2 x i32> %in, <vscale x 2 x i32> %in2) nounwind {
; CHECK-LABEL: test_2xi32:
; CHECK:       # %bb.0: # %entry
; CHECK-NEXT:    #APP
; CHECK-NEXT:    vadd.vv v16, v16, v17
; CHECK-NEXT:    #NO_APP
; CHECK-NEXT:    ret
entry:
  %0 = tail call <vscale x 2 x i32> asm "vadd.vv $0, $1, $2", "=v,v,v"(<vscale x 2 x i32> %in, <vscale x 2 x i32> %in2)
  ret <vscale x 2 x i32> %0
}

define <vscale x 2 x i64> @test_2xi64(<vscale x 2 x i64> %in, <vscale x 2 x i64> %in2) nounwind {
; CHECK-LABEL: test_2xi64:
; CHECK:       # %bb.0: # %entry
; CHECK-NEXT:    #APP
; CHECK-NEXT:    vadd.vv v16, v16, v18
; CHECK-NEXT:    #NO_APP
; CHECK-NEXT:    ret
entry:
  %0 = tail call <vscale x 2 x i64> asm "vadd.vv $0, $1, $2", "=v,v,v"(<vscale x 2 x i64> %in, <vscale x 2 x i64> %in2)
  ret <vscale x 2 x i64> %0
}

define <vscale x 4 x i32> @test_4xi32(<vscale x 4 x i32> %in, <vscale x 4 x i32> %in2) nounwind {
; CHECK-LABEL: test_4xi32:
; CHECK:       # %bb.0: # %entry
; CHECK-NEXT:    #APP
; CHECK-NEXT:    vadd.vv v16, v16, v18
; CHECK-NEXT:    #NO_APP
; CHECK-NEXT:    ret
entry:
  %0 = tail call <vscale x 4 x i32> asm "vadd.vv $0, $1, $2", "=v,v,v"(<vscale x 4 x i32> %in, <vscale x 4 x i32> %in2)
  ret <vscale x 4 x i32> %0
}

define <vscale x 4 x i64> @test_4xi64(<vscale x 4 x i64> %in, <vscale x 4 x i64> %in2) nounwind {
; CHECK-LABEL: test_4xi64:
; CHECK:       # %bb.0: # %entry
; CHECK-NEXT:    #APP
; CHECK-NEXT:    vadd.vv v16, v16, v20
; CHECK-NEXT:    #NO_APP
; CHECK-NEXT:    ret
entry:
  %0 = tail call <vscale x 4 x i64> asm "vadd.vv $0, $1, $2", "=v,v,v"(<vscale x 4 x i64> %in, <vscale x 4 x i64> %in2)
  ret <vscale x 4 x i64> %0
}

define <vscale x 8 x i32> @test_8xi32(<vscale x 8 x i32> %in, <vscale x 8 x i32> %in2) nounwind {
; CHECK-LABEL: test_8xi32:
; CHECK:       # %bb.0: # %entry
; CHECK-NEXT:    #APP
; CHECK-NEXT:    vadd.vv v16, v16, v20
; CHECK-NEXT:    #NO_APP
; CHECK-NEXT:    ret
entry:
  %0 = tail call <vscale x 8 x i32> asm "vadd.vv $0, $1, $2", "=v,v,v"(<vscale x 8 x i32> %in, <vscale x 8 x i32> %in2)
  ret <vscale x 8 x i32> %0
}

define <vscale x 8 x i64> @test_8xi64(<vscale x 8 x i64> %in, <vscale x 8 x i64> %in2) nounwind {
; CHECK-LABEL: test_8xi64:
; CHECK:       # %bb.0: # %entry
; CHECK-NEXT:    vsetvli zero, zero, e8,m8
; CHECK-NEXT:    vle.v v8, (a0)
; CHECK-NEXT:    #APP
; CHECK-NEXT:    vadd.vv v16, v16, v8
; CHECK-NEXT:    #NO_APP
; CHECK-NEXT:    ret
entry:
  %0 = tail call <vscale x 8 x i64> asm "vadd.vv $0, $1, $2", "=v,v,v"(<vscale x 8 x i64> %in, <vscale x 8 x i64> %in2)
  ret <vscale x 8 x i64> %0
}

define <vscale x 16 x i32> @test_16xi32(<vscale x 16 x i32> %in, <vscale x 16 x i32> %in2) nounwind {
; CHECK-LABEL: test_16xi32:
; CHECK:       # %bb.0: # %entry
; CHECK-NEXT:    vsetvli zero, zero, e8,m8
; CHECK-NEXT:    vle.v v8, (a0)
; CHECK-NEXT:    #APP
; CHECK-NEXT:    vadd.vv v16, v16, v8
; CHECK-NEXT:    #NO_APP
; CHECK-NEXT:    ret
entry:
  %0 = tail call <vscale x 16 x i32> asm "vadd.vv $0, $1, $2", "=v,v,v"(<vscale x 16 x i32> %in, <vscale x 16 x i32> %in2)
  ret <vscale x 16 x i32> %0
}

