; NOTE: Assertions have been autogenerated by utils/update_test_checks.py
; RUN: opt -mtriple riscv64 -mattr +m,+a,+f,+d,+experimental-v \
; RUN:   -prefer-predicate-over-epilogue=predicate-dont-vectorize -S \
; RUN:   -loop-vectorize -vector-register-width-factor=8 < %s  -o - | FileCheck %s
; RUN: opt -mtriple riscv64 -mattr +m,+a,+f,+d,+experimental-v \
; RUN:   -prefer-predicate-over-epilogue=predicate-dont-vectorize -S \
; RUN:   -loop-vectorize < %s  -o - | FileCheck %s --check-prefix=CHECK1
; ModuleID = './mul-reduce.c'
source_filename = "./mul-reduce.c"
target datalayout = "e-m:e-p:64:64-i64:64-i128:128-n64-S128-v128:128:128-v256:128:128-v512:128:128-v1024:128:128"
target triple = "riscv64-unknown-linux-gnu"

; Function Attrs: norecurse nounwind readonly
define dso_local signext i32 @mul_reduce(i32 signext %N, i32 signext %c, i32* noalias nocapture readonly %a) local_unnamed_addr {
; CHECK-LABEL: @mul_reduce(
; CHECK-NEXT:  entry:
; CHECK-NEXT:    [[CMP5:%.*]] = icmp sgt i32 [[N:%.*]], 0
; CHECK-NEXT:    br i1 [[CMP5]], label [[FOR_BODY_PREHEADER:%.*]], label [[FOR_END:%.*]]
; CHECK:       for.body.preheader:
; CHECK-NEXT:    [[WIDE_TRIP_COUNT:%.*]] = zext i32 [[N]] to i64
; CHECK-NEXT:    br i1 false, label [[SCALAR_PH:%.*]], label [[VECTOR_PH:%.*]]
; CHECK:       vector.ph:
; CHECK-NEXT:    [[TRIP_COUNT_MINUS_1:%.*]] = sub i64 [[WIDE_TRIP_COUNT]], 1
; CHECK-NEXT:    [[BROADCAST_SPLATINSERT:%.*]] = insertelement <vscale x 16 x i64> undef, i64 [[TRIP_COUNT_MINUS_1]], i32 0
; CHECK-NEXT:    [[BROADCAST_SPLAT:%.*]] = shufflevector <vscale x 16 x i64> [[BROADCAST_SPLATINSERT]], <vscale x 16 x i64> undef, <vscale x 16 x i32> zeroinitializer
; CHECK-NEXT:    [[TMP0:%.*]] = insertelement <vscale x 16 x i32> shufflevector (<vscale x 16 x i32> insertelement (<vscale x 16 x i32> undef, i32 1, i32 0), <vscale x 16 x i32> undef, <vscale x 16 x i32> zeroinitializer), i32 [[C:%.*]], i32 0
; CHECK-NEXT:    br label [[VECTOR_BODY:%.*]]
; CHECK:       vector.body:
; CHECK-NEXT:    [[INDEX:%.*]] = phi i64 [ 0, [[VECTOR_PH]] ], [ [[INDEX_NEXT:%.*]], [[VECTOR_BODY]] ]
; CHECK-NEXT:    [[VEC_PHI:%.*]] = phi <vscale x 16 x i32> [ [[TMP0]], [[VECTOR_PH]] ], [ [[TMP12:%.*]], [[VECTOR_BODY]] ]
; CHECK-NEXT:    [[BROADCAST_SPLATINSERT1:%.*]] = insertelement <vscale x 16 x i64> undef, i64 [[INDEX]], i32 0
; CHECK-NEXT:    [[BROADCAST_SPLAT2:%.*]] = shufflevector <vscale x 16 x i64> [[BROADCAST_SPLATINSERT1]], <vscale x 16 x i64> undef, <vscale x 16 x i32> zeroinitializer
; CHECK-NEXT:    [[TMP1:%.*]] = call <vscale x 16 x i64> @llvm.experimental.vector.stepvector.nxv16i64()
; CHECK-NEXT:    [[DOTSPLATINSERT:%.*]] = insertelement <vscale x 16 x i64> undef, i64 0, i32 0
; CHECK-NEXT:    [[DOTSPLAT:%.*]] = shufflevector <vscale x 16 x i64> [[DOTSPLATINSERT]], <vscale x 16 x i64> undef, <vscale x 16 x i32> zeroinitializer
; CHECK-NEXT:    [[TMP2:%.*]] = add <vscale x 16 x i64> [[TMP1]], [[DOTSPLAT]]
; CHECK-NEXT:    [[DOTSPLATINSERT3:%.*]] = insertelement <vscale x 16 x i64> undef, i64 1, i32 0
; CHECK-NEXT:    [[DOTSPLAT4:%.*]] = shufflevector <vscale x 16 x i64> [[DOTSPLATINSERT3]], <vscale x 16 x i64> undef, <vscale x 16 x i32> zeroinitializer
; CHECK-NEXT:    [[TMP3:%.*]] = mul <vscale x 16 x i64> [[TMP2]], [[DOTSPLAT4]]
; CHECK-NEXT:    [[INDUCTION:%.*]] = add <vscale x 16 x i64> [[BROADCAST_SPLAT2]], [[TMP3]]
; CHECK-NEXT:    [[TMP4:%.*]] = add i64 [[INDEX]], 0
; CHECK-NEXT:    [[TMP5:%.*]] = icmp ule <vscale x 16 x i64> [[INDUCTION]], [[BROADCAST_SPLAT]]
; CHECK-NEXT:    [[TMP6:%.*]] = getelementptr inbounds i32, i32* [[A:%.*]], i64 [[TMP4]]
; CHECK-NEXT:    [[TMP7:%.*]] = sub i64 [[WIDE_TRIP_COUNT]], [[INDEX]]
; CHECK-NEXT:    [[TMP8:%.*]] = call i64 @llvm.epi.vsetvl(i64 [[TMP7]], i64 2, i64 3)
; CHECK-NEXT:    [[TMP9:%.*]] = trunc i64 [[TMP8]] to i32
; CHECK-NEXT:    [[TMP10:%.*]] = getelementptr inbounds i32, i32* [[TMP6]], i32 0
; CHECK-NEXT:    [[TMP11:%.*]] = bitcast i32* [[TMP10]] to <vscale x 16 x i32>*
; CHECK-NEXT:    [[DOTSPLATINSERT5:%.*]] = insertelement <vscale x 16 x i1> undef, i1 true, i32 0
; CHECK-NEXT:    [[DOTSPLAT6:%.*]] = shufflevector <vscale x 16 x i1> [[DOTSPLATINSERT5]], <vscale x 16 x i1> undef, <vscale x 16 x i32> zeroinitializer
; CHECK-NEXT:    [[VP_OP_LOAD:%.*]] = call <vscale x 16 x i32> @llvm.vp.load.nxv16i32.p0nxv16i32(<vscale x 16 x i32>* [[TMP11]], i32 4, <vscale x 16 x i1> [[DOTSPLAT6]], i32 [[TMP9]])
; CHECK-NEXT:    [[VP_OP:%.*]] = call <vscale x 16 x i32> @llvm.vp.mul.nxv16i32(<vscale x 16 x i32> [[VP_OP_LOAD]], <vscale x 16 x i32> [[VEC_PHI]], <vscale x 16 x i1> [[DOTSPLAT6]], i32 [[TMP9]])
; CHECK-NEXT:    [[EVL_SPLATINSERT:%.*]] = insertelement <vscale x 16 x i32> undef, i32 [[TMP9]], i32 0
; CHECK-NEXT:    [[EVL_SPLAT:%.*]] = shufflevector <vscale x 16 x i32> [[EVL_SPLATINSERT]], <vscale x 16 x i32> undef, <vscale x 16 x i32> zeroinitializer
; CHECK-NEXT:    [[STEP_VEC:%.*]] = call <vscale x 16 x i32> @llvm.experimental.vector.stepvector.nxv16i32()
; CHECK-NEXT:    [[EVL_MASK:%.*]] = icmp ult <vscale x 16 x i32> [[STEP_VEC]], [[EVL_SPLAT]]
; CHECK-NEXT:    [[TMP12]] = select <vscale x 16 x i1> [[EVL_MASK]], <vscale x 16 x i32> [[VP_OP]], <vscale x 16 x i32> [[VEC_PHI]]
; CHECK-NEXT:    [[TMP13:%.*]] = zext i32 [[TMP9]] to i64
; CHECK-NEXT:    [[INDEX_NEXT]] = add i64 [[INDEX]], [[TMP13]]
; CHECK-NEXT:    [[TMP14:%.*]] = icmp eq i64 [[INDEX_NEXT]], [[WIDE_TRIP_COUNT]]
; CHECK-NEXT:    br i1 [[TMP14]], label [[REDUCTION_LOOP_PH:%.*]], label [[VECTOR_BODY]], [[LOOP0:!llvm.loop !.*]]
; CHECK:       reduction.loop.ph:
; CHECK-NEXT:    [[TMP15:%.*]] = call i32 @llvm.vscale.i32()
; CHECK-NEXT:    [[VSCALE_X_VF:%.*]] = mul i32 16, [[TMP15]]
; CHECK-NEXT:    br label [[REDUCTION_LOOP_BODY:%.*]]
; CHECK:       reduction.loop.body:
; CHECK-NEXT:    [[CURRENT_LEN:%.*]] = phi i32 [ [[VSCALE_X_VF]], [[REDUCTION_LOOP_PH]] ], [ [[HALFLEN:%.*]], [[REDUCTION_LOOP_BODY]] ]
; CHECK-NEXT:    [[CURRENT_VEC:%.*]] = phi <vscale x 16 x i32> [ [[TMP12]], [[REDUCTION_LOOP_PH]] ], [ [[REDUCTION_VEC:%.*]], [[REDUCTION_LOOP_BODY]] ]
; CHECK-NEXT:    [[TMP16:%.*]] = udiv i32 [[CURRENT_LEN]], 2
; CHECK-NEXT:    [[TMP17:%.*]] = urem i32 [[CURRENT_LEN]], 2
; CHECK-NEXT:    [[HALFLEN]] = add i32 [[TMP16]], [[TMP17]]
; CHECK-NEXT:    [[TMP18:%.*]] = zext i32 [[CURRENT_LEN]] to i64
; CHECK-NEXT:    [[TMP19:%.*]] = call i64 @llvm.epi.vsetvl(i64 [[TMP18]], i64 2, i64 3)
; CHECK-NEXT:    [[TMP20:%.*]] = trunc i64 [[TMP19]] to i32
; CHECK-NEXT:    [[SECOND_HALF:%.*]] = call <vscale x 16 x i32> @llvm.experimental.vector.vp.slideleftfill.nxv16i32(<vscale x 16 x i32> [[CURRENT_VEC]], <vscale x 16 x i32> shufflevector (<vscale x 16 x i32> insertelement (<vscale x 16 x i32> undef, i32 1, i32 0), <vscale x 16 x i32> undef, <vscale x 16 x i32> zeroinitializer), i32 [[HALFLEN]], i32 [[TMP20]], i32 [[TMP20]])
; CHECK-NEXT:    [[TMP21:%.*]] = zext i32 [[HALFLEN]] to i64
; CHECK-NEXT:    [[TMP22:%.*]] = call i64 @llvm.epi.vsetvl(i64 [[TMP21]], i64 2, i64 3)
; CHECK-NEXT:    [[TMP23:%.*]] = trunc i64 [[TMP22]] to i32
; CHECK-NEXT:    [[DOTSPLATINSERT9:%.*]] = insertelement <vscale x 16 x i1> undef, i1 true, i32 0
; CHECK-NEXT:    [[DOTSPLAT10:%.*]] = shufflevector <vscale x 16 x i1> [[DOTSPLATINSERT9]], <vscale x 16 x i1> undef, <vscale x 16 x i32> zeroinitializer
; CHECK-NEXT:    [[REDUCTION_VEC]] = call <vscale x 16 x i32> @llvm.vp.mul.nxv16i32(<vscale x 16 x i32> [[CURRENT_VEC]], <vscale x 16 x i32> [[SECOND_HALF]], <vscale x 16 x i1> [[DOTSPLAT10]], i32 [[TMP23]])
; CHECK-NEXT:    [[TMP24:%.*]] = icmp eq i32 [[HALFLEN]], 1
; CHECK-NEXT:    br i1 [[TMP24]], label [[MIDDLE_BLOCK:%.*]], label [[REDUCTION_LOOP_BODY]]
; CHECK:       middle.block:
; CHECK-NEXT:    [[REDUCED:%.*]] = extractelement <vscale x 16 x i32> [[REDUCTION_VEC]], i32 0
; CHECK-NEXT:    br i1 true, label [[FOR_END_LOOPEXIT:%.*]], label [[SCALAR_PH]]
; CHECK:       scalar.ph:
; CHECK-NEXT:    [[BC_RESUME_VAL:%.*]] = phi i64 [ [[WIDE_TRIP_COUNT]], [[MIDDLE_BLOCK]] ], [ 0, [[FOR_BODY_PREHEADER]] ]
; CHECK-NEXT:    [[BC_MERGE_RDX:%.*]] = phi i32 [ [[C]], [[FOR_BODY_PREHEADER]] ], [ [[REDUCED]], [[MIDDLE_BLOCK]] ]
; CHECK-NEXT:    br label [[FOR_BODY:%.*]]
; CHECK:       for.body:
; CHECK-NEXT:    [[INDVARS_IV:%.*]] = phi i64 [ [[BC_RESUME_VAL]], [[SCALAR_PH]] ], [ [[INDVARS_IV_NEXT:%.*]], [[FOR_BODY]] ]
; CHECK-NEXT:    [[C_ADDR_06:%.*]] = phi i32 [ [[BC_MERGE_RDX]], [[SCALAR_PH]] ], [ [[MUL:%.*]], [[FOR_BODY]] ]
; CHECK-NEXT:    [[ARRAYIDX:%.*]] = getelementptr inbounds i32, i32* [[A]], i64 [[INDVARS_IV]]
; CHECK-NEXT:    [[TMP25:%.*]] = load i32, i32* [[ARRAYIDX]], align 4
; CHECK-NEXT:    [[MUL]] = mul nsw i32 [[TMP25]], [[C_ADDR_06]]
; CHECK-NEXT:    [[INDVARS_IV_NEXT]] = add nuw nsw i64 [[INDVARS_IV]], 1
; CHECK-NEXT:    [[EXITCOND_NOT:%.*]] = icmp eq i64 [[INDVARS_IV_NEXT]], [[WIDE_TRIP_COUNT]]
; CHECK-NEXT:    br i1 [[EXITCOND_NOT]], label [[FOR_END_LOOPEXIT]], label [[FOR_BODY]], [[LOOP2:!llvm.loop !.*]]
; CHECK:       for.end.loopexit:
; CHECK-NEXT:    [[MUL_LCSSA:%.*]] = phi i32 [ [[MUL]], [[FOR_BODY]] ], [ [[REDUCED]], [[MIDDLE_BLOCK]] ]
; CHECK-NEXT:    br label [[FOR_END]]
; CHECK:       for.end:
; CHECK-NEXT:    [[C_ADDR_0_LCSSA:%.*]] = phi i32 [ [[C]], [[ENTRY:%.*]] ], [ [[MUL_LCSSA]], [[FOR_END_LOOPEXIT]] ]
; CHECK-NEXT:    ret i32 [[C_ADDR_0_LCSSA]]
;
; CHECK1-LABEL: @mul_reduce(
; CHECK1-NEXT:  entry:
; CHECK1-NEXT:    [[CMP5:%.*]] = icmp sgt i32 [[N:%.*]], 0
; CHECK1-NEXT:    br i1 [[CMP5]], label [[FOR_BODY_PREHEADER:%.*]], label [[FOR_END:%.*]]
; CHECK1:       for.body.preheader:
; CHECK1-NEXT:    [[WIDE_TRIP_COUNT:%.*]] = zext i32 [[N]] to i64
; CHECK1-NEXT:    br i1 false, label [[SCALAR_PH:%.*]], label [[VECTOR_PH:%.*]]
; CHECK1:       vector.ph:
; CHECK1-NEXT:    [[TRIP_COUNT_MINUS_1:%.*]] = sub i64 [[WIDE_TRIP_COUNT]], 1
; CHECK1-NEXT:    [[BROADCAST_SPLATINSERT:%.*]] = insertelement <vscale x 2 x i64> undef, i64 [[TRIP_COUNT_MINUS_1]], i32 0
; CHECK1-NEXT:    [[BROADCAST_SPLAT:%.*]] = shufflevector <vscale x 2 x i64> [[BROADCAST_SPLATINSERT]], <vscale x 2 x i64> undef, <vscale x 2 x i32> zeroinitializer
; CHECK1-NEXT:    [[TMP0:%.*]] = insertelement <vscale x 2 x i32> shufflevector (<vscale x 2 x i32> insertelement (<vscale x 2 x i32> undef, i32 1, i32 0), <vscale x 2 x i32> undef, <vscale x 2 x i32> zeroinitializer), i32 [[C:%.*]], i32 0
; CHECK1-NEXT:    br label [[VECTOR_BODY:%.*]]
; CHECK1:       vector.body:
; CHECK1-NEXT:    [[INDEX:%.*]] = phi i64 [ 0, [[VECTOR_PH]] ], [ [[INDEX_NEXT:%.*]], [[VECTOR_BODY]] ]
; CHECK1-NEXT:    [[VEC_PHI:%.*]] = phi <vscale x 2 x i32> [ [[TMP0]], [[VECTOR_PH]] ], [ [[TMP12:%.*]], [[VECTOR_BODY]] ]
; CHECK1-NEXT:    [[BROADCAST_SPLATINSERT1:%.*]] = insertelement <vscale x 2 x i64> undef, i64 [[INDEX]], i32 0
; CHECK1-NEXT:    [[BROADCAST_SPLAT2:%.*]] = shufflevector <vscale x 2 x i64> [[BROADCAST_SPLATINSERT1]], <vscale x 2 x i64> undef, <vscale x 2 x i32> zeroinitializer
; CHECK1-NEXT:    [[TMP1:%.*]] = call <vscale x 2 x i64> @llvm.experimental.vector.stepvector.nxv2i64()
; CHECK1-NEXT:    [[DOTSPLATINSERT:%.*]] = insertelement <vscale x 2 x i64> undef, i64 0, i32 0
; CHECK1-NEXT:    [[DOTSPLAT:%.*]] = shufflevector <vscale x 2 x i64> [[DOTSPLATINSERT]], <vscale x 2 x i64> undef, <vscale x 2 x i32> zeroinitializer
; CHECK1-NEXT:    [[TMP2:%.*]] = add <vscale x 2 x i64> [[TMP1]], [[DOTSPLAT]]
; CHECK1-NEXT:    [[DOTSPLATINSERT3:%.*]] = insertelement <vscale x 2 x i64> undef, i64 1, i32 0
; CHECK1-NEXT:    [[DOTSPLAT4:%.*]] = shufflevector <vscale x 2 x i64> [[DOTSPLATINSERT3]], <vscale x 2 x i64> undef, <vscale x 2 x i32> zeroinitializer
; CHECK1-NEXT:    [[TMP3:%.*]] = mul <vscale x 2 x i64> [[TMP2]], [[DOTSPLAT4]]
; CHECK1-NEXT:    [[INDUCTION:%.*]] = add <vscale x 2 x i64> [[BROADCAST_SPLAT2]], [[TMP3]]
; CHECK1-NEXT:    [[TMP4:%.*]] = add i64 [[INDEX]], 0
; CHECK1-NEXT:    [[TMP5:%.*]] = icmp ule <vscale x 2 x i64> [[INDUCTION]], [[BROADCAST_SPLAT]]
; CHECK1-NEXT:    [[TMP6:%.*]] = getelementptr inbounds i32, i32* [[A:%.*]], i64 [[TMP4]]
; CHECK1-NEXT:    [[TMP7:%.*]] = sub i64 [[WIDE_TRIP_COUNT]], [[INDEX]]
; CHECK1-NEXT:    [[TMP8:%.*]] = call i64 @llvm.epi.vsetvl(i64 [[TMP7]], i64 2, i64 0)
; CHECK1-NEXT:    [[TMP9:%.*]] = trunc i64 [[TMP8]] to i32
; CHECK1-NEXT:    [[TMP10:%.*]] = getelementptr inbounds i32, i32* [[TMP6]], i32 0
; CHECK1-NEXT:    [[TMP11:%.*]] = bitcast i32* [[TMP10]] to <vscale x 2 x i32>*
; CHECK1-NEXT:    [[DOTSPLATINSERT5:%.*]] = insertelement <vscale x 2 x i1> undef, i1 true, i32 0
; CHECK1-NEXT:    [[DOTSPLAT6:%.*]] = shufflevector <vscale x 2 x i1> [[DOTSPLATINSERT5]], <vscale x 2 x i1> undef, <vscale x 2 x i32> zeroinitializer
; CHECK1-NEXT:    [[VP_OP_LOAD:%.*]] = call <vscale x 2 x i32> @llvm.vp.load.nxv2i32.p0nxv2i32(<vscale x 2 x i32>* [[TMP11]], i32 4, <vscale x 2 x i1> [[DOTSPLAT6]], i32 [[TMP9]])
; CHECK1-NEXT:    [[VP_OP:%.*]] = call <vscale x 2 x i32> @llvm.vp.mul.nxv2i32(<vscale x 2 x i32> [[VP_OP_LOAD]], <vscale x 2 x i32> [[VEC_PHI]], <vscale x 2 x i1> [[DOTSPLAT6]], i32 [[TMP9]])
; CHECK1-NEXT:    [[EVL_SPLATINSERT:%.*]] = insertelement <vscale x 2 x i32> undef, i32 [[TMP9]], i32 0
; CHECK1-NEXT:    [[EVL_SPLAT:%.*]] = shufflevector <vscale x 2 x i32> [[EVL_SPLATINSERT]], <vscale x 2 x i32> undef, <vscale x 2 x i32> zeroinitializer
; CHECK1-NEXT:    [[STEP_VEC:%.*]] = call <vscale x 2 x i32> @llvm.experimental.vector.stepvector.nxv2i32()
; CHECK1-NEXT:    [[EVL_MASK:%.*]] = icmp ult <vscale x 2 x i32> [[STEP_VEC]], [[EVL_SPLAT]]
; CHECK1-NEXT:    [[TMP12]] = select <vscale x 2 x i1> [[EVL_MASK]], <vscale x 2 x i32> [[VP_OP]], <vscale x 2 x i32> [[VEC_PHI]]
; CHECK1-NEXT:    [[TMP13:%.*]] = zext i32 [[TMP9]] to i64
; CHECK1-NEXT:    [[INDEX_NEXT]] = add i64 [[INDEX]], [[TMP13]]
; CHECK1-NEXT:    [[TMP14:%.*]] = icmp eq i64 [[INDEX_NEXT]], [[WIDE_TRIP_COUNT]]
; CHECK1-NEXT:    br i1 [[TMP14]], label [[REDUCTION_LOOP_PH:%.*]], label [[VECTOR_BODY]], [[LOOP0:!llvm.loop !.*]]
; CHECK1:       reduction.loop.ph:
; CHECK1-NEXT:    [[TMP15:%.*]] = call i32 @llvm.vscale.i32()
; CHECK1-NEXT:    [[VSCALE_X_VF:%.*]] = mul i32 2, [[TMP15]]
; CHECK1-NEXT:    br label [[REDUCTION_LOOP_BODY:%.*]]
; CHECK1:       reduction.loop.body:
; CHECK1-NEXT:    [[CURRENT_LEN:%.*]] = phi i32 [ [[VSCALE_X_VF]], [[REDUCTION_LOOP_PH]] ], [ [[HALFLEN:%.*]], [[REDUCTION_LOOP_BODY]] ]
; CHECK1-NEXT:    [[CURRENT_VEC:%.*]] = phi <vscale x 2 x i32> [ [[TMP12]], [[REDUCTION_LOOP_PH]] ], [ [[REDUCTION_VEC:%.*]], [[REDUCTION_LOOP_BODY]] ]
; CHECK1-NEXT:    [[TMP16:%.*]] = udiv i32 [[CURRENT_LEN]], 2
; CHECK1-NEXT:    [[TMP17:%.*]] = urem i32 [[CURRENT_LEN]], 2
; CHECK1-NEXT:    [[HALFLEN]] = add i32 [[TMP16]], [[TMP17]]
; CHECK1-NEXT:    [[TMP18:%.*]] = zext i32 [[CURRENT_LEN]] to i64
; CHECK1-NEXT:    [[TMP19:%.*]] = call i64 @llvm.epi.vsetvl(i64 [[TMP18]], i64 2, i64 0)
; CHECK1-NEXT:    [[TMP20:%.*]] = trunc i64 [[TMP19]] to i32
; CHECK1-NEXT:    [[SECOND_HALF:%.*]] = call <vscale x 2 x i32> @llvm.experimental.vector.vp.slideleftfill.nxv2i32(<vscale x 2 x i32> [[CURRENT_VEC]], <vscale x 2 x i32> shufflevector (<vscale x 2 x i32> insertelement (<vscale x 2 x i32> undef, i32 1, i32 0), <vscale x 2 x i32> undef, <vscale x 2 x i32> zeroinitializer), i32 [[HALFLEN]], i32 [[TMP20]], i32 [[TMP20]])
; CHECK1-NEXT:    [[TMP21:%.*]] = zext i32 [[HALFLEN]] to i64
; CHECK1-NEXT:    [[TMP22:%.*]] = call i64 @llvm.epi.vsetvl(i64 [[TMP21]], i64 2, i64 0)
; CHECK1-NEXT:    [[TMP23:%.*]] = trunc i64 [[TMP22]] to i32
; CHECK1-NEXT:    [[DOTSPLATINSERT9:%.*]] = insertelement <vscale x 2 x i1> undef, i1 true, i32 0
; CHECK1-NEXT:    [[DOTSPLAT10:%.*]] = shufflevector <vscale x 2 x i1> [[DOTSPLATINSERT9]], <vscale x 2 x i1> undef, <vscale x 2 x i32> zeroinitializer
; CHECK1-NEXT:    [[REDUCTION_VEC]] = call <vscale x 2 x i32> @llvm.vp.mul.nxv2i32(<vscale x 2 x i32> [[CURRENT_VEC]], <vscale x 2 x i32> [[SECOND_HALF]], <vscale x 2 x i1> [[DOTSPLAT10]], i32 [[TMP23]])
; CHECK1-NEXT:    [[TMP24:%.*]] = icmp eq i32 [[HALFLEN]], 1
; CHECK1-NEXT:    br i1 [[TMP24]], label [[MIDDLE_BLOCK:%.*]], label [[REDUCTION_LOOP_BODY]]
; CHECK1:       middle.block:
; CHECK1-NEXT:    [[REDUCED:%.*]] = extractelement <vscale x 2 x i32> [[REDUCTION_VEC]], i32 0
; CHECK1-NEXT:    br i1 true, label [[FOR_END_LOOPEXIT:%.*]], label [[SCALAR_PH]]
; CHECK1:       scalar.ph:
; CHECK1-NEXT:    [[BC_RESUME_VAL:%.*]] = phi i64 [ [[WIDE_TRIP_COUNT]], [[MIDDLE_BLOCK]] ], [ 0, [[FOR_BODY_PREHEADER]] ]
; CHECK1-NEXT:    [[BC_MERGE_RDX:%.*]] = phi i32 [ [[C]], [[FOR_BODY_PREHEADER]] ], [ [[REDUCED]], [[MIDDLE_BLOCK]] ]
; CHECK1-NEXT:    br label [[FOR_BODY:%.*]]
; CHECK1:       for.body:
; CHECK1-NEXT:    [[INDVARS_IV:%.*]] = phi i64 [ [[BC_RESUME_VAL]], [[SCALAR_PH]] ], [ [[INDVARS_IV_NEXT:%.*]], [[FOR_BODY]] ]
; CHECK1-NEXT:    [[C_ADDR_06:%.*]] = phi i32 [ [[BC_MERGE_RDX]], [[SCALAR_PH]] ], [ [[MUL:%.*]], [[FOR_BODY]] ]
; CHECK1-NEXT:    [[ARRAYIDX:%.*]] = getelementptr inbounds i32, i32* [[A]], i64 [[INDVARS_IV]]
; CHECK1-NEXT:    [[TMP25:%.*]] = load i32, i32* [[ARRAYIDX]], align 4
; CHECK1-NEXT:    [[MUL]] = mul nsw i32 [[TMP25]], [[C_ADDR_06]]
; CHECK1-NEXT:    [[INDVARS_IV_NEXT]] = add nuw nsw i64 [[INDVARS_IV]], 1
; CHECK1-NEXT:    [[EXITCOND_NOT:%.*]] = icmp eq i64 [[INDVARS_IV_NEXT]], [[WIDE_TRIP_COUNT]]
; CHECK1-NEXT:    br i1 [[EXITCOND_NOT]], label [[FOR_END_LOOPEXIT]], label [[FOR_BODY]], [[LOOP2:!llvm.loop !.*]]
; CHECK1:       for.end.loopexit:
; CHECK1-NEXT:    [[MUL_LCSSA:%.*]] = phi i32 [ [[MUL]], [[FOR_BODY]] ], [ [[REDUCED]], [[MIDDLE_BLOCK]] ]
; CHECK1-NEXT:    br label [[FOR_END]]
; CHECK1:       for.end:
; CHECK1-NEXT:    [[C_ADDR_0_LCSSA:%.*]] = phi i32 [ [[C]], [[ENTRY:%.*]] ], [ [[MUL_LCSSA]], [[FOR_END_LOOPEXIT]] ]
; CHECK1-NEXT:    ret i32 [[C_ADDR_0_LCSSA]]
;
entry:
  %cmp5 = icmp sgt i32 %N, 0
  br i1 %cmp5, label %for.body.preheader, label %for.end

for.body.preheader:                               ; preds = %entry
  %wide.trip.count = zext i32 %N to i64
  br label %for.body

for.body:                                         ; preds = %for.body, %for.body.preheader
  %indvars.iv = phi i64 [ 0, %for.body.preheader ], [ %indvars.iv.next, %for.body ]
  %c.addr.06 = phi i32 [ %c, %for.body.preheader ], [ %mul, %for.body ]
  %arrayidx = getelementptr inbounds i32, i32* %a, i64 %indvars.iv
  %0 = load i32, i32* %arrayidx, align 4
  %mul = mul nsw i32 %0, %c.addr.06
  %indvars.iv.next = add nuw nsw i64 %indvars.iv, 1
  %exitcond.not = icmp eq i64 %indvars.iv.next, %wide.trip.count
  br i1 %exitcond.not, label %for.end.loopexit, label %for.body

for.end.loopexit:                                 ; preds = %for.body
  %mul.lcssa = phi i32 [ %mul, %for.body ]
  br label %for.end

for.end:                                          ; preds = %for.end.loopexit, %entry
  %c.addr.0.lcssa = phi i32 [ %c, %entry ], [ %mul.lcssa, %for.end.loopexit ]
  ret i32 %c.addr.0.lcssa
}
