; NOTE: Assertions have been autogenerated by utils/update_llc_test_checks.py
; RUN: llc -mtriple=riscv64 -mattr=+experimental-v -verify-machineinstrs < %s \
; RUN:    | FileCheck %s

define <vscale x 1 x i1> @vmset() {
; CHECK-LABEL: vmset:
; CHECK:       # %bb.0:
; CHECK-NEXT:    vsetvli zero, zero, e64,m1
; CHECK-NEXT:    vmset.m v0
; CHECK-NEXT:    ret
  %head = insertelement <vscale x 1 x i1> undef, i1 1, i32 0
  %allones = shufflevector <vscale x 1 x i1> %head, <vscale x 1 x i1> undef, <vscale x 1 x i32> zeroinitializer
  ret <vscale x 1 x i1> %allones
}

define <vscale x 2 x i1> @vmset_2() {
; CHECK-LABEL: vmset_2:
; CHECK:       # %bb.0:
; CHECK-NEXT:    vsetvli zero, zero, e32,m1
; CHECK-NEXT:    vmset.m v0
; CHECK-NEXT:    ret
  %head = insertelement <vscale x 2 x i1> undef, i1 1, i32 0
  %allones = shufflevector <vscale x 2 x i1> %head, <vscale x 2 x i1> undef, <vscale x 2 x i32> zeroinitializer
  ret <vscale x 2 x i1> %allones
}

define <vscale x 16 x i1> @vmset_3() {
; CHECK-LABEL: vmset_3:
; CHECK:       # %bb.0:
; CHECK-NEXT:    vsetvli zero, zero, e8,m1
; CHECK-NEXT:    vmset.m v0
; CHECK-NEXT:    ret
  %head = insertelement <vscale x 16 x i1> undef, i1 1, i32 0
  %allones = shufflevector <vscale x 16 x i1> %head, <vscale x 16 x i1> undef, <vscale x 16 x i32> zeroinitializer
  ret <vscale x 16 x i1> %allones
}

define <vscale x 32 x i1> @vmset_4() {
; CHECK-LABEL: vmset_4:
; CHECK:       # %bb.0:
; CHECK-NEXT:    vsetvli zero, zero, e8,m1
; CHECK-NEXT:    vmset.m v0
; CHECK-NEXT:    ret
  %head = insertelement <vscale x 32 x i1> undef, i1 1, i32 0
  %allones = shufflevector <vscale x 32 x i1> %head, <vscale x 32 x i1> undef, <vscale x 32 x i32> zeroinitializer
  ret <vscale x 32 x i1> %allones
}

; FIXME enable when <vscale x 64 x i1> is defined.
;define <vscale x 64 x i1> @vmset_5() {
;  %head = insertelement <vscale x 64 x i1> undef, i1 1, i32 0
;  %allones = shufflevector <vscale x 64 x i1> %head, <vscale x 64 x i1> undef, <vscale x 64 x i32> zeroinitializer
;  ret <vscale x 64 x i1> %allones
;}

define <vscale x 1 x i1> @vmclr() {
; CHECK-LABEL: vmclr:
; CHECK:       # %bb.0:
; CHECK-NEXT:    vsetvli zero, zero, e64,m1
; CHECK-NEXT:    vmclr.m v0
; CHECK-NEXT:    ret
  %head = insertelement <vscale x 1 x i1> undef, i1 0, i32 0
  %allzero = shufflevector <vscale x 1 x i1> %head, <vscale x 1 x i1> undef, <vscale x 1 x i32> zeroinitializer
  ret <vscale x 1 x i1> %allzero
}

define <vscale x 2 x i1> @vmclr_2() {
; CHECK-LABEL: vmclr_2:
; CHECK:       # %bb.0:
; CHECK-NEXT:    vsetvli zero, zero, e32,m1
; CHECK-NEXT:    vmclr.m v0
; CHECK-NEXT:    ret
  %head = insertelement <vscale x 2 x i1> undef, i1 0, i32 0
  %allzero = shufflevector <vscale x 2 x i1> %head, <vscale x 2 x i1> undef, <vscale x 2 x i32> zeroinitializer
  ret <vscale x 2 x i1> %allzero
}

define <vscale x 16 x i1> @vmclr_3() {
; CHECK-LABEL: vmclr_3:
; CHECK:       # %bb.0:
; CHECK-NEXT:    vsetvli zero, zero, e8,m1
; CHECK-NEXT:    vmclr.m v0
; CHECK-NEXT:    ret
  %head = insertelement <vscale x 16 x i1> undef, i1 0, i32 0
  %allzero = shufflevector <vscale x 16 x i1> %head, <vscale x 16 x i1> undef, <vscale x 16 x i32> zeroinitializer
  ret <vscale x 16 x i1> %allzero
}

define <vscale x 32 x i1> @vmclr_4() {
; CHECK-LABEL: vmclr_4:
; CHECK:       # %bb.0:
; CHECK-NEXT:    vsetvli zero, zero, e8,m1
; CHECK-NEXT:    vmclr.m v0
; CHECK-NEXT:    ret
  %head = insertelement <vscale x 32 x i1> undef, i1 0, i32 0
  %allzero = shufflevector <vscale x 32 x i1> %head, <vscale x 32 x i1> undef, <vscale x 32 x i32> zeroinitializer
  ret <vscale x 32 x i1> %allzero
}

; FIXME enable when <vscale x 64 x i1> is defined.
;define <vscale x 64 x i1> @vmclr_5() {
;  %head = insertelement <vscale x 64 x i1> undef, i1 0, i32 0
;  %allzero = shufflevector <vscale x 64 x i1> %head, <vscale x 64 x i1> undef, <vscale x 64 x i32> zeroinitializer
;  ret <vscale x 64 x i1> %allzero
;}
