; NOTE: Assertions have been autogenerated by utils/update_llc_test_checks.py
; RUN: llc -mtriple=riscv64 -mattr=+m,+f,+d,+a,+c,+experimental-v,+only-lmul1 \
; RUN:    -target-abi lp64d -verify-machineinstrs < %s | FileCheck %s

; ModuleID = 'fp-int-widenings-narrowings-lmul1.c'
source_filename = "fp-int-widenings-narrowings-lmul1.c"
target datalayout = "e-m:e-p:64:64-i64:64-i128:128-n64-S128-v128:128:128-v256:128:128-v512:128:128-v1024:128:128"
target triple = "riscv64-unknown-linux-gnu"

; Function Attrs: nofree norecurse nounwind
define dso_local void @fpwiden2(i32 signext %N, double* nocapture %s, i32* nocapture readonly %c) local_unnamed_addr #0 {
; CHECK-LABEL: fpwiden2:
; CHECK:       # %bb.0: # %entry
; CHECK-NEXT:    addi a3, zero, 1
; CHECK-NEXT:    blt a0, a3, .LBB0_3
; CHECK-NEXT:  # %bb.1: # %for.body.preheader
; CHECK-NEXT:    mv a3, zero
; CHECK-NEXT:    slli a0, a0, 32
; CHECK-NEXT:    srli a6, a0, 32
; CHECK-NEXT:  .LBB0_2: # %vector.body
; CHECK-NEXT:    # =>This Inner Loop Header: Depth=1
; CHECK-NEXT:    slli a4, a3, 2
; CHECK-NEXT:    add a4, a4, a2
; CHECK-NEXT:    sub a5, a6, a3
; CHECK-NEXT:    vsetvli a0, a5, e64,m1
; CHECK-NEXT:    vsetvli zero, a0, e32,m1
; CHECK-NEXT:    vle.v v1, (a4)
; CHECK-NEXT:    vfwcvt.f.x.v v2, v1
; CHECK-NEXT:    slli a4, a3, 3
; CHECK-NEXT:    add a4, a4, a1
; CHECK-NEXT:    vsetvli zero, a5, e64,m1
; CHECK-NEXT:    add a3, a3, a0
; CHECK-NEXT:    vse.v v2, (a4)
; CHECK-NEXT:    bne a3, a6, .LBB0_2
; CHECK-NEXT:  .LBB0_3: # %for.cond.cleanup
; CHECK-NEXT:    ret
entry:
  %cmp7 = icmp sgt i32 %N, 0
  br i1 %cmp7, label %for.body.preheader, label %for.cond.cleanup

for.body.preheader:                               ; preds = %entry
  %wide.trip.count = zext i32 %N to i64
  br label %vector.body

vector.body:                                      ; preds = %vector.body, %for.body.preheader
  %index = phi i64 [ 0, %for.body.preheader ], [ %index.next, %vector.body ]
  %0 = getelementptr inbounds i32, i32* %c, i64 %index
  %1 = sub i64 %wide.trip.count, %index
  %2 = call i64 @llvm.epi.vsetvl(i64 %1, i64 3, i64 0)
  %3 = bitcast i32* %0 to <vscale x 1 x i32>*
  %4 = trunc i64 %2 to i32
  %vp.op.load = call <vscale x 1 x i32> @llvm.vp.load.nxv1i32.p0nxv1i32(<vscale x 1 x i32>* %3, i32 4, <vscale x 1 x i1> shufflevector (<vscale x 1 x i1> insertelement (<vscale x 1 x i1> undef, i1 true, i32 0), <vscale x 1 x i1> undef, <vscale x 1 x i32> zeroinitializer), i32 %4), !tbaa !4
  %5 = trunc i64 %2 to i32
  %vp.cast = call <vscale x 1 x double> @llvm.vp.sitofp.nxv1f64.nxv1i32(<vscale x 1 x i32> %vp.op.load, metadata !"round.tonearest", metadata !"fpexcept.ignore", <vscale x 1 x i1> shufflevector (<vscale x 1 x i1> insertelement (<vscale x 1 x i1> undef, i1 true, i32 0), <vscale x 1 x i1> undef, <vscale x 1 x i32> zeroinitializer), i32 %5)
  %6 = getelementptr inbounds double, double* %s, i64 %index
  %7 = bitcast double* %6 to <vscale x 1 x double>*
  %8 = trunc i64 %2 to i32
  call void @llvm.vp.store.nxv1f64.p0nxv1f64(<vscale x 1 x double> %vp.cast, <vscale x 1 x double>* %7, i32 8, <vscale x 1 x i1> shufflevector (<vscale x 1 x i1> insertelement (<vscale x 1 x i1> undef, i1 true, i32 0), <vscale x 1 x i1> undef, <vscale x 1 x i32> zeroinitializer), i32 %8), !tbaa !8
  %index.next = add i64 %index, %2
  %9 = icmp eq i64 %index.next, %wide.trip.count
  br i1 %9, label %for.cond.cleanup, label %vector.body, !llvm.loop !10

for.cond.cleanup:                                 ; preds = %vector.body, %entry
  ret void
}

; Function Attrs: nofree norecurse nounwind
define dso_local void @fpwiden4(i32 signext %N, double* nocapture %s, i16* nocapture readonly %c) local_unnamed_addr #0 {
; CHECK-LABEL: fpwiden4:
; CHECK:       # %bb.0: # %entry
; CHECK-NEXT:    addi a3, zero, 1
; CHECK-NEXT:    blt a0, a3, .LBB1_3
; CHECK-NEXT:  # %bb.1: # %for.body.preheader
; CHECK-NEXT:    mv a3, zero
; CHECK-NEXT:    slli a0, a0, 32
; CHECK-NEXT:    srli a6, a0, 32
; CHECK-NEXT:  .LBB1_2: # %vector.body
; CHECK-NEXT:    # =>This Inner Loop Header: Depth=1
; CHECK-NEXT:    slli a4, a3, 1
; CHECK-NEXT:    add a4, a4, a2
; CHECK-NEXT:    sub a5, a6, a3
; CHECK-NEXT:    vsetvli a0, a5, e64,m1
; CHECK-NEXT:    vsetvli zero, a0, e16,m1
; CHECK-NEXT:    vle.v v1, (a4)
; CHECK-NEXT:    vwcvt.x.x.v v2, v1
; CHECK-NEXT:    vsetvli zero, a0, e32,m1
; CHECK-NEXT:    vfwcvt.f.x.v v4, v2
; CHECK-NEXT:    slli a4, a3, 3
; CHECK-NEXT:    add a4, a4, a1
; CHECK-NEXT:    vsetvli zero, a5, e64,m1
; CHECK-NEXT:    add a3, a3, a0
; CHECK-NEXT:    vse.v v4, (a4)
; CHECK-NEXT:    bne a3, a6, .LBB1_2
; CHECK-NEXT:  .LBB1_3: # %for.cond.cleanup
; CHECK-NEXT:    ret
entry:
  %cmp7 = icmp sgt i32 %N, 0
  br i1 %cmp7, label %for.body.preheader, label %for.cond.cleanup

for.body.preheader:                               ; preds = %entry
  %wide.trip.count = zext i32 %N to i64
  br label %vector.body

vector.body:                                      ; preds = %vector.body, %for.body.preheader
  %index = phi i64 [ 0, %for.body.preheader ], [ %index.next, %vector.body ]
  %0 = getelementptr inbounds i16, i16* %c, i64 %index
  %1 = sub i64 %wide.trip.count, %index
  %2 = call i64 @llvm.epi.vsetvl(i64 %1, i64 3, i64 0)
  %3 = bitcast i16* %0 to <vscale x 1 x i16>*
  %4 = trunc i64 %2 to i32
  %vp.op.load = call <vscale x 1 x i16> @llvm.vp.load.nxv1i16.p0nxv1i16(<vscale x 1 x i16>* %3, i32 2, <vscale x 1 x i1> shufflevector (<vscale x 1 x i1> insertelement (<vscale x 1 x i1> undef, i1 true, i32 0), <vscale x 1 x i1> undef, <vscale x 1 x i32> zeroinitializer), i32 %4), !tbaa !13
  %5 = trunc i64 %2 to i32
  %vp.cast = call <vscale x 1 x double> @llvm.vp.sitofp.nxv1f64.nxv1i16(<vscale x 1 x i16> %vp.op.load, metadata !"round.tonearest", metadata !"fpexcept.ignore", <vscale x 1 x i1> shufflevector (<vscale x 1 x i1> insertelement (<vscale x 1 x i1> undef, i1 true, i32 0), <vscale x 1 x i1> undef, <vscale x 1 x i32> zeroinitializer), i32 %5)
  %6 = getelementptr inbounds double, double* %s, i64 %index
  %7 = bitcast double* %6 to <vscale x 1 x double>*
  %8 = trunc i64 %2 to i32
  call void @llvm.vp.store.nxv1f64.p0nxv1f64(<vscale x 1 x double> %vp.cast, <vscale x 1 x double>* %7, i32 8, <vscale x 1 x i1> shufflevector (<vscale x 1 x i1> insertelement (<vscale x 1 x i1> undef, i1 true, i32 0), <vscale x 1 x i1> undef, <vscale x 1 x i32> zeroinitializer), i32 %8), !tbaa !8
  %index.next = add i64 %index, %2
  %9 = icmp eq i64 %index.next, %wide.trip.count
  br i1 %9, label %for.cond.cleanup, label %vector.body, !llvm.loop !15

for.cond.cleanup:                                 ; preds = %vector.body, %entry
  ret void
}

; Function Attrs: nofree norecurse nounwind
define dso_local void @fpwiden8(i32 signext %N, double* nocapture %s, i8* nocapture readonly %c) local_unnamed_addr #0 {
; CHECK-LABEL: fpwiden8:
; CHECK:       # %bb.0: # %entry
; CHECK-NEXT:    addi a3, zero, 1
; CHECK-NEXT:    blt a0, a3, .LBB2_5
; CHECK-NEXT:  # %bb.1: # %for.body.preheader
; CHECK-NEXT:    slli a0, a0, 32
; CHECK-NEXT:    srli a0, a0, 32
; CHECK-NEXT:    slli a3, a0, 3
; CHECK-NEXT:    add a3, a3, a1
; CHECK-NEXT:    add a4, a2, a0
; CHECK-NEXT:    sltu a4, a1, a4
; CHECK-NEXT:    sltu a3, a2, a3
; CHECK-NEXT:    and a3, a3, a4
; CHECK-NEXT:    beqz a3, .LBB2_3
; CHECK-NEXT:  .LBB2_2: # %for.body
; CHECK-NEXT:    # =>This Inner Loop Header: Depth=1
; CHECK-NEXT:    lbu a3, 0(a2)
; CHECK-NEXT:    fcvt.d.lu ft0, a3
; CHECK-NEXT:    fsd ft0, 0(a1)
; CHECK-NEXT:    addi a0, a0, -1
; CHECK-NEXT:    addi a1, a1, 8
; CHECK-NEXT:    addi a2, a2, 1
; CHECK-NEXT:    bnez a0, .LBB2_2
; CHECK-NEXT:    j .LBB2_5
; CHECK-NEXT:  .LBB2_3: # %vector.body.preheader
; CHECK-NEXT:    mv a3, zero
; CHECK-NEXT:  .LBB2_4: # %vector.body
; CHECK-NEXT:    # =>This Inner Loop Header: Depth=1
; CHECK-NEXT:    add a6, a2, a3
; CHECK-NEXT:    sub a7, a0, a3
; CHECK-NEXT:    vsetvli a4, a7, e64,m1
; CHECK-NEXT:    vsetvli zero, a4, e8,m1
; CHECK-NEXT:    vle.v v1, (a6)
; CHECK-NEXT:    vwcvtu.x.x.v v2, v1
; CHECK-NEXT:    vsetvli zero, a4, e16,m1
; CHECK-NEXT:    vwcvtu.x.x.v v4, v2
; CHECK-NEXT:    vsetvli zero, a4, e32,m1
; CHECK-NEXT:    vfwcvt.f.xu.v v2, v4
; CHECK-NEXT:    slli a5, a3, 3
; CHECK-NEXT:    add a5, a5, a1
; CHECK-NEXT:    vsetvli zero, a7, e64,m1
; CHECK-NEXT:    add a3, a3, a4
; CHECK-NEXT:    vse.v v2, (a5)
; CHECK-NEXT:    bne a3, a0, .LBB2_4
; CHECK-NEXT:  .LBB2_5: # %for.cond.cleanup
; CHECK-NEXT:    ret
entry:
  %cmp7 = icmp sgt i32 %N, 0
  br i1 %cmp7, label %for.body.preheader, label %for.cond.cleanup

for.body.preheader:                               ; preds = %entry
  %s9 = bitcast double* %s to i8*
  %wide.trip.count = zext i32 %N to i64
  %scevgep = getelementptr double, double* %s, i64 %wide.trip.count
  %scevgep10 = bitcast double* %scevgep to i8*
  %scevgep11 = getelementptr i8, i8* %c, i64 %wide.trip.count
  %bound0 = icmp ugt i8* %scevgep11, %s9
  %bound1 = icmp ugt i8* %scevgep10, %c
  %found.conflict = and i1 %bound0, %bound1
  br i1 %found.conflict, label %for.body, label %vector.body

vector.body:                                      ; preds = %for.body.preheader, %vector.body
  %index = phi i64 [ %index.next, %vector.body ], [ 0, %for.body.preheader ]
  %0 = getelementptr inbounds i8, i8* %c, i64 %index
  %1 = sub i64 %wide.trip.count, %index
  %2 = call i64 @llvm.epi.vsetvl(i64 %1, i64 3, i64 0)
  %3 = bitcast i8* %0 to <vscale x 1 x i8>*
  %4 = trunc i64 %2 to i32
  %vp.op.load = call <vscale x 1 x i8> @llvm.vp.load.nxv1i8.p0nxv1i8(<vscale x 1 x i8>* %3, i32 1, <vscale x 1 x i1> shufflevector (<vscale x 1 x i1> insertelement (<vscale x 1 x i1> undef, i1 true, i32 0), <vscale x 1 x i1> undef, <vscale x 1 x i32> zeroinitializer), i32 %4), !tbaa !16, !alias.scope !17
  %5 = trunc i64 %2 to i32
  %vp.cast = call <vscale x 1 x double> @llvm.vp.uitofp.nxv1f64.nxv1i8(<vscale x 1 x i8> %vp.op.load, metadata !"round.tonearest", metadata !"fpexcept.ignore", <vscale x 1 x i1> shufflevector (<vscale x 1 x i1> insertelement (<vscale x 1 x i1> undef, i1 true, i32 0), <vscale x 1 x i1> undef, <vscale x 1 x i32> zeroinitializer), i32 %5)
  %6 = getelementptr inbounds double, double* %s, i64 %index
  %7 = bitcast double* %6 to <vscale x 1 x double>*
  %8 = trunc i64 %2 to i32
  call void @llvm.vp.store.nxv1f64.p0nxv1f64(<vscale x 1 x double> %vp.cast, <vscale x 1 x double>* %7, i32 8, <vscale x 1 x i1> shufflevector (<vscale x 1 x i1> insertelement (<vscale x 1 x i1> undef, i1 true, i32 0), <vscale x 1 x i1> undef, <vscale x 1 x i32> zeroinitializer), i32 %8), !tbaa !8, !alias.scope !20, !noalias !17
  %index.next = add i64 %index, %2
  %9 = icmp eq i64 %index.next, %wide.trip.count
  br i1 %9, label %for.cond.cleanup, label %vector.body, !llvm.loop !22

for.cond.cleanup:                                 ; preds = %vector.body, %for.body, %entry
  ret void

for.body:                                         ; preds = %for.body.preheader, %for.body
  %indvars.iv = phi i64 [ %indvars.iv.next, %for.body ], [ 0, %for.body.preheader ]
  %arrayidx = getelementptr inbounds i8, i8* %c, i64 %indvars.iv
  %10 = load i8, i8* %arrayidx, align 1, !tbaa !16
  %conv = uitofp i8 %10 to double
  %arrayidx2 = getelementptr inbounds double, double* %s, i64 %indvars.iv
  store double %conv, double* %arrayidx2, align 8, !tbaa !8
  %indvars.iv.next = add nuw nsw i64 %indvars.iv, 1
  %exitcond.not = icmp eq i64 %indvars.iv.next, %wide.trip.count
  br i1 %exitcond.not, label %for.cond.cleanup, label %for.body, !llvm.loop !23
}

; Function Attrs: nofree norecurse nounwind
define dso_local void @fpnarrow2(i32 signext %N, float* nocapture %s, i64* nocapture readonly %c) local_unnamed_addr #0 {
; CHECK-LABEL: fpnarrow2:
; CHECK:       # %bb.0: # %entry
; CHECK-NEXT:    addi a3, zero, 1
; CHECK-NEXT:    blt a0, a3, .LBB3_3
; CHECK-NEXT:  # %bb.1: # %for.body.preheader
; CHECK-NEXT:    mv a3, zero
; CHECK-NEXT:    slli a0, a0, 32
; CHECK-NEXT:    srli a0, a0, 32
; CHECK-NEXT:  .LBB3_2: # %vector.body
; CHECK-NEXT:    # =>This Inner Loop Header: Depth=1
; CHECK-NEXT:    slli a4, a3, 3
; CHECK-NEXT:    add a4, a4, a2
; CHECK-NEXT:    sub a5, a0, a3
; CHECK-NEXT:    vsetvli a5, a5, e64,m1
; CHECK-NEXT:    vle.v v2, (a4)
; CHECK-NEXT:    vsetvli zero, a5, e32,m1
; CHECK-NEXT:    vfncvt.f.x.v v1, v2
; CHECK-NEXT:    slli a4, a3, 2
; CHECK-NEXT:    add a4, a4, a1
; CHECK-NEXT:    add a3, a3, a5
; CHECK-NEXT:    vse.v v1, (a4)
; CHECK-NEXT:    bne a3, a0, .LBB3_2
; CHECK-NEXT:  .LBB3_3: # %for.cond.cleanup
; CHECK-NEXT:    ret
entry:
  %cmp7 = icmp sgt i32 %N, 0
  br i1 %cmp7, label %for.body.preheader, label %for.cond.cleanup

for.body.preheader:                               ; preds = %entry
  %wide.trip.count = zext i32 %N to i64
  br label %vector.body

vector.body:                                      ; preds = %vector.body, %for.body.preheader
  %index = phi i64 [ 0, %for.body.preheader ], [ %index.next, %vector.body ]
  %0 = getelementptr inbounds i64, i64* %c, i64 %index
  %1 = sub i64 %wide.trip.count, %index
  %2 = call i64 @llvm.epi.vsetvl(i64 %1, i64 3, i64 0)
  %3 = bitcast i64* %0 to <vscale x 1 x i64>*
  %4 = trunc i64 %2 to i32
  %vp.op.load = call <vscale x 1 x i64> @llvm.vp.load.nxv1i64.p0nxv1i64(<vscale x 1 x i64>* %3, i32 8, <vscale x 1 x i1> shufflevector (<vscale x 1 x i1> insertelement (<vscale x 1 x i1> undef, i1 true, i32 0), <vscale x 1 x i1> undef, <vscale x 1 x i32> zeroinitializer), i32 %4), !tbaa !24
  %5 = trunc i64 %2 to i32
  %vp.cast = call <vscale x 1 x float> @llvm.vp.sitofp.nxv1f32.nxv1i64(<vscale x 1 x i64> %vp.op.load, metadata !"round.tonearest", metadata !"fpexcept.ignore", <vscale x 1 x i1> shufflevector (<vscale x 1 x i1> insertelement (<vscale x 1 x i1> undef, i1 true, i32 0), <vscale x 1 x i1> undef, <vscale x 1 x i32> zeroinitializer), i32 %5)
  %6 = getelementptr inbounds float, float* %s, i64 %index
  %7 = bitcast float* %6 to <vscale x 1 x float>*
  %8 = trunc i64 %2 to i32
  call void @llvm.vp.store.nxv1f32.p0nxv1f32(<vscale x 1 x float> %vp.cast, <vscale x 1 x float>* %7, i32 4, <vscale x 1 x i1> shufflevector (<vscale x 1 x i1> insertelement (<vscale x 1 x i1> undef, i1 true, i32 0), <vscale x 1 x i1> undef, <vscale x 1 x i32> zeroinitializer), i32 %8), !tbaa !26
  %index.next = add i64 %index, %2
  %9 = icmp eq i64 %index.next, %wide.trip.count
  br i1 %9, label %for.cond.cleanup, label %vector.body, !llvm.loop !28

for.cond.cleanup:                                 ; preds = %vector.body, %entry
  ret void
}

; Function Attrs: nounwind readnone
declare i64 @llvm.epi.vsetvl(i64, i64, i64) #1

; Function Attrs: argmemonly nosync nounwind readonly willreturn
declare <vscale x 1 x i32> @llvm.vp.load.nxv1i32.p0nxv1i32(<vscale x 1 x i32>* nocapture, i32 immarg, <vscale x 1 x i1>, i32) #2

; Function Attrs: nounwind readnone willreturn
declare <vscale x 1 x double> @llvm.vp.sitofp.nxv1f64.nxv1i32(<vscale x 1 x i32>, metadata, metadata, <vscale x 1 x i1>, i32) #3

; Function Attrs: argmemonly nosync nounwind willreturn writeonly
declare void @llvm.vp.store.nxv1f64.p0nxv1f64(<vscale x 1 x double>, <vscale x 1 x double>* nocapture, i32 immarg, <vscale x 1 x i1>, i32) #4

; Function Attrs: argmemonly nosync nounwind readonly willreturn
declare <vscale x 1 x i16> @llvm.vp.load.nxv1i16.p0nxv1i16(<vscale x 1 x i16>* nocapture, i32 immarg, <vscale x 1 x i1>, i32) #2

; Function Attrs: nounwind readnone willreturn
declare <vscale x 1 x double> @llvm.vp.sitofp.nxv1f64.nxv1i16(<vscale x 1 x i16>, metadata, metadata, <vscale x 1 x i1>, i32) #3

; Function Attrs: argmemonly nosync nounwind readonly willreturn
declare <vscale x 1 x i8> @llvm.vp.load.nxv1i8.p0nxv1i8(<vscale x 1 x i8>* nocapture, i32 immarg, <vscale x 1 x i1>, i32) #2

; Function Attrs: nounwind readnone willreturn
declare <vscale x 1 x double> @llvm.vp.uitofp.nxv1f64.nxv1i8(<vscale x 1 x i8>, metadata, metadata, <vscale x 1 x i1>, i32) #3

; Function Attrs: argmemonly nosync nounwind readonly willreturn
declare <vscale x 1 x i64> @llvm.vp.load.nxv1i64.p0nxv1i64(<vscale x 1 x i64>* nocapture, i32 immarg, <vscale x 1 x i1>, i32) #2

; Function Attrs: nounwind readnone willreturn
declare <vscale x 1 x float> @llvm.vp.sitofp.nxv1f32.nxv1i64(<vscale x 1 x i64>, metadata, metadata, <vscale x 1 x i1>, i32) #3

; Function Attrs: argmemonly nosync nounwind willreturn writeonly
declare void @llvm.vp.store.nxv1f32.p0nxv1f32(<vscale x 1 x float>, <vscale x 1 x float>* nocapture, i32 immarg, <vscale x 1 x i1>, i32) #4

attributes #0 = { nofree norecurse nounwind "disable-tail-calls"="false" "frame-pointer"="none" "less-precise-fpmad"="false" "min-legal-vector-width"="0" "no-infs-fp-math"="false" "no-jump-tables"="false" "no-nans-fp-math"="false" "no-signed-zeros-fp-math"="false" "no-trapping-math"="true" "stack-protector-buffer-size"="8" "target-features"="+a,+c,+d,+experimental-v,+experimental-zvlsseg,+f,+m,+only-lmul1,-relax,-save-restore" "unsafe-fp-math"="false" "use-soft-float"="false" }
attributes #1 = { nounwind readnone }
attributes #2 = { argmemonly nosync nounwind readonly willreturn }
attributes #3 = { nounwind readnone willreturn }
attributes #4 = { argmemonly nosync nounwind willreturn writeonly }

!llvm.module.flags = !{!0, !1, !2}
!llvm.ident = !{!3}

!0 = !{i32 1, !"wchar_size", i32 4}
!1 = !{i32 1, !"target-abi", !"lp64d"}
!2 = !{i32 1, !"SmallDataLimit", i32 8}
!3 = !{!"clang version 12.0.0"}
!4 = !{!5, !5, i64 0}
!5 = !{!"int", !6, i64 0}
!6 = !{!"omnipotent char", !7, i64 0}
!7 = !{!"Simple C/C++ TBAA"}
!8 = !{!9, !9, i64 0}
!9 = !{!"double", !6, i64 0}
!10 = distinct !{!10, !11, !12}
!11 = !{!"llvm.loop.mustprogress"}
!12 = !{!"llvm.loop.isvectorized", i32 1}
!13 = !{!14, !14, i64 0}
!14 = !{!"short", !6, i64 0}
!15 = distinct !{!15, !11, !12}
!16 = !{!6, !6, i64 0}
!17 = !{!18}
!18 = distinct !{!18, !19}
!19 = distinct !{!19, !"LVerDomain"}
!20 = !{!21}
!21 = distinct !{!21, !19}
!22 = distinct !{!22, !11, !12}
!23 = distinct !{!23, !11, !12}
!24 = !{!25, !25, i64 0}
!25 = !{!"long", !6, i64 0}
!26 = !{!27, !27, i64 0}
!27 = !{!"float", !6, i64 0}
!28 = distinct !{!28, !11, !12}
