; NOTE: Assertions have been autogenerated by utils/update_llc_test_checks.py
; RUN: llc -mtriple=riscv64 -mattr=+experimental-v -verify-machineinstrs < %s | FileCheck %s

declare <vscale x 8 x i16> @llvm.epi.vwredsum.nxv8i16(<vscale x 8 x i8> %a, <vscale x 8 x i16> %b, i64 %evl)
declare <vscale x 16 x i16> @llvm.epi.vwredsum.nxv16i16(<vscale x 16 x i8> %a, <vscale x 16 x i16> %b, i64 %evl)
declare <vscale x 32 x i16> @llvm.epi.vwredsum.nxv32i16(<vscale x 32 x i8> %a, <vscale x 32 x i16> %b, i64 %evl)

declare <vscale x 4 x i32> @llvm.epi.vwredsum.nxv4i32(<vscale x 4 x i16> %a, <vscale x 4 x i32> %b, i64 %evl)
declare <vscale x 8 x i32> @llvm.epi.vwredsum.nxv8i32(<vscale x 8 x i16> %a, <vscale x 8 x i32> %b, i64 %evl)
declare <vscale x 16 x i32> @llvm.epi.vwredsum.nxv16i32(<vscale x 16 x i16> %a, <vscale x 16 x i32> %b, i64 %evl)

declare <vscale x 2 x i64> @llvm.epi.vwredsum.nxv2i64(<vscale x 2 x i32> %a, <vscale x 2 x i64> %b, i64 %evl)
declare <vscale x 4 x i64> @llvm.epi.vwredsum.nxv4i64(<vscale x 4 x i32> %a, <vscale x 4 x i64> %b, i64 %evl)
declare <vscale x 8 x i64> @llvm.epi.vwredsum.nxv8i64(<vscale x 8 x i32> %a, <vscale x 8 x i64> %b, i64 %evl)

declare <vscale x 8 x i16> @llvm.epi.vwredsum.mask.nxv8i16(<vscale x 8 x i16> %merge, <vscale x 8 x i8> %a, <vscale x 8 x i16> %b, <vscale x 8 x i1> %mask, i64 %evl)
declare <vscale x 16 x i16> @llvm.epi.vwredsum.mask.nxv16i16(<vscale x 16 x i16> %merge, <vscale x 16 x i8> %a, <vscale x 16 x i16> %b, <vscale x 16 x i1> %mask, i64 %evl)
declare <vscale x 32 x i16> @llvm.epi.vwredsum.mask.nxv32i16(<vscale x 32 x i16> %merge, <vscale x 32 x i8> %a, <vscale x 32 x i16> %b, <vscale x 32 x i1> %mask, i64 %evl)

declare <vscale x 4 x i32> @llvm.epi.vwredsum.mask.nxv4i32(<vscale x 4 x i32> %merge, <vscale x 4 x i16> %a, <vscale x 4 x i32> %b, <vscale x 4 x i1> %mask, i64 %evl)
declare <vscale x 8 x i32> @llvm.epi.vwredsum.mask.nxv8i32(<vscale x 8 x i32> %merge, <vscale x 8 x i16> %a, <vscale x 8 x i32> %b, <vscale x 8 x i1> %mask, i64 %evl)
declare <vscale x 16 x i32> @llvm.epi.vwredsum.mask.nxv16i32(<vscale x 16 x i32> %merge, <vscale x 16 x i16> %a, <vscale x 16 x i32> %b, <vscale x 16 x i1> %mask, i64 %evl)

declare <vscale x 2 x i64> @llvm.epi.vwredsum.mask.nxv2i64(<vscale x 2 x i64> %merge, <vscale x 2 x i32> %a, <vscale x 2 x i64> %b, <vscale x 2 x i1> %mask, i64 %evl)
declare <vscale x 4 x i64> @llvm.epi.vwredsum.mask.nxv4i64(<vscale x 4 x i64> %merge, <vscale x 4 x i32> %a, <vscale x 4 x i64> %b, <vscale x 4 x i1> %mask, i64 %evl)
declare <vscale x 8 x i64> @llvm.epi.vwredsum.mask.nxv8i64(<vscale x 8 x i64> %merge, <vscale x 8 x i32> %a, <vscale x 8 x i64> %b, <vscale x 8 x i1> %mask, i64 %evl)

define <vscale x 8 x i16> @test_llvm.epi.vwredsum_nxv8i16(<vscale x 8 x i8> %a, <vscale x 8 x i16> %b, i64 %evl) {
; CHECK-LABEL: test_llvm.epi.vwredsum_nxv8i16:
; CHECK:       # %bb.0:
; CHECK-NEXT:    vsetvli zero, a0, e8,m1
; CHECK-NEXT:    vwredsum.vs v16, v16, v18
; CHECK-NEXT:    ret
    %1 = call <vscale x 8 x i16> @llvm.epi.vwredsum.nxv8i16(<vscale x 8 x i8> %a, <vscale x 8 x i16> %b, i64 %evl)
    ret <vscale x 8 x i16> %1
}

define <vscale x 16 x i16> @test_llvm.epi.vwredsum_nxv16i16(<vscale x 16 x i8> %a, <vscale x 16 x i16> %b, i64 %evl) {
; CHECK-LABEL: test_llvm.epi.vwredsum_nxv16i16:
; CHECK:       # %bb.0:
; CHECK-NEXT:    vsetvli zero, a0, e8,m2
; CHECK-NEXT:    vwredsum.vs v16, v16, v20
; CHECK-NEXT:    ret
    %1 = call <vscale x 16 x i16> @llvm.epi.vwredsum.nxv16i16(<vscale x 16 x i8> %a, <vscale x 16 x i16> %b, i64 %evl)
    ret <vscale x 16 x i16> %1
}

define <vscale x 32 x i16> @test_llvm.epi.vwredsum_nxv32i16(<vscale x 32 x i8> %a, <vscale x 32 x i16> %b, i64 %evl) {
; CHECK-LABEL: test_llvm.epi.vwredsum_nxv32i16:
; CHECK:       # %bb.0:
; CHECK-NEXT:    vsetvli zero, zero, e16,m8
; CHECK-NEXT:    vle.v v8, (a0)
; CHECK-NEXT:    vsetvli zero, a1, e8,m4
; CHECK-NEXT:    vwredsum.vs v16, v16, v8
; CHECK-NEXT:    ret
    %1 = call <vscale x 32 x i16> @llvm.epi.vwredsum.nxv32i16(<vscale x 32 x i8> %a, <vscale x 32 x i16> %b, i64 %evl)
    ret <vscale x 32 x i16> %1
}

define <vscale x 4 x i32> @test_llvm.epi.vwredsum_nxv4i32(<vscale x 4 x i16> %a, <vscale x 4 x i32> %b, i64 %evl) {
; CHECK-LABEL: test_llvm.epi.vwredsum_nxv4i32:
; CHECK:       # %bb.0:
; CHECK-NEXT:    vsetvli zero, a0, e16,m1
; CHECK-NEXT:    vwredsum.vs v16, v16, v18
; CHECK-NEXT:    ret
    %1 = call <vscale x 4 x i32> @llvm.epi.vwredsum.nxv4i32(<vscale x 4 x i16> %a, <vscale x 4 x i32> %b, i64 %evl)
    ret <vscale x 4 x i32> %1
}

define <vscale x 8 x i32> @test_llvm.epi.vwredsum_nxv8i32(<vscale x 8 x i16> %a, <vscale x 8 x i32> %b, i64 %evl) {
; CHECK-LABEL: test_llvm.epi.vwredsum_nxv8i32:
; CHECK:       # %bb.0:
; CHECK-NEXT:    vsetvli zero, a0, e16,m2
; CHECK-NEXT:    vwredsum.vs v16, v16, v20
; CHECK-NEXT:    ret
    %1 = call <vscale x 8 x i32> @llvm.epi.vwredsum.nxv8i32(<vscale x 8 x i16> %a, <vscale x 8 x i32> %b, i64 %evl)
    ret <vscale x 8 x i32> %1
}

define <vscale x 16 x i32> @test_llvm.epi.vwredsum_nxv16i32(<vscale x 16 x i16> %a, <vscale x 16 x i32> %b, i64 %evl) {
; CHECK-LABEL: test_llvm.epi.vwredsum_nxv16i32:
; CHECK:       # %bb.0:
; CHECK-NEXT:    vsetvli zero, zero, e32,m8
; CHECK-NEXT:    vle.v v8, (a0)
; CHECK-NEXT:    vsetvli zero, a1, e16,m4
; CHECK-NEXT:    vwredsum.vs v16, v16, v8
; CHECK-NEXT:    ret
    %1 = call <vscale x 16 x i32> @llvm.epi.vwredsum.nxv16i32(<vscale x 16 x i16> %a, <vscale x 16 x i32> %b, i64 %evl)
    ret <vscale x 16 x i32> %1
}

define <vscale x 2 x i64> @test_llvm.epi.vwredsum_nxv2i64(<vscale x 2 x i32> %a, <vscale x 2 x i64> %b, i64 %evl) {
; CHECK-LABEL: test_llvm.epi.vwredsum_nxv2i64:
; CHECK:       # %bb.0:
; CHECK-NEXT:    vsetvli zero, a0, e32,m1
; CHECK-NEXT:    vwredsum.vs v16, v16, v18
; CHECK-NEXT:    ret
    %1 = call <vscale x 2 x i64> @llvm.epi.vwredsum.nxv2i64(<vscale x 2 x i32> %a, <vscale x 2 x i64> %b, i64 %evl)
    ret <vscale x 2 x i64> %1
}

define <vscale x 4 x i64> @test_llvm.epi.vwredsum_nxv4i64(<vscale x 4 x i32> %a, <vscale x 4 x i64> %b, i64 %evl) {
; CHECK-LABEL: test_llvm.epi.vwredsum_nxv4i64:
; CHECK:       # %bb.0:
; CHECK-NEXT:    vsetvli zero, a0, e32,m2
; CHECK-NEXT:    vwredsum.vs v16, v16, v20
; CHECK-NEXT:    ret
    %1 = call <vscale x 4 x i64> @llvm.epi.vwredsum.nxv4i64(<vscale x 4 x i32> %a, <vscale x 4 x i64> %b, i64 %evl)
    ret <vscale x 4 x i64> %1
}

define <vscale x 8 x i64> @test_llvm.epi.vwredsum_nxv8i64(<vscale x 8 x i32> %a, <vscale x 8 x i64> %b, i64 %evl) {
; CHECK-LABEL: test_llvm.epi.vwredsum_nxv8i64:
; CHECK:       # %bb.0:
; CHECK-NEXT:    vsetvli zero, zero, e64,m8
; CHECK-NEXT:    vle.v v8, (a0)
; CHECK-NEXT:    vsetvli zero, a1, e32,m4
; CHECK-NEXT:    vwredsum.vs v16, v16, v8
; CHECK-NEXT:    ret
    %1 = call <vscale x 8 x i64> @llvm.epi.vwredsum.nxv8i64(<vscale x 8 x i32> %a, <vscale x 8 x i64> %b, i64 %evl)
    ret <vscale x 8 x i64> %1
}

define <vscale x 8 x i16> @test_llvm.epi.vwredsum.mask_nxv8i16(<vscale x 8 x i16> %merge, <vscale x 8 x i8> %a, <vscale x 8 x i16> %b, <vscale x 8 x i1> %mask, i64 %evl) {
; CHECK-LABEL: test_llvm.epi.vwredsum.mask_nxv8i16:
; CHECK:       # %bb.0:
; CHECK-NEXT:    vsetvli zero, a0, e8,m1
; CHECK-NEXT:    vwredsum.vs v16, v18, v20, v0.t
; CHECK-NEXT:    ret
    %1 = call <vscale x 8 x i16> @llvm.epi.vwredsum.mask.nxv8i16(<vscale x 8 x i16> %merge, <vscale x 8 x i8> %a, <vscale x 8 x i16> %b, <vscale x 8 x i1> %mask, i64 %evl)
    ret <vscale x 8 x i16> %1
}

define <vscale x 16 x i16> @test_llvm.epi.vwredsum.mask_nxv16i16(<vscale x 16 x i16> %merge, <vscale x 16 x i8> %a, <vscale x 16 x i16> %b, <vscale x 16 x i1> %mask, i64 %evl) {
; CHECK-LABEL: test_llvm.epi.vwredsum.mask_nxv16i16:
; CHECK:       # %bb.0:
; CHECK-NEXT:    vsetvli zero, zero, e16,m4
; CHECK-NEXT:    vle.v v4, (a0)
; CHECK-NEXT:    vsetvli zero, a1, e8,m2
; CHECK-NEXT:    vwredsum.vs v16, v20, v4, v0.t
; CHECK-NEXT:    ret
    %1 = call <vscale x 16 x i16> @llvm.epi.vwredsum.mask.nxv16i16(<vscale x 16 x i16> %merge, <vscale x 16 x i8> %a, <vscale x 16 x i16> %b, <vscale x 16 x i1> %mask, i64 %evl)
    ret <vscale x 16 x i16> %1
}

define <vscale x 32 x i16> @test_llvm.epi.vwredsum.mask_nxv32i16(<vscale x 32 x i16> %merge, <vscale x 32 x i8> %a, <vscale x 32 x i16> %b, <vscale x 32 x i1> %mask, i64 %evl) {
; CHECK-LABEL: test_llvm.epi.vwredsum.mask_nxv32i16:
; CHECK:       # %bb.0:
; CHECK-NEXT:    vsetvli zero, zero, e16,m8
; CHECK-NEXT:    vle.v v8, (a1)
; CHECK-NEXT:    vsetvli zero, zero, e8,m4
; CHECK-NEXT:    vle.v v4, (a0)
; CHECK-NEXT:    vsetvli zero, a2, e8,m4
; CHECK-NEXT:    vwredsum.vs v16, v4, v8, v0.t
; CHECK-NEXT:    ret
    %1 = call <vscale x 32 x i16> @llvm.epi.vwredsum.mask.nxv32i16(<vscale x 32 x i16> %merge, <vscale x 32 x i8> %a, <vscale x 32 x i16> %b, <vscale x 32 x i1> %mask, i64 %evl)
    ret <vscale x 32 x i16> %1
}

define <vscale x 4 x i32> @test_llvm.epi.vwredsum.mask_nxv4i32(<vscale x 4 x i32> %merge, <vscale x 4 x i16> %a, <vscale x 4 x i32> %b, <vscale x 4 x i1> %mask, i64 %evl) {
; CHECK-LABEL: test_llvm.epi.vwredsum.mask_nxv4i32:
; CHECK:       # %bb.0:
; CHECK-NEXT:    vsetvli zero, a0, e16,m1
; CHECK-NEXT:    vwredsum.vs v16, v18, v20, v0.t
; CHECK-NEXT:    ret
    %1 = call <vscale x 4 x i32> @llvm.epi.vwredsum.mask.nxv4i32(<vscale x 4 x i32> %merge, <vscale x 4 x i16> %a, <vscale x 4 x i32> %b, <vscale x 4 x i1> %mask, i64 %evl)
    ret <vscale x 4 x i32> %1
}

define <vscale x 8 x i32> @test_llvm.epi.vwredsum.mask_nxv8i32(<vscale x 8 x i32> %merge, <vscale x 8 x i16> %a, <vscale x 8 x i32> %b, <vscale x 8 x i1> %mask, i64 %evl) {
; CHECK-LABEL: test_llvm.epi.vwredsum.mask_nxv8i32:
; CHECK:       # %bb.0:
; CHECK-NEXT:    vsetvli zero, zero, e32,m4
; CHECK-NEXT:    vle.v v4, (a0)
; CHECK-NEXT:    vsetvli zero, a1, e16,m2
; CHECK-NEXT:    vwredsum.vs v16, v20, v4, v0.t
; CHECK-NEXT:    ret
    %1 = call <vscale x 8 x i32> @llvm.epi.vwredsum.mask.nxv8i32(<vscale x 8 x i32> %merge, <vscale x 8 x i16> %a, <vscale x 8 x i32> %b, <vscale x 8 x i1> %mask, i64 %evl)
    ret <vscale x 8 x i32> %1
}

define <vscale x 16 x i32> @test_llvm.epi.vwredsum.mask_nxv16i32(<vscale x 16 x i32> %merge, <vscale x 16 x i16> %a, <vscale x 16 x i32> %b, <vscale x 16 x i1> %mask, i64 %evl) {
; CHECK-LABEL: test_llvm.epi.vwredsum.mask_nxv16i32:
; CHECK:       # %bb.0:
; CHECK-NEXT:    vsetvli zero, zero, e32,m8
; CHECK-NEXT:    vle.v v8, (a1)
; CHECK-NEXT:    vsetvli zero, zero, e16,m4
; CHECK-NEXT:    vle.v v4, (a0)
; CHECK-NEXT:    vsetvli zero, a2, e16,m4
; CHECK-NEXT:    vwredsum.vs v16, v4, v8, v0.t
; CHECK-NEXT:    ret
    %1 = call <vscale x 16 x i32> @llvm.epi.vwredsum.mask.nxv16i32(<vscale x 16 x i32> %merge, <vscale x 16 x i16> %a, <vscale x 16 x i32> %b, <vscale x 16 x i1> %mask, i64 %evl)
    ret <vscale x 16 x i32> %1
}

define <vscale x 2 x i64> @test_llvm.epi.vwredsum.mask_nxv2i64(<vscale x 2 x i64> %merge, <vscale x 2 x i32> %a, <vscale x 2 x i64> %b, <vscale x 2 x i1> %mask, i64 %evl) {
; CHECK-LABEL: test_llvm.epi.vwredsum.mask_nxv2i64:
; CHECK:       # %bb.0:
; CHECK-NEXT:    vsetvli zero, a0, e32,m1
; CHECK-NEXT:    vwredsum.vs v16, v18, v20, v0.t
; CHECK-NEXT:    ret
    %1 = call <vscale x 2 x i64> @llvm.epi.vwredsum.mask.nxv2i64(<vscale x 2 x i64> %merge, <vscale x 2 x i32> %a, <vscale x 2 x i64> %b, <vscale x 2 x i1> %mask, i64 %evl)
    ret <vscale x 2 x i64> %1
}

define <vscale x 4 x i64> @test_llvm.epi.vwredsum.mask_nxv4i64(<vscale x 4 x i64> %merge, <vscale x 4 x i32> %a, <vscale x 4 x i64> %b, <vscale x 4 x i1> %mask, i64 %evl) {
; CHECK-LABEL: test_llvm.epi.vwredsum.mask_nxv4i64:
; CHECK:       # %bb.0:
; CHECK-NEXT:    vsetvli zero, zero, e64,m4
; CHECK-NEXT:    vle.v v4, (a0)
; CHECK-NEXT:    vsetvli zero, a1, e32,m2
; CHECK-NEXT:    vwredsum.vs v16, v20, v4, v0.t
; CHECK-NEXT:    ret
    %1 = call <vscale x 4 x i64> @llvm.epi.vwredsum.mask.nxv4i64(<vscale x 4 x i64> %merge, <vscale x 4 x i32> %a, <vscale x 4 x i64> %b, <vscale x 4 x i1> %mask, i64 %evl)
    ret <vscale x 4 x i64> %1
}

define <vscale x 8 x i64> @test_llvm.epi.vwredsum.mask_nxv8i64(<vscale x 8 x i64> %merge, <vscale x 8 x i32> %a, <vscale x 8 x i64> %b, <vscale x 8 x i1> %mask, i64 %evl) {
; CHECK-LABEL: test_llvm.epi.vwredsum.mask_nxv8i64:
; CHECK:       # %bb.0:
; CHECK-NEXT:    vsetvli zero, zero, e64,m8
; CHECK-NEXT:    vle.v v8, (a1)
; CHECK-NEXT:    vsetvli zero, zero, e32,m4
; CHECK-NEXT:    vle.v v4, (a0)
; CHECK-NEXT:    vsetvli zero, a2, e32,m4
; CHECK-NEXT:    vwredsum.vs v16, v4, v8, v0.t
; CHECK-NEXT:    ret
    %1 = call <vscale x 8 x i64> @llvm.epi.vwredsum.mask.nxv8i64(<vscale x 8 x i64> %merge, <vscale x 8 x i32> %a, <vscale x 8 x i64> %b, <vscale x 8 x i1> %mask, i64 %evl)
    ret <vscale x 8 x i64> %1
}
