; NOTE: Assertions have been autogenerated by utils/update_llc_test_checks.py
; RUN: llc -mtriple=riscv64 -mattr=+m,+f,+d,+a,+c,+experimental-v,+only-lmul1 \
; RUN:    -target-abi lp64d -verify-machineinstrs < %s | FileCheck %s
define void @foo(<vscale x 2 x i64>* %px, <vscale x 2 x i64>* %py,  <vscale x 2 x i64>* %pz, i32 %evl) {
; CHECK-LABEL: foo:
; CHECK:       # %bb.0:
; CHECK-NEXT:    sext.w a6, a3
; CHECK-NEXT:    vsetvli a5, zero, e64,m1
; CHECK-NEXT:    sext.w a4, a5
; CHECK-NEXT:    bltu a4, a6, .LBB0_2
; CHECK-NEXT:  # %bb.1:
; CHECK-NEXT:    add a4, zero, a6
; CHECK-NEXT:  .LBB0_2:
; CHECK-NEXT:    subw a3, a3, a4
; CHECK-NEXT:    slli a5, a5, 3
; CHECK-NEXT:    add a6, a0, a5
; CHECK-NEXT:    vsetvli zero, a3, e64,m1
; CHECK-NEXT:    vle.v v1, (a6)
; CHECK-NEXT:    vsetvli zero, a4, e64,m1
; CHECK-NEXT:    vle.v v2, (a0)
; CHECK-NEXT:    add a0, a1, a5
; CHECK-NEXT:    vsetvli zero, a3, e64,m1
; CHECK-NEXT:    vle.v v3, (a0)
; CHECK-NEXT:    vsetvli zero, a4, e64,m1
; CHECK-NEXT:    vle.v v4, (a1)
; CHECK-NEXT:    vsetvli zero, a3, e64,m1
; CHECK-NEXT:    vadd.vv v1, v1, v3
; CHECK-NEXT:    vsetvli zero, a4, e64,m1
; CHECK-NEXT:    vadd.vv v2, v2, v4
; CHECK-NEXT:    vse.v v2, (a2)
; CHECK-NEXT:    add a0, a2, a5
; CHECK-NEXT:    vsetvli zero, a3, e64,m1
; CHECK-NEXT:    vse.v v1, (a0)
; CHECK-NEXT:    ret
  %allones.1 = insertelement <vscale x 2 x i1> undef, i1 1, i32 0
  %allones = shufflevector <vscale x 2 x i1> %allones.1, <vscale x 2 x i1> undef, <vscale x 2 x i32> zeroinitializer

  %x = call <vscale x 2 x i64> @llvm.vp.load.nxv2i64(<vscale x 2 x i64>* %px, i32 8, <vscale x 2 x i1> %allones, i32 %evl)
  %y = call <vscale x 2 x i64> @llvm.vp.load.nxv2i64(<vscale x 2 x i64>* %py, i32 8, <vscale x 2 x i1> %allones, i32 %evl)

  %z = call <vscale x 2 x i64> @llvm.vp.add.nxv2i64(<vscale x 2 x i64> %x, <vscale x 2 x i64> %y, <vscale x 2 x i1> %allones, i32 %evl)

  call void @llvm.vp.store.nxv2i64(<vscale x 2 x i64> %z,  <vscale x 2 x i64>* %pz, i32 8, <vscale x 2 x i1> %allones, i32 %evl)
  ret void
}

declare <vscale x 2 x i64> @llvm.vp.load.nxv2i64(<vscale x 2 x i64>* %px, i32 %align, <vscale x 2 x i1> %allones, i32 %evl)
declare <vscale x 2 x i64> @llvm.vp.add.nxv2i64(<vscale x 2 x i64> %a, <vscale x 2 x i64> %b, <vscale x 2 x i1> %allones, i32 %evl)
declare void @llvm.vp.store.nxv2i64(<vscale x 2 x i64> %z, <vscale x 2 x i64>* %pz, i32 %align, <vscale x 2 x i1> %allones, i32 %evl)
