; NOTE: Assertions have been autogenerated by utils/update_llc_test_checks.py
; RUN: llc -mtriple=riscv32 -target-abi ilp32d -mattr=+f,+d < %s \
; RUN:    | FileCheck %s
; RUN: llc -mtriple=riscv64 -target-abi lp64d -mattr=+f,+d < %s \
; RUN:    | FileCheck %s

define dso_local float @fremf32(float %a, float %b) nounwind {
; CHECK-LABEL: fremf32:
; CHECK:    call fmodf
entry:
  %p = frem float %a, %b
  ret float  %p
}

define dso_local double @fremf64(double %a, double %b) nounwind {
; CHECK-LABEL: fremf64:
; CHECK:    call fmod
entry:
  %p = frem double %a, %b
  ret double  %p
}
