; NOTE: Tests autogenerated by utils/EPI/generate-intrinsic-tests.py
; RUN: llc -mtriple=riscv64 -mattr=+m,+f,+d,+a,+c,+experimental-v \
; RUN:    -verify-machineinstrs --riscv-no-aliases < %s | FileCheck %s

define void @test(i8* %spa, i8* %spb, i8* %spc) {
; CHECK: Begin function test
  %pa = bitcast i8*  %spa to float8_143*
  %pb = bitcast i8*  %spb to float8_143*
  %pc = bitcast i8*  %spc to float8_143*

; CHECK: call    __extendgfsf2
; CHECK: call    __extendgfsf2
  %a = load float8_143, float8_143* %pa
  %b = load float8_143, float8_143* %pb

  %d = fadd float8_143 %a, %b

; CHECK:   call    __truncsfgf2
  store float8_143 %d, float8_143* %pc

  ret void
}

