; NOTE: Assertions have been autogenerated by utils/update_llc_test_checks.py
; RUN: llc -mtriple=riscv64 -mattr=+m,+f,+d,+a,+c,+experimental-v,+only-lmul1 \
; RUN:    -target-abi lp64d -verify-machineinstrs < %s | FileCheck %s

; ModuleID = 'fp-widenings-narrowings-lmul1.c'
source_filename = "fp-widenings-narrowings-lmul1.c"
target datalayout = "e-m:e-p:64:64-i64:64-i128:128-n64-S128-v128:128:128-v256:128:128-v512:128:128-v1024:128:128"
target triple = "riscv64-unknown-linux-gnu"

; Function Attrs: nofree norecurse nounwind
define dso_local void @fpwiden2(i32 signext %N, float* noalias nocapture readonly %c, double* nocapture %s, float* noalias nocapture readonly %d) local_unnamed_addr #0 {
; CHECK-LABEL: fpwiden2:
; CHECK:       # %bb.0: # %entry
; CHECK-NEXT:    addi a4, zero, 1
; CHECK-NEXT:    blt a0, a4, .LBB0_3
; CHECK-NEXT:  # %bb.1: # %for.body.preheader
; CHECK-NEXT:    mv a4, zero
; CHECK-NEXT:    slli a0, a0, 32
; CHECK-NEXT:    srli a6, a0, 32
; CHECK-NEXT:  .LBB0_2: # %vector.body
; CHECK-NEXT:    # =>This Inner Loop Header: Depth=1
; CHECK-NEXT:    slli a5, a4, 2
; CHECK-NEXT:    add a7, a3, a5
; CHECK-NEXT:    sub a0, a6, a4
; CHECK-NEXT:    vsetvli t0, a0, e64,m1
; CHECK-NEXT:    vsetvli zero, t0, e32,m1
; CHECK-NEXT:    vle.v v1, (a7)
; CHECK-NEXT:    add a5, a5, a1
; CHECK-NEXT:    vle.v v2, (a5)
; CHECK-NEXT:    vfadd.vv v1, v1, v2
; CHECK-NEXT:    vfwcvt.f.f.v v2, v1
; CHECK-NEXT:    slli a5, a4, 3
; CHECK-NEXT:    add a5, a5, a2
; CHECK-NEXT:    vsetvli zero, a0, e64,m1
; CHECK-NEXT:    add a4, a4, t0
; CHECK-NEXT:    vse.v v2, (a5)
; CHECK-NEXT:    bne a4, a6, .LBB0_2
; CHECK-NEXT:  .LBB0_3: # %for.cond.cleanup
; CHECK-NEXT:    ret
entry:
  %cmp10 = icmp sgt i32 %N, 0
  br i1 %cmp10, label %for.body.preheader, label %for.cond.cleanup

for.body.preheader:                               ; preds = %entry
  %wide.trip.count = zext i32 %N to i64
  br label %vector.body

vector.body:                                      ; preds = %vector.body, %for.body.preheader
  %index = phi i64 [ 0, %for.body.preheader ], [ %index.next, %vector.body ]
  %0 = getelementptr inbounds float, float* %d, i64 %index
  %1 = sub i64 %wide.trip.count, %index
  %2 = call i64 @llvm.epi.vsetvl(i64 %1, i64 3, i64 0)
  %3 = bitcast float* %0 to <vscale x 1 x float>*
  %4 = trunc i64 %2 to i32
  %vp.op.load = call <vscale x 1 x float> @llvm.vp.load.nxv1f32.p0nxv1f32(<vscale x 1 x float>* %3, i32 4, <vscale x 1 x i1> shufflevector (<vscale x 1 x i1> insertelement (<vscale x 1 x i1> undef, i1 true, i32 0), <vscale x 1 x i1> undef, <vscale x 1 x i32> zeroinitializer), i32 %4), !tbaa !4
  %5 = getelementptr inbounds float, float* %c, i64 %index
  %6 = bitcast float* %5 to <vscale x 1 x float>*
  %7 = trunc i64 %2 to i32
  %vp.op.load16 = call <vscale x 1 x float> @llvm.vp.load.nxv1f32.p0nxv1f32(<vscale x 1 x float>* %6, i32 4, <vscale x 1 x i1> shufflevector (<vscale x 1 x i1> insertelement (<vscale x 1 x i1> undef, i1 true, i32 0), <vscale x 1 x i1> undef, <vscale x 1 x i32> zeroinitializer), i32 %7), !tbaa !4
  %8 = trunc i64 %2 to i32
  %vp.op = call <vscale x 1 x float> @llvm.vp.fadd.nxv1f32(<vscale x 1 x float> %vp.op.load, <vscale x 1 x float> %vp.op.load16, metadata !"round.tonearest", metadata !"fpexcept.ignore", <vscale x 1 x i1> shufflevector (<vscale x 1 x i1> insertelement (<vscale x 1 x i1> undef, i1 true, i32 0), <vscale x 1 x i1> undef, <vscale x 1 x i32> zeroinitializer), i32 %8)
  %9 = trunc i64 %2 to i32
  %vp.cast = call <vscale x 1 x double> @llvm.vp.fpext.nxv1f64.nxv1f32(<vscale x 1 x float> %vp.op, metadata !"fpexcept.ignore", <vscale x 1 x i1> shufflevector (<vscale x 1 x i1> insertelement (<vscale x 1 x i1> undef, i1 true, i32 0), <vscale x 1 x i1> undef, <vscale x 1 x i32> zeroinitializer), i32 %9)
  %10 = getelementptr inbounds double, double* %s, i64 %index
  %11 = bitcast double* %10 to <vscale x 1 x double>*
  %12 = trunc i64 %2 to i32
  call void @llvm.vp.store.nxv1f64.p0nxv1f64(<vscale x 1 x double> %vp.cast, <vscale x 1 x double>* %11, i32 8, <vscale x 1 x i1> shufflevector (<vscale x 1 x i1> insertelement (<vscale x 1 x i1> undef, i1 true, i32 0), <vscale x 1 x i1> undef, <vscale x 1 x i32> zeroinitializer), i32 %12), !tbaa !8
  %index.next = add i64 %index, %2
  %13 = icmp eq i64 %index.next, %wide.trip.count
  br i1 %13, label %for.cond.cleanup, label %vector.body, !llvm.loop !10

for.cond.cleanup:                                 ; preds = %vector.body, %entry
  ret void
}

; Function Attrs: nofree norecurse nounwind
define dso_local void @fpnarrow2(i32 signext %N, double* noalias nocapture readonly %c, float* nocapture %s, double* noalias nocapture readonly %d) local_unnamed_addr #0 {
; CHECK-LABEL: fpnarrow2:
; CHECK:       # %bb.0: # %entry
; CHECK-NEXT:    addi a4, zero, 1
; CHECK-NEXT:    blt a0, a4, .LBB1_3
; CHECK-NEXT:  # %bb.1: # %for.body.preheader
; CHECK-NEXT:    mv a4, zero
; CHECK-NEXT:    slli a0, a0, 32
; CHECK-NEXT:    srli a6, a0, 32
; CHECK-NEXT:  .LBB1_2: # %vector.body
; CHECK-NEXT:    # =>This Inner Loop Header: Depth=1
; CHECK-NEXT:    slli a5, a4, 3
; CHECK-NEXT:    add a7, a3, a5
; CHECK-NEXT:    sub a0, a6, a4
; CHECK-NEXT:    vsetvli a0, a0, e64,m1
; CHECK-NEXT:    vle.v v1, (a7)
; CHECK-NEXT:    add a5, a5, a1
; CHECK-NEXT:    vle.v v2, (a5)
; CHECK-NEXT:    vfadd.vv v2, v1, v2
; CHECK-NEXT:    vsetvli zero, a0, e32,m1
; CHECK-NEXT:    vfncvt.f.f.v v1, v2
; CHECK-NEXT:    slli a5, a4, 2
; CHECK-NEXT:    add a5, a5, a2
; CHECK-NEXT:    add a4, a4, a0
; CHECK-NEXT:    vse.v v1, (a5)
; CHECK-NEXT:    bne a4, a6, .LBB1_2
; CHECK-NEXT:  .LBB1_3: # %for.cond.cleanup
; CHECK-NEXT:    ret
entry:
  %cmp10 = icmp sgt i32 %N, 0
  br i1 %cmp10, label %for.body.preheader, label %for.cond.cleanup

for.body.preheader:                               ; preds = %entry
  %wide.trip.count = zext i32 %N to i64
  br label %vector.body

vector.body:                                      ; preds = %vector.body, %for.body.preheader
  %index = phi i64 [ 0, %for.body.preheader ], [ %index.next, %vector.body ]
  %0 = getelementptr inbounds double, double* %d, i64 %index
  %1 = sub i64 %wide.trip.count, %index
  %2 = call i64 @llvm.epi.vsetvl(i64 %1, i64 3, i64 0)
  %3 = bitcast double* %0 to <vscale x 1 x double>*
  %4 = trunc i64 %2 to i32
  %vp.op.load = call <vscale x 1 x double> @llvm.vp.load.nxv1f64.p0nxv1f64(<vscale x 1 x double>* %3, i32 8, <vscale x 1 x i1> shufflevector (<vscale x 1 x i1> insertelement (<vscale x 1 x i1> undef, i1 true, i32 0), <vscale x 1 x i1> undef, <vscale x 1 x i32> zeroinitializer), i32 %4), !tbaa !8
  %5 = getelementptr inbounds double, double* %c, i64 %index
  %6 = bitcast double* %5 to <vscale x 1 x double>*
  %7 = trunc i64 %2 to i32
  %vp.op.load16 = call <vscale x 1 x double> @llvm.vp.load.nxv1f64.p0nxv1f64(<vscale x 1 x double>* %6, i32 8, <vscale x 1 x i1> shufflevector (<vscale x 1 x i1> insertelement (<vscale x 1 x i1> undef, i1 true, i32 0), <vscale x 1 x i1> undef, <vscale x 1 x i32> zeroinitializer), i32 %7), !tbaa !8
  %8 = trunc i64 %2 to i32
  %vp.op = call <vscale x 1 x double> @llvm.vp.fadd.nxv1f64(<vscale x 1 x double> %vp.op.load, <vscale x 1 x double> %vp.op.load16, metadata !"round.tonearest", metadata !"fpexcept.ignore", <vscale x 1 x i1> shufflevector (<vscale x 1 x i1> insertelement (<vscale x 1 x i1> undef, i1 true, i32 0), <vscale x 1 x i1> undef, <vscale x 1 x i32> zeroinitializer), i32 %8)
  %9 = trunc i64 %2 to i32
  %vp.cast = call <vscale x 1 x float> @llvm.vp.fptrunc.nxv1f32.nxv1f64(<vscale x 1 x double> %vp.op, metadata !"round.tonearest", metadata !"fpexcept.ignore", <vscale x 1 x i1> shufflevector (<vscale x 1 x i1> insertelement (<vscale x 1 x i1> undef, i1 true, i32 0), <vscale x 1 x i1> undef, <vscale x 1 x i32> zeroinitializer), i32 %9)
  %10 = getelementptr inbounds float, float* %s, i64 %index
  %11 = bitcast float* %10 to <vscale x 1 x float>*
  %12 = trunc i64 %2 to i32
  call void @llvm.vp.store.nxv1f32.p0nxv1f32(<vscale x 1 x float> %vp.cast, <vscale x 1 x float>* %11, i32 4, <vscale x 1 x i1> shufflevector (<vscale x 1 x i1> insertelement (<vscale x 1 x i1> undef, i1 true, i32 0), <vscale x 1 x i1> undef, <vscale x 1 x i32> zeroinitializer), i32 %12), !tbaa !4
  %index.next = add i64 %index, %2
  %13 = icmp eq i64 %index.next, %wide.trip.count
  br i1 %13, label %for.cond.cleanup, label %vector.body, !llvm.loop !13

for.cond.cleanup:                                 ; preds = %vector.body, %entry
  ret void
}

; Function Attrs: nounwind readnone
declare i64 @llvm.epi.vsetvl(i64, i64, i64) #1

; Function Attrs: argmemonly nosync nounwind readonly willreturn
declare <vscale x 1 x float> @llvm.vp.load.nxv1f32.p0nxv1f32(<vscale x 1 x float>* nocapture, i32 immarg, <vscale x 1 x i1>, i32) #2

; Function Attrs: nounwind readnone willreturn
declare <vscale x 1 x float> @llvm.vp.fadd.nxv1f32(<vscale x 1 x float>, <vscale x 1 x float>, metadata, metadata, <vscale x 1 x i1>, i32) #3

; Function Attrs: nounwind readnone willreturn
declare <vscale x 1 x double> @llvm.vp.fpext.nxv1f64.nxv1f32(<vscale x 1 x float>, metadata, <vscale x 1 x i1>, i32) #3

; Function Attrs: argmemonly nosync nounwind willreturn writeonly
declare void @llvm.vp.store.nxv1f64.p0nxv1f64(<vscale x 1 x double>, <vscale x 1 x double>* nocapture, i32 immarg, <vscale x 1 x i1>, i32) #4

; Function Attrs: argmemonly nosync nounwind readonly willreturn
declare <vscale x 1 x double> @llvm.vp.load.nxv1f64.p0nxv1f64(<vscale x 1 x double>* nocapture, i32 immarg, <vscale x 1 x i1>, i32) #2

; Function Attrs: nounwind readnone willreturn
declare <vscale x 1 x double> @llvm.vp.fadd.nxv1f64(<vscale x 1 x double>, <vscale x 1 x double>, metadata, metadata, <vscale x 1 x i1>, i32) #3

; Function Attrs: nounwind readnone willreturn
declare <vscale x 1 x float> @llvm.vp.fptrunc.nxv1f32.nxv1f64(<vscale x 1 x double>, metadata, metadata, <vscale x 1 x i1>, i32) #3

; Function Attrs: argmemonly nosync nounwind willreturn writeonly
declare void @llvm.vp.store.nxv1f32.p0nxv1f32(<vscale x 1 x float>, <vscale x 1 x float>* nocapture, i32 immarg, <vscale x 1 x i1>, i32) #4

attributes #0 = { nofree norecurse nounwind "disable-tail-calls"="false" "frame-pointer"="none" "less-precise-fpmad"="false" "min-legal-vector-width"="0" "no-infs-fp-math"="false" "no-jump-tables"="false" "no-nans-fp-math"="false" "no-signed-zeros-fp-math"="false" "no-trapping-math"="true" "stack-protector-buffer-size"="8" "target-features"="+a,+c,+d,+experimental-v,+experimental-zvlsseg,+f,+m,+only-lmul1,-relax,-save-restore" "unsafe-fp-math"="false" "use-soft-float"="false" }
attributes #1 = { nounwind readnone }
attributes #2 = { argmemonly nosync nounwind readonly willreturn }
attributes #3 = { nounwind readnone willreturn }
attributes #4 = { argmemonly nosync nounwind willreturn writeonly }

!llvm.module.flags = !{!0, !1, !2}
!llvm.ident = !{!3}

!0 = !{i32 1, !"wchar_size", i32 4}
!1 = !{i32 1, !"target-abi", !"lp64d"}
!2 = !{i32 1, !"SmallDataLimit", i32 8}
!3 = !{!"clang version 12.0.0"}
!4 = !{!5, !5, i64 0}
!5 = !{!"float", !6, i64 0}
!6 = !{!"omnipotent char", !7, i64 0}
!7 = !{!"Simple C/C++ TBAA"}
!8 = !{!9, !9, i64 0}
!9 = !{!"double", !6, i64 0}
!10 = distinct !{!10, !11, !12}
!11 = !{!"llvm.loop.mustprogress"}
!12 = !{!"llvm.loop.isvectorized", i32 1}
!13 = distinct !{!13, !11, !12}
