; NOTE: Assertions have been autogenerated by utils/update_test_checks.py
; RUN: opt -passes=instcombine -expand-vector-gep-to-vp=false %s -S | FileCheck %s

; ModuleID = '/home/lalbano/tmp/base_offset.c'
source_filename = "/home/lalbano/tmp/base_offset.c"
target datalayout = "e-m:e-p:64:64-i64:64-i128:128-n64-S128-v128:128:128-v256:128:128-v512:128:128-v1024:128:128"
target triple = "riscv64-unknown-linux-gnu"

; Function Attrs: nofree norecurse nounwind
define dso_local void @autovec_vsxe(i32 signext %N, double* nocapture %OUT, i64* nocapture readonly %offsets) local_unnamed_addr #0 {
; CHECK-LABEL: @autovec_vsxe(
; CHECK-NEXT:  entry:
; CHECK-NEXT:    [[CMP9:%.*]] = icmp sgt i32 [[N:%.*]], 0
; CHECK-NEXT:    br i1 [[CMP9]], label [[FOR_BODY_PREHEADER:%.*]], label [[FOR_COND_CLEANUP:%.*]]
; CHECK:       for.body.preheader:
; CHECK-NEXT:    [[WIDE_TRIP_COUNT:%.*]] = zext i32 [[N]] to i64
; CHECK-NEXT:    br i1 false, label [[SCALAR_PH:%.*]], label [[VECTOR_PH:%.*]]
; CHECK:       vector.ph:
; CHECK-NEXT:    br label [[VECTOR_BODY:%.*]]
; CHECK:       vector.body:
; CHECK-NEXT:    [[INDEX:%.*]] = phi i64 [ 0, [[VECTOR_PH]] ], [ [[INDEX_NEXT:%.*]], [[VECTOR_BODY]] ]
; CHECK-NEXT:    [[TMP0:%.*]] = getelementptr inbounds i64, i64* [[OFFSETS:%.*]], i64 [[INDEX]]
; CHECK-NEXT:    [[TMP1:%.*]] = sub i64 [[WIDE_TRIP_COUNT]], [[INDEX]]
; CHECK-NEXT:    [[TMP2:%.*]] = call i64 @llvm.epi.vsetvl(i64 [[TMP1]], i64 3, i64 0)
; CHECK-NEXT:    [[TMP3:%.*]] = trunc i64 [[TMP2]] to i32
; CHECK-NEXT:    [[TMP4:%.*]] = bitcast i64* [[TMP0]] to <vscale x 1 x i64>*
; CHECK-NEXT:    [[VP_OP_LOAD:%.*]] = call <vscale x 1 x i64> @llvm.vp.load.nxv1i64.p0nxv1i64(<vscale x 1 x i64>* [[TMP4]], i32 8, <vscale x 1 x i1> shufflevector (<vscale x 1 x i1> insertelement (<vscale x 1 x i1> undef, i1 true, i32 0), <vscale x 1 x i1> undef, <vscale x 1 x i32> zeroinitializer), i32 [[TMP3]]), [[TBAA4:!tbaa !.*]], !llvm.access.group !8
; CHECK-NEXT:    [[TMP5:%.*]] = getelementptr inbounds double, double* [[OUT:%.*]], <vscale x 1 x i64> [[VP_OP_LOAD]]
; CHECK-NEXT:    call void @llvm.vp.scatter.nxv1f64.nxv1p0f64(<vscale x 1 x double> shufflevector (<vscale x 1 x double> insertelement (<vscale x 1 x double> undef, double 1.000000e+00, i32 0), <vscale x 1 x double> undef, <vscale x 1 x i32> zeroinitializer), <vscale x 1 x double*> [[TMP5]], i32 8, <vscale x 1 x i1> shufflevector (<vscale x 1 x i1> insertelement (<vscale x 1 x i1> undef, i1 true, i32 0), <vscale x 1 x i1> undef, <vscale x 1 x i32> zeroinitializer), i32 [[TMP3]]), [[TBAA9:!tbaa !.*]], !llvm.access.group !8
; CHECK-NEXT:    [[BASE_PTR:%.*]] = getelementptr inbounds double, double* [[OUT]], i64 1
; CHECK-NEXT:    [[GEP_OPT:%.*]] = getelementptr inbounds double, double* [[BASE_PTR]], <vscale x 1 x i64> [[VP_OP_LOAD]]
; CHECK-NEXT:    call void @llvm.vp.scatter.nxv1f64.nxv1p0f64(<vscale x 1 x double> shufflevector (<vscale x 1 x double> insertelement (<vscale x 1 x double> undef, double 2.000000e+00, i32 0), <vscale x 1 x double> undef, <vscale x 1 x i32> zeroinitializer), <vscale x 1 x double*> [[GEP_OPT]], i32 8, <vscale x 1 x i1> shufflevector (<vscale x 1 x i1> insertelement (<vscale x 1 x i1> undef, i1 true, i32 0), <vscale x 1 x i1> undef, <vscale x 1 x i32> zeroinitializer), i32 [[TMP3]]), [[TBAA9]], !llvm.access.group !8
; CHECK-NEXT:    [[TMP6:%.*]] = and i64 [[TMP2]], 4294967295
; CHECK-NEXT:    [[INDEX_NEXT]] = add i64 [[INDEX]], [[TMP6]]
; CHECK-NEXT:    [[TMP7:%.*]] = icmp eq i64 [[INDEX_NEXT]], [[WIDE_TRIP_COUNT]]
; CHECK-NEXT:    br i1 [[TMP7]], label [[MIDDLE_BLOCK:%.*]], label [[VECTOR_BODY]], [[LOOP11:!llvm.loop !.*]]
; CHECK:       middle.block:
; CHECK-NEXT:    br i1 true, label [[FOR_COND_CLEANUP_LOOPEXIT:%.*]], label [[SCALAR_PH]]
; CHECK:       scalar.ph:
; CHECK-NEXT:    br label [[FOR_BODY:%.*]]
; CHECK:       for.cond.cleanup.loopexit.loopexit:
; CHECK-NEXT:    br label [[FOR_COND_CLEANUP_LOOPEXIT]]
; CHECK:       for.cond.cleanup.loopexit:
; CHECK-NEXT:    br label [[FOR_COND_CLEANUP]]
; CHECK:       for.cond.cleanup:
; CHECK-NEXT:    ret void
; CHECK:       for.body:
; CHECK-NEXT:    br i1 undef, label [[FOR_COND_CLEANUP_LOOPEXIT_LOOPEXIT:%.*]], label [[FOR_BODY]], [[LOOP15:!llvm.loop !.*]]
;
entry:
  %cmp9 = icmp sgt i32 %N, 0
  br i1 %cmp9, label %for.body.preheader, label %for.cond.cleanup

for.body.preheader:                               ; preds = %entry
  %wide.trip.count = zext i32 %N to i64
  br i1 false, label %scalar.ph, label %vector.ph

vector.ph:                                        ; preds = %for.body.preheader
  %trip.count.minus.1 = sub i64 %wide.trip.count, 1
  %broadcast.splatinsert = insertelement <vscale x 1 x i64> undef, i64 %trip.count.minus.1, i32 0
  %broadcast.splat = shufflevector <vscale x 1 x i64> %broadcast.splatinsert, <vscale x 1 x i64> undef, <vscale x 1 x i32> zeroinitializer
  %broadcast.splatinsert17 = insertelement <vscale x 1 x double> undef, double 1.000000e+00, i32 0
  %broadcast.splat18 = shufflevector <vscale x 1 x double> %broadcast.splatinsert17, <vscale x 1 x double> undef, <vscale x 1 x i32> zeroinitializer
  %broadcast.splatinsert21 = insertelement <vscale x 1 x i64> undef, i64 1, i32 0
  %broadcast.splat22 = shufflevector <vscale x 1 x i64> %broadcast.splatinsert21, <vscale x 1 x i64> undef, <vscale x 1 x i32> zeroinitializer
  %broadcast.splatinsert25 = insertelement <vscale x 1 x double> undef, double 2.000000e+00, i32 0
  %broadcast.splat26 = shufflevector <vscale x 1 x double> %broadcast.splatinsert25, <vscale x 1 x double> undef, <vscale x 1 x i32> zeroinitializer
  br label %vector.body

vector.body:                                      ; preds = %vector.body, %vector.ph
  %index = phi i64 [ 0, %vector.ph ], [ %index.next, %vector.body ]
  %broadcast.splatinsert11 = insertelement <vscale x 1 x i64> undef, i64 %index, i32 0
  %broadcast.splat12 = shufflevector <vscale x 1 x i64> %broadcast.splatinsert11, <vscale x 1 x i64> undef, <vscale x 1 x i32> zeroinitializer
  %0 = call <vscale x 1 x i64> @llvm.experimental.vector.stepvector.nxv1i64()
  %.splatinsert = insertelement <vscale x 1 x i64> undef, i64 0, i32 0
  %.splat = shufflevector <vscale x 1 x i64> %.splatinsert, <vscale x 1 x i64> undef, <vscale x 1 x i32> zeroinitializer
  %1 = add <vscale x 1 x i64> %0, %.splat
  %.splatinsert13 = insertelement <vscale x 1 x i64> undef, i64 1, i32 0
  %.splat14 = shufflevector <vscale x 1 x i64> %.splatinsert13, <vscale x 1 x i64> undef, <vscale x 1 x i32> zeroinitializer
  %2 = mul <vscale x 1 x i64> %1, %.splat14
  %induction = add <vscale x 1 x i64> %broadcast.splat12, %2
  %3 = add i64 %index, 0
  %4 = icmp ule <vscale x 1 x i64> %induction, %broadcast.splat
  %5 = getelementptr inbounds i64, i64* %offsets, i64 %3
  %6 = sub i64 %wide.trip.count, %index
  %7 = call i64 @llvm.epi.vsetvl(i64 %6, i64 3, i64 0)
  %8 = trunc i64 %7 to i32
  %9 = getelementptr inbounds i64, i64* %5, i32 0
  %10 = bitcast i64* %9 to <vscale x 1 x i64>*
  %.splatinsert15 = insertelement <vscale x 1 x i1> undef, i1 true, i32 0
  %.splat16 = shufflevector <vscale x 1 x i1> %.splatinsert15, <vscale x 1 x i1> undef, <vscale x 1 x i32> zeroinitializer
  %vp.op.load = call <vscale x 1 x i64> @llvm.vp.load.nxv1i64.p0nxv1i64(<vscale x 1 x i64>* %10, i32 8, <vscale x 1 x i1> %.splat16, i32 %8), !tbaa !4, !llvm.access.group !8
  %11 = getelementptr inbounds double, double* %OUT, <vscale x 1 x i64> %vp.op.load
  call void @llvm.vp.scatter.nxv1f64.nxv1p0f64(<vscale x 1 x double> %broadcast.splat18, <vscale x 1 x double*> %11, i32 8, <vscale x 1 x i1> %.splat16, i32 %8), !tbaa !9, !llvm.access.group !8
  %vp.op = call <vscale x 1 x i64> @llvm.vp.add.nxv1i64(<vscale x 1 x i64> %vp.op.load, <vscale x 1 x i64> %broadcast.splat22, <vscale x 1 x i1> %.splat16, i32 %8)
  %12 = getelementptr inbounds double, double* %OUT, <vscale x 1 x i64> %vp.op
  call void @llvm.vp.scatter.nxv1f64.nxv1p0f64(<vscale x 1 x double> %broadcast.splat26, <vscale x 1 x double*> %12, i32 8, <vscale x 1 x i1> %.splat16, i32 %8), !tbaa !9, !llvm.access.group !8
  %13 = zext i32 %8 to i64
  %index.next = add i64 %index, %13
  %14 = icmp eq i64 %index.next, %wide.trip.count
  br i1 %14, label %middle.block, label %vector.body, !llvm.loop !11

middle.block:                                     ; preds = %vector.body
  br i1 true, label %for.cond.cleanup.loopexit, label %scalar.ph

scalar.ph:                                        ; preds = %middle.block, %for.body.preheader
  %bc.resume.val = phi i64 [ %wide.trip.count, %middle.block ], [ 0, %for.body.preheader ]
  br label %for.body

for.cond.cleanup.loopexit.loopexit:               ; preds = %for.body
  br label %for.cond.cleanup.loopexit

for.cond.cleanup.loopexit:                        ; preds = %for.cond.cleanup.loopexit.loopexit, %middle.block
  br label %for.cond.cleanup

for.cond.cleanup:                                 ; preds = %for.cond.cleanup.loopexit, %entry
  ret void

for.body:                                         ; preds = %scalar.ph, %for.body
  %indvars.iv = phi i64 [ %bc.resume.val, %scalar.ph ], [ %indvars.iv.next, %for.body ]
  %arrayidx = getelementptr inbounds i64, i64* %offsets, i64 %indvars.iv
  %15 = load i64, i64* %arrayidx, align 8, !tbaa !4, !llvm.access.group !8
  %arrayidx1 = getelementptr inbounds double, double* %OUT, i64 %15
  store double 1.000000e+00, double* %arrayidx1, align 8, !tbaa !9, !llvm.access.group !8
  %add = add i64 %15, 1
  %arrayidx2 = getelementptr inbounds double, double* %OUT, i64 %add
  store double 2.000000e+00, double* %arrayidx2, align 8, !tbaa !9, !llvm.access.group !8
  %indvars.iv.next = add nuw nsw i64 %indvars.iv, 1
  %exitcond.not = icmp eq i64 %indvars.iv.next, %wide.trip.count
  br i1 %exitcond.not, label %for.cond.cleanup.loopexit.loopexit, label %for.body, !llvm.loop !15
}

; Function Attrs: nounwind readnone
declare <vscale x 1 x i64> @llvm.experimental.vector.stepvector.nxv1i64() #1

; Function Attrs: nounwind readnone
declare i64 @llvm.epi.vsetvl(i64, i64, i64) #1

; Function Attrs: argmemonly nosync nounwind readonly willreturn
declare <vscale x 1 x i64> @llvm.vp.load.nxv1i64.p0nxv1i64(<vscale x 1 x i64>* nocapture, i32 immarg, <vscale x 1 x i1>, i32) #2

; Function Attrs: argmemonly nosync nounwind willreturn writeonly
declare void @llvm.vp.scatter.nxv1f64.nxv1p0f64(<vscale x 1 x double>, <vscale x 1 x double*>, i32 immarg, <vscale x 1 x i1>, i32) #3

; Function Attrs: nofree nosync nounwind readnone speculatable willreturn
declare <vscale x 1 x i64> @llvm.vp.add.nxv1i64(<vscale x 1 x i64>, <vscale x 1 x i64>, <vscale x 1 x i1>, i32) #4

attributes #0 = { nofree norecurse nounwind "disable-tail-calls"="false" "frame-pointer"="none" "less-precise-fpmad"="false" "min-legal-vector-width"="0" "no-infs-fp-math"="false" "no-jump-tables"="false" "no-nans-fp-math"="false" "no-signed-zeros-fp-math"="false" "no-trapping-math"="true" "stack-protector-buffer-size"="8" "target-features"="+a,+c,+d,+experimental-v,+experimental-zvlsseg,+f,+m,-relax,-save-restore" "unsafe-fp-math"="false" "use-soft-float"="false" }
attributes #1 = { nounwind readnone }
attributes #2 = { argmemonly nosync nounwind readonly willreturn }
attributes #3 = { argmemonly nosync nounwind willreturn writeonly }
attributes #4 = { nofree nosync nounwind readnone speculatable willreturn }

!llvm.module.flags = !{!0, !1, !2}
!llvm.ident = !{!3}

!0 = !{i32 1, !"wchar_size", i32 4}
!1 = !{i32 1, !"target-abi", !"lp64d"}
!2 = !{i32 1, !"SmallDataLimit", i32 8}
!3 = !{!"clang version 12.0.0"}
!4 = !{!5, !5, i64 0}
!5 = !{!"long", !6, i64 0}
!6 = !{!"omnipotent char", !7, i64 0}
!7 = !{!"Simple C/C++ TBAA"}
!8 = distinct !{}
!9 = !{!10, !10, i64 0}
!10 = !{!"double", !6, i64 0}
!11 = distinct !{!11, !12, !13, !14}
!12 = !{!"llvm.loop.mustprogress"}
!13 = !{!"llvm.loop.parallel_accesses", !8}
!14 = !{!"llvm.loop.isvectorized", i32 1}
!15 = distinct !{!15, !12, !13, !16, !14}
!16 = !{!"llvm.loop.unroll.runtime.disable"}
