; NOTE: Assertions have been autogenerated by utils/update_test_checks.py
; RUN: opt -mtriple riscv64 -mattr +m,+a,+f,+d,+experimental-v \
; RUN:    -prefer-predicate-over-epilogue=predicate-dont-vectorize -S -loop-vectorize -vector-register-width-factor=8 < %s -o - \
; RUN:    | FileCheck %s
; RUN: opt -mtriple riscv64 -mattr +m,+a,+f,+d,+experimental-v \
; RUN:    -prefer-predicate-over-epilogue=predicate-dont-vectorize -S -loop-vectorize < %s -o - \
; RUN:    | FileCheck %s --check-prefix=CHECK1
; ModuleID = './simple-add-control-flow.c'
source_filename = "./simple-add-control-flow.c"
target datalayout = "e-m:e-p:64:64-i64:64-i128:128-n64-S128-v128:128:128-v256:128:128-v512:128:128-v1024:128:128"
target triple = "riscv64-unknown-linux-gnu"

; Function Attrs: nofree norecurse nounwind
define dso_local void @vec_add(i32 signext %N, double* noalias nocapture %c, double* noalias nocapture readonly %a, double* noalias nocapture readonly %b, double* noalias nocapture %d) local_unnamed_addr {
; CHECK-LABEL: @vec_add(
; CHECK-NEXT:  entry:
; CHECK-NEXT:    [[CMP22:%.*]] = icmp sgt i32 [[N:%.*]], 0
; CHECK-NEXT:    br i1 [[CMP22]], label [[FOR_BODY_PREHEADER:%.*]], label [[FOR_COND_CLEANUP:%.*]]
; CHECK:       for.body.preheader:
; CHECK-NEXT:    [[WIDE_TRIP_COUNT:%.*]] = zext i32 [[N]] to i64
; CHECK-NEXT:    br i1 false, label [[SCALAR_PH:%.*]], label [[VECTOR_PH:%.*]]
; CHECK:       vector.ph:
; CHECK-NEXT:    [[TRIP_COUNT_MINUS_1:%.*]] = sub i64 [[WIDE_TRIP_COUNT]], 1
; CHECK-NEXT:    [[BROADCAST_SPLATINSERT:%.*]] = insertelement <vscale x 8 x i64> undef, i64 [[TRIP_COUNT_MINUS_1]], i32 0
; CHECK-NEXT:    [[BROADCAST_SPLAT:%.*]] = shufflevector <vscale x 8 x i64> [[BROADCAST_SPLATINSERT]], <vscale x 8 x i64> undef, <vscale x 8 x i32> zeroinitializer
; CHECK-NEXT:    [[BROADCAST_SPLATINSERT7:%.*]] = insertelement <vscale x 8 x double> undef, double 3.000000e+00, i32 0
; CHECK-NEXT:    [[BROADCAST_SPLAT8:%.*]] = shufflevector <vscale x 8 x double> [[BROADCAST_SPLATINSERT7]], <vscale x 8 x double> undef, <vscale x 8 x i32> zeroinitializer
; CHECK-NEXT:    br label [[VECTOR_BODY:%.*]]
; CHECK:       vector.body:
; CHECK-NEXT:    [[INDEX:%.*]] = phi i64 [ 0, [[VECTOR_PH]] ], [ [[INDEX_NEXT:%.*]], [[VECTOR_BODY]] ]
; CHECK-NEXT:    [[BROADCAST_SPLATINSERT1:%.*]] = insertelement <vscale x 8 x i64> undef, i64 [[INDEX]], i32 0
; CHECK-NEXT:    [[BROADCAST_SPLAT2:%.*]] = shufflevector <vscale x 8 x i64> [[BROADCAST_SPLATINSERT1]], <vscale x 8 x i64> undef, <vscale x 8 x i32> zeroinitializer
; CHECK-NEXT:    [[TMP0:%.*]] = call <vscale x 8 x i64> @llvm.experimental.vector.stepvector.nxv8i64()
; CHECK-NEXT:    [[DOTSPLATINSERT:%.*]] = insertelement <vscale x 8 x i64> undef, i64 0, i32 0
; CHECK-NEXT:    [[DOTSPLAT:%.*]] = shufflevector <vscale x 8 x i64> [[DOTSPLATINSERT]], <vscale x 8 x i64> undef, <vscale x 8 x i32> zeroinitializer
; CHECK-NEXT:    [[TMP1:%.*]] = add <vscale x 8 x i64> [[TMP0]], [[DOTSPLAT]]
; CHECK-NEXT:    [[DOTSPLATINSERT3:%.*]] = insertelement <vscale x 8 x i64> undef, i64 1, i32 0
; CHECK-NEXT:    [[DOTSPLAT4:%.*]] = shufflevector <vscale x 8 x i64> [[DOTSPLATINSERT3]], <vscale x 8 x i64> undef, <vscale x 8 x i32> zeroinitializer
; CHECK-NEXT:    [[TMP2:%.*]] = mul <vscale x 8 x i64> [[TMP1]], [[DOTSPLAT4]]
; CHECK-NEXT:    [[INDUCTION:%.*]] = add <vscale x 8 x i64> [[BROADCAST_SPLAT2]], [[TMP2]]
; CHECK-NEXT:    [[TMP3:%.*]] = add i64 [[INDEX]], 0
; CHECK-NEXT:    [[TMP4:%.*]] = icmp ule <vscale x 8 x i64> [[INDUCTION]], [[BROADCAST_SPLAT]]
; CHECK-NEXT:    [[TMP5:%.*]] = getelementptr inbounds double, double* [[C:%.*]], i64 [[TMP3]]
; CHECK-NEXT:    [[TMP6:%.*]] = sub i64 [[WIDE_TRIP_COUNT]], [[INDEX]]
; CHECK-NEXT:    [[TMP7:%.*]] = call i64 @llvm.epi.vsetvl(i64 [[TMP6]], i64 3, i64 3)
; CHECK-NEXT:    [[TMP8:%.*]] = trunc i64 [[TMP7]] to i32
; CHECK-NEXT:    [[TMP9:%.*]] = getelementptr inbounds double, double* [[TMP5]], i32 0
; CHECK-NEXT:    [[TMP10:%.*]] = bitcast double* [[TMP9]] to <vscale x 8 x double>*
; CHECK-NEXT:    [[DOTSPLATINSERT5:%.*]] = insertelement <vscale x 8 x i1> undef, i1 true, i32 0
; CHECK-NEXT:    [[DOTSPLAT6:%.*]] = shufflevector <vscale x 8 x i1> [[DOTSPLATINSERT5]], <vscale x 8 x i1> undef, <vscale x 8 x i32> zeroinitializer
; CHECK-NEXT:    [[VP_OP_LOAD:%.*]] = call <vscale x 8 x double> @llvm.vp.load.nxv8f64.p0nxv8f64(<vscale x 8 x double>* [[TMP10]], i32 8, <vscale x 8 x i1> [[DOTSPLAT6]], i32 [[TMP8]])
; CHECK-NEXT:    [[VP_OP_FCMP:%.*]] = call <vscale x 8 x i1> @llvm.vp.fcmp.nxv8f64(<vscale x 8 x double> [[VP_OP_LOAD]], <vscale x 8 x double> [[BROADCAST_SPLAT8]], i8 4, <vscale x 8 x i1> [[DOTSPLAT6]], i32 [[TMP8]])
; CHECK-NEXT:    [[TMP11:%.*]] = select <vscale x 8 x i1> [[DOTSPLAT6]], <vscale x 8 x i1> [[VP_OP_FCMP]], <vscale x 8 x i1> zeroinitializer
; CHECK-NEXT:    [[TMP12:%.*]] = getelementptr inbounds double, double* [[A:%.*]], i64 [[TMP3]]
; CHECK-NEXT:    [[TMP13:%.*]] = getelementptr inbounds double, double* [[TMP12]], i32 0
; CHECK-NEXT:    [[TMP14:%.*]] = bitcast double* [[TMP13]] to <vscale x 8 x double>*
; CHECK-NEXT:    [[VP_OP_LOAD13:%.*]] = call <vscale x 8 x double> @llvm.vp.load.nxv8f64.p0nxv8f64(<vscale x 8 x double>* [[TMP14]], i32 8, <vscale x 8 x i1> [[DOTSPLAT6]], i32 [[TMP8]])
; CHECK-NEXT:    [[TMP15:%.*]] = getelementptr inbounds double, double* [[B:%.*]], i64 [[TMP3]]
; CHECK-NEXT:    [[TMP16:%.*]] = getelementptr inbounds double, double* [[TMP15]], i32 0
; CHECK-NEXT:    [[TMP17:%.*]] = bitcast double* [[TMP16]] to <vscale x 8 x double>*
; CHECK-NEXT:    [[VP_OP_LOAD16:%.*]] = call <vscale x 8 x double> @llvm.vp.load.nxv8f64.p0nxv8f64(<vscale x 8 x double>* [[TMP17]], i32 8, <vscale x 8 x i1> [[DOTSPLAT6]], i32 [[TMP8]])
; CHECK-NEXT:    [[TMP18:%.*]] = xor <vscale x 8 x i1> [[TMP11]], [[DOTSPLAT6]]
; CHECK-NEXT:    [[TMP19:%.*]] = and <vscale x 8 x i1> [[TMP18]], [[TMP4]]
; CHECK-NEXT:    [[VP_OP:%.*]] = call <vscale x 8 x double> @llvm.vp.fmul.nxv8f64(<vscale x 8 x double> [[VP_OP_LOAD13]], <vscale x 8 x double> [[VP_OP_LOAD16]], metadata !"round.tonearest", metadata !"fpexcept.ignore", <vscale x 8 x i1> [[TMP19]], i32 [[TMP8]])
; CHECK-NEXT:    [[TMP20:%.*]] = getelementptr inbounds double, double* [[D:%.*]], i64 [[TMP3]]
; CHECK-NEXT:    [[TMP21:%.*]] = getelementptr inbounds double, double* [[TMP20]], i32 0
; CHECK-NEXT:    [[TMP22:%.*]] = bitcast double* [[TMP21]] to <vscale x 8 x double>*
; CHECK-NEXT:    call void @llvm.vp.store.nxv8f64.p0nxv8f64(<vscale x 8 x double> [[VP_OP]], <vscale x 8 x double>* [[TMP22]], i32 8, <vscale x 8 x i1> [[TMP19]], i32 [[TMP8]])
; CHECK-NEXT:    [[TMP23:%.*]] = and <vscale x 8 x i1> [[TMP11]], [[TMP4]]
; CHECK-NEXT:    [[VP_OP19:%.*]] = call <vscale x 8 x double> @llvm.vp.fadd.nxv8f64(<vscale x 8 x double> [[VP_OP_LOAD13]], <vscale x 8 x double> [[VP_OP_LOAD16]], metadata !"round.tonearest", metadata !"fpexcept.ignore", <vscale x 8 x i1> [[TMP23]], i32 [[TMP8]])
; CHECK-NEXT:    [[TMP24:%.*]] = bitcast double* [[TMP9]] to <vscale x 8 x double>*
; CHECK-NEXT:    call void @llvm.vp.store.nxv8f64.p0nxv8f64(<vscale x 8 x double> [[VP_OP19]], <vscale x 8 x double>* [[TMP24]], i32 8, <vscale x 8 x i1> [[TMP23]], i32 [[TMP8]])
; CHECK-NEXT:    [[TMP25:%.*]] = zext i32 [[TMP8]] to i64
; CHECK-NEXT:    [[INDEX_NEXT]] = add i64 [[INDEX]], [[TMP25]]
; CHECK-NEXT:    [[TMP26:%.*]] = icmp eq i64 [[INDEX_NEXT]], [[WIDE_TRIP_COUNT]]
; CHECK-NEXT:    br i1 [[TMP26]], label [[MIDDLE_BLOCK:%.*]], label [[VECTOR_BODY]], [[LOOP0:!llvm.loop !.*]]
; CHECK:       middle.block:
; CHECK-NEXT:    br i1 true, label [[FOR_COND_CLEANUP_LOOPEXIT:%.*]], label [[SCALAR_PH]]
; CHECK:       scalar.ph:
; CHECK-NEXT:    [[BC_RESUME_VAL:%.*]] = phi i64 [ [[WIDE_TRIP_COUNT]], [[MIDDLE_BLOCK]] ], [ 0, [[FOR_BODY_PREHEADER]] ]
; CHECK-NEXT:    br label [[FOR_BODY:%.*]]
; CHECK:       for.cond.cleanup.loopexit:
; CHECK-NEXT:    br label [[FOR_COND_CLEANUP]]
; CHECK:       for.cond.cleanup:
; CHECK-NEXT:    ret void
; CHECK:       for.body:
; CHECK-NEXT:    [[INDVARS_IV:%.*]] = phi i64 [ [[BC_RESUME_VAL]], [[SCALAR_PH]] ], [ [[INDVARS_IV_NEXT:%.*]], [[FOR_INC:%.*]] ]
; CHECK-NEXT:    [[ARRAYIDX:%.*]] = getelementptr inbounds double, double* [[C]], i64 [[INDVARS_IV]]
; CHECK-NEXT:    [[TMP27:%.*]] = load double, double* [[ARRAYIDX]], align 8
; CHECK-NEXT:    [[CMP1:%.*]] = fcmp olt double [[TMP27]], 3.000000e+00
; CHECK-NEXT:    [[ARRAYIDX3:%.*]] = getelementptr inbounds double, double* [[A]], i64 [[INDVARS_IV]]
; CHECK-NEXT:    [[TMP28:%.*]] = load double, double* [[ARRAYIDX3]], align 8
; CHECK-NEXT:    [[ARRAYIDX5:%.*]] = getelementptr inbounds double, double* [[B]], i64 [[INDVARS_IV]]
; CHECK-NEXT:    [[TMP29:%.*]] = load double, double* [[ARRAYIDX5]], align 8
; CHECK-NEXT:    br i1 [[CMP1]], label [[IF_THEN:%.*]], label [[IF_ELSE:%.*]]
; CHECK:       if.then:
; CHECK-NEXT:    [[ADD:%.*]] = fadd double [[TMP28]], [[TMP29]]
; CHECK-NEXT:    store double [[ADD]], double* [[ARRAYIDX]], align 8
; CHECK-NEXT:    br label [[FOR_INC]]
; CHECK:       if.else:
; CHECK-NEXT:    [[MUL:%.*]] = fmul double [[TMP28]], [[TMP29]]
; CHECK-NEXT:    [[ARRAYIDX13:%.*]] = getelementptr inbounds double, double* [[D]], i64 [[INDVARS_IV]]
; CHECK-NEXT:    store double [[MUL]], double* [[ARRAYIDX13]], align 8
; CHECK-NEXT:    br label [[FOR_INC]]
; CHECK:       for.inc:
; CHECK-NEXT:    [[INDVARS_IV_NEXT]] = add nuw nsw i64 [[INDVARS_IV]], 1
; CHECK-NEXT:    [[EXITCOND:%.*]] = icmp eq i64 [[INDVARS_IV_NEXT]], [[WIDE_TRIP_COUNT]]
; CHECK-NEXT:    br i1 [[EXITCOND]], label [[FOR_COND_CLEANUP_LOOPEXIT]], label [[FOR_BODY]], [[LOOP2:!llvm.loop !.*]]
;
; CHECK1-LABEL: @vec_add(
; CHECK1-NEXT:  entry:
; CHECK1-NEXT:    [[CMP22:%.*]] = icmp sgt i32 [[N:%.*]], 0
; CHECK1-NEXT:    br i1 [[CMP22]], label [[FOR_BODY_PREHEADER:%.*]], label [[FOR_COND_CLEANUP:%.*]]
; CHECK1:       for.body.preheader:
; CHECK1-NEXT:    [[WIDE_TRIP_COUNT:%.*]] = zext i32 [[N]] to i64
; CHECK1-NEXT:    br i1 false, label [[SCALAR_PH:%.*]], label [[VECTOR_PH:%.*]]
; CHECK1:       vector.ph:
; CHECK1-NEXT:    [[TRIP_COUNT_MINUS_1:%.*]] = sub i64 [[WIDE_TRIP_COUNT]], 1
; CHECK1-NEXT:    [[BROADCAST_SPLATINSERT:%.*]] = insertelement <vscale x 1 x i64> undef, i64 [[TRIP_COUNT_MINUS_1]], i32 0
; CHECK1-NEXT:    [[BROADCAST_SPLAT:%.*]] = shufflevector <vscale x 1 x i64> [[BROADCAST_SPLATINSERT]], <vscale x 1 x i64> undef, <vscale x 1 x i32> zeroinitializer
; CHECK1-NEXT:    [[BROADCAST_SPLATINSERT7:%.*]] = insertelement <vscale x 1 x double> undef, double 3.000000e+00, i32 0
; CHECK1-NEXT:    [[BROADCAST_SPLAT8:%.*]] = shufflevector <vscale x 1 x double> [[BROADCAST_SPLATINSERT7]], <vscale x 1 x double> undef, <vscale x 1 x i32> zeroinitializer
; CHECK1-NEXT:    br label [[VECTOR_BODY:%.*]]
; CHECK1:       vector.body:
; CHECK1-NEXT:    [[INDEX:%.*]] = phi i64 [ 0, [[VECTOR_PH]] ], [ [[INDEX_NEXT:%.*]], [[VECTOR_BODY]] ]
; CHECK1-NEXT:    [[BROADCAST_SPLATINSERT1:%.*]] = insertelement <vscale x 1 x i64> undef, i64 [[INDEX]], i32 0
; CHECK1-NEXT:    [[BROADCAST_SPLAT2:%.*]] = shufflevector <vscale x 1 x i64> [[BROADCAST_SPLATINSERT1]], <vscale x 1 x i64> undef, <vscale x 1 x i32> zeroinitializer
; CHECK1-NEXT:    [[TMP0:%.*]] = call <vscale x 1 x i64> @llvm.experimental.vector.stepvector.nxv1i64()
; CHECK1-NEXT:    [[DOTSPLATINSERT:%.*]] = insertelement <vscale x 1 x i64> undef, i64 0, i32 0
; CHECK1-NEXT:    [[DOTSPLAT:%.*]] = shufflevector <vscale x 1 x i64> [[DOTSPLATINSERT]], <vscale x 1 x i64> undef, <vscale x 1 x i32> zeroinitializer
; CHECK1-NEXT:    [[TMP1:%.*]] = add <vscale x 1 x i64> [[TMP0]], [[DOTSPLAT]]
; CHECK1-NEXT:    [[DOTSPLATINSERT3:%.*]] = insertelement <vscale x 1 x i64> undef, i64 1, i32 0
; CHECK1-NEXT:    [[DOTSPLAT4:%.*]] = shufflevector <vscale x 1 x i64> [[DOTSPLATINSERT3]], <vscale x 1 x i64> undef, <vscale x 1 x i32> zeroinitializer
; CHECK1-NEXT:    [[TMP2:%.*]] = mul <vscale x 1 x i64> [[TMP1]], [[DOTSPLAT4]]
; CHECK1-NEXT:    [[INDUCTION:%.*]] = add <vscale x 1 x i64> [[BROADCAST_SPLAT2]], [[TMP2]]
; CHECK1-NEXT:    [[TMP3:%.*]] = add i64 [[INDEX]], 0
; CHECK1-NEXT:    [[TMP4:%.*]] = icmp ule <vscale x 1 x i64> [[INDUCTION]], [[BROADCAST_SPLAT]]
; CHECK1-NEXT:    [[TMP5:%.*]] = getelementptr inbounds double, double* [[C:%.*]], i64 [[TMP3]]
; CHECK1-NEXT:    [[TMP6:%.*]] = sub i64 [[WIDE_TRIP_COUNT]], [[INDEX]]
; CHECK1-NEXT:    [[TMP7:%.*]] = call i64 @llvm.epi.vsetvl(i64 [[TMP6]], i64 3, i64 0)
; CHECK1-NEXT:    [[TMP8:%.*]] = trunc i64 [[TMP7]] to i32
; CHECK1-NEXT:    [[TMP9:%.*]] = getelementptr inbounds double, double* [[TMP5]], i32 0
; CHECK1-NEXT:    [[TMP10:%.*]] = bitcast double* [[TMP9]] to <vscale x 1 x double>*
; CHECK1-NEXT:    [[DOTSPLATINSERT5:%.*]] = insertelement <vscale x 1 x i1> undef, i1 true, i32 0
; CHECK1-NEXT:    [[DOTSPLAT6:%.*]] = shufflevector <vscale x 1 x i1> [[DOTSPLATINSERT5]], <vscale x 1 x i1> undef, <vscale x 1 x i32> zeroinitializer
; CHECK1-NEXT:    [[VP_OP_LOAD:%.*]] = call <vscale x 1 x double> @llvm.vp.load.nxv1f64.p0nxv1f64(<vscale x 1 x double>* [[TMP10]], i32 8, <vscale x 1 x i1> [[DOTSPLAT6]], i32 [[TMP8]])
; CHECK1-NEXT:    [[VP_OP_FCMP:%.*]] = call <vscale x 1 x i1> @llvm.vp.fcmp.nxv1f64(<vscale x 1 x double> [[VP_OP_LOAD]], <vscale x 1 x double> [[BROADCAST_SPLAT8]], i8 4, <vscale x 1 x i1> [[DOTSPLAT6]], i32 [[TMP8]])
; CHECK1-NEXT:    [[TMP11:%.*]] = select <vscale x 1 x i1> [[DOTSPLAT6]], <vscale x 1 x i1> [[VP_OP_FCMP]], <vscale x 1 x i1> zeroinitializer
; CHECK1-NEXT:    [[TMP12:%.*]] = getelementptr inbounds double, double* [[A:%.*]], i64 [[TMP3]]
; CHECK1-NEXT:    [[TMP13:%.*]] = getelementptr inbounds double, double* [[TMP12]], i32 0
; CHECK1-NEXT:    [[TMP14:%.*]] = bitcast double* [[TMP13]] to <vscale x 1 x double>*
; CHECK1-NEXT:    [[VP_OP_LOAD13:%.*]] = call <vscale x 1 x double> @llvm.vp.load.nxv1f64.p0nxv1f64(<vscale x 1 x double>* [[TMP14]], i32 8, <vscale x 1 x i1> [[DOTSPLAT6]], i32 [[TMP8]])
; CHECK1-NEXT:    [[TMP15:%.*]] = getelementptr inbounds double, double* [[B:%.*]], i64 [[TMP3]]
; CHECK1-NEXT:    [[TMP16:%.*]] = getelementptr inbounds double, double* [[TMP15]], i32 0
; CHECK1-NEXT:    [[TMP17:%.*]] = bitcast double* [[TMP16]] to <vscale x 1 x double>*
; CHECK1-NEXT:    [[VP_OP_LOAD16:%.*]] = call <vscale x 1 x double> @llvm.vp.load.nxv1f64.p0nxv1f64(<vscale x 1 x double>* [[TMP17]], i32 8, <vscale x 1 x i1> [[DOTSPLAT6]], i32 [[TMP8]])
; CHECK1-NEXT:    [[TMP18:%.*]] = xor <vscale x 1 x i1> [[TMP11]], [[DOTSPLAT6]]
; CHECK1-NEXT:    [[TMP19:%.*]] = and <vscale x 1 x i1> [[TMP18]], [[TMP4]]
; CHECK1-NEXT:    [[VP_OP:%.*]] = call <vscale x 1 x double> @llvm.vp.fmul.nxv1f64(<vscale x 1 x double> [[VP_OP_LOAD13]], <vscale x 1 x double> [[VP_OP_LOAD16]], metadata !"round.tonearest", metadata !"fpexcept.ignore", <vscale x 1 x i1> [[TMP19]], i32 [[TMP8]])
; CHECK1-NEXT:    [[TMP20:%.*]] = getelementptr inbounds double, double* [[D:%.*]], i64 [[TMP3]]
; CHECK1-NEXT:    [[TMP21:%.*]] = getelementptr inbounds double, double* [[TMP20]], i32 0
; CHECK1-NEXT:    [[TMP22:%.*]] = bitcast double* [[TMP21]] to <vscale x 1 x double>*
; CHECK1-NEXT:    call void @llvm.vp.store.nxv1f64.p0nxv1f64(<vscale x 1 x double> [[VP_OP]], <vscale x 1 x double>* [[TMP22]], i32 8, <vscale x 1 x i1> [[TMP19]], i32 [[TMP8]])
; CHECK1-NEXT:    [[TMP23:%.*]] = and <vscale x 1 x i1> [[TMP11]], [[TMP4]]
; CHECK1-NEXT:    [[VP_OP19:%.*]] = call <vscale x 1 x double> @llvm.vp.fadd.nxv1f64(<vscale x 1 x double> [[VP_OP_LOAD13]], <vscale x 1 x double> [[VP_OP_LOAD16]], metadata !"round.tonearest", metadata !"fpexcept.ignore", <vscale x 1 x i1> [[TMP23]], i32 [[TMP8]])
; CHECK1-NEXT:    [[TMP24:%.*]] = bitcast double* [[TMP9]] to <vscale x 1 x double>*
; CHECK1-NEXT:    call void @llvm.vp.store.nxv1f64.p0nxv1f64(<vscale x 1 x double> [[VP_OP19]], <vscale x 1 x double>* [[TMP24]], i32 8, <vscale x 1 x i1> [[TMP23]], i32 [[TMP8]])
; CHECK1-NEXT:    [[TMP25:%.*]] = zext i32 [[TMP8]] to i64
; CHECK1-NEXT:    [[INDEX_NEXT]] = add i64 [[INDEX]], [[TMP25]]
; CHECK1-NEXT:    [[TMP26:%.*]] = icmp eq i64 [[INDEX_NEXT]], [[WIDE_TRIP_COUNT]]
; CHECK1-NEXT:    br i1 [[TMP26]], label [[MIDDLE_BLOCK:%.*]], label [[VECTOR_BODY]], [[LOOP0:!llvm.loop !.*]]
; CHECK1:       middle.block:
; CHECK1-NEXT:    br i1 true, label [[FOR_COND_CLEANUP_LOOPEXIT:%.*]], label [[SCALAR_PH]]
; CHECK1:       scalar.ph:
; CHECK1-NEXT:    [[BC_RESUME_VAL:%.*]] = phi i64 [ [[WIDE_TRIP_COUNT]], [[MIDDLE_BLOCK]] ], [ 0, [[FOR_BODY_PREHEADER]] ]
; CHECK1-NEXT:    br label [[FOR_BODY:%.*]]
; CHECK1:       for.cond.cleanup.loopexit:
; CHECK1-NEXT:    br label [[FOR_COND_CLEANUP]]
; CHECK1:       for.cond.cleanup:
; CHECK1-NEXT:    ret void
; CHECK1:       for.body:
; CHECK1-NEXT:    [[INDVARS_IV:%.*]] = phi i64 [ [[BC_RESUME_VAL]], [[SCALAR_PH]] ], [ [[INDVARS_IV_NEXT:%.*]], [[FOR_INC:%.*]] ]
; CHECK1-NEXT:    [[ARRAYIDX:%.*]] = getelementptr inbounds double, double* [[C]], i64 [[INDVARS_IV]]
; CHECK1-NEXT:    [[TMP27:%.*]] = load double, double* [[ARRAYIDX]], align 8
; CHECK1-NEXT:    [[CMP1:%.*]] = fcmp olt double [[TMP27]], 3.000000e+00
; CHECK1-NEXT:    [[ARRAYIDX3:%.*]] = getelementptr inbounds double, double* [[A]], i64 [[INDVARS_IV]]
; CHECK1-NEXT:    [[TMP28:%.*]] = load double, double* [[ARRAYIDX3]], align 8
; CHECK1-NEXT:    [[ARRAYIDX5:%.*]] = getelementptr inbounds double, double* [[B]], i64 [[INDVARS_IV]]
; CHECK1-NEXT:    [[TMP29:%.*]] = load double, double* [[ARRAYIDX5]], align 8
; CHECK1-NEXT:    br i1 [[CMP1]], label [[IF_THEN:%.*]], label [[IF_ELSE:%.*]]
; CHECK1:       if.then:
; CHECK1-NEXT:    [[ADD:%.*]] = fadd double [[TMP28]], [[TMP29]]
; CHECK1-NEXT:    store double [[ADD]], double* [[ARRAYIDX]], align 8
; CHECK1-NEXT:    br label [[FOR_INC]]
; CHECK1:       if.else:
; CHECK1-NEXT:    [[MUL:%.*]] = fmul double [[TMP28]], [[TMP29]]
; CHECK1-NEXT:    [[ARRAYIDX13:%.*]] = getelementptr inbounds double, double* [[D]], i64 [[INDVARS_IV]]
; CHECK1-NEXT:    store double [[MUL]], double* [[ARRAYIDX13]], align 8
; CHECK1-NEXT:    br label [[FOR_INC]]
; CHECK1:       for.inc:
; CHECK1-NEXT:    [[INDVARS_IV_NEXT]] = add nuw nsw i64 [[INDVARS_IV]], 1
; CHECK1-NEXT:    [[EXITCOND:%.*]] = icmp eq i64 [[INDVARS_IV_NEXT]], [[WIDE_TRIP_COUNT]]
; CHECK1-NEXT:    br i1 [[EXITCOND]], label [[FOR_COND_CLEANUP_LOOPEXIT]], label [[FOR_BODY]], [[LOOP2:!llvm.loop !.*]]
;
entry:
  %cmp22 = icmp sgt i32 %N, 0
  br i1 %cmp22, label %for.body.preheader, label %for.cond.cleanup

for.body.preheader:                               ; preds = %entry
  %wide.trip.count = zext i32 %N to i64
  br label %for.body

for.cond.cleanup.loopexit:                        ; preds = %for.inc
  br label %for.cond.cleanup

for.cond.cleanup:                                 ; preds = %for.cond.cleanup.loopexit, %entry
  ret void

for.body:                                         ; preds = %for.inc, %for.body.preheader
  %indvars.iv = phi i64 [ 0, %for.body.preheader ], [ %indvars.iv.next, %for.inc ]
  %arrayidx = getelementptr inbounds double, double* %c, i64 %indvars.iv
  %0 = load double, double* %arrayidx, align 8
  %cmp1 = fcmp olt double %0, 3.000000e+00
  %arrayidx3 = getelementptr inbounds double, double* %a, i64 %indvars.iv
  %1 = load double, double* %arrayidx3, align 8
  %arrayidx5 = getelementptr inbounds double, double* %b, i64 %indvars.iv
  %2 = load double, double* %arrayidx5, align 8
  br i1 %cmp1, label %if.then, label %if.else

if.then:                                          ; preds = %for.body
  %add = fadd double %1, %2
  store double %add, double* %arrayidx, align 8
  br label %for.inc

if.else:                                          ; preds = %for.body
  %mul = fmul double %1, %2
  %arrayidx13 = getelementptr inbounds double, double* %d, i64 %indvars.iv
  store double %mul, double* %arrayidx13, align 8
  br label %for.inc

for.inc:                                          ; preds = %if.then, %if.else
  %indvars.iv.next = add nuw nsw i64 %indvars.iv, 1
  %exitcond = icmp eq i64 %indvars.iv.next, %wide.trip.count
  br i1 %exitcond, label %for.cond.cleanup.loopexit, label %for.body
}
