; NOTE: Assertions have been autogenerated by utils/update_llc_test_checks.py
; RUN: llc -mtriple=riscv64 -mattr=+f,+d,+experimental-v -verify-machineinstrs < %s | FileCheck %s

declare <vscale x 2 x double> @llvm.epi.vfwredsum.nxv2f64(<vscale x 2 x float> %a, <vscale x 2 x double> %b, i64 %evl)
declare <vscale x 4 x double> @llvm.epi.vfwredsum.nxv4f64(<vscale x 4 x float> %a, <vscale x 4 x double> %b, i64 %evl)
declare <vscale x 8 x double> @llvm.epi.vfwredsum.nxv8f64(<vscale x 8 x float> %a, <vscale x 8 x double> %b, i64 %evl)

declare <vscale x 2 x double> @llvm.epi.vfwredsum.mask.nxv2f64(<vscale x 2 x double> %merge, <vscale x 2 x float> %a, <vscale x 2 x double> %b, <vscale x 2 x i1> %mask, i64 %evl)
declare <vscale x 4 x double> @llvm.epi.vfwredsum.mask.nxv4f64(<vscale x 4 x double> %merge, <vscale x 4 x float> %a, <vscale x 4 x double> %b, <vscale x 4 x i1> %mask, i64 %evl)
declare <vscale x 8 x double> @llvm.epi.vfwredsum.mask.nxv8f64(<vscale x 8 x double> %merge, <vscale x 8 x float> %a, <vscale x 8 x double> %b, <vscale x 8 x i1> %mask, i64 %evl)

define <vscale x 2 x double> @test_llvm.epi.vfwredsum_nxv2f64(<vscale x 2 x float> %a, <vscale x 2 x double> %b, i64 %evl) {
; CHECK-LABEL: test_llvm.epi.vfwredsum_nxv2f64:
; CHECK:       # %bb.0:
; CHECK-NEXT:    vsetvli zero, a0, e32,m1
; CHECK-NEXT:    vfwredsum.vs v16, v16, v18
; CHECK-NEXT:    ret
    %1 = call <vscale x 2 x double> @llvm.epi.vfwredsum.nxv2f64(<vscale x 2 x float> %a, <vscale x 2 x double> %b, i64 %evl)
    ret <vscale x 2 x double> %1
}

define <vscale x 4 x double> @test_llvm.epi.vfwredsum_nxv4f64(<vscale x 4 x float> %a, <vscale x 4 x double> %b, i64 %evl) {
; CHECK-LABEL: test_llvm.epi.vfwredsum_nxv4f64:
; CHECK:       # %bb.0:
; CHECK-NEXT:    vsetvli zero, a0, e32,m2
; CHECK-NEXT:    vfwredsum.vs v16, v16, v20
; CHECK-NEXT:    ret
    %1 = call <vscale x 4 x double> @llvm.epi.vfwredsum.nxv4f64(<vscale x 4 x float> %a, <vscale x 4 x double> %b, i64 %evl)
    ret <vscale x 4 x double> %1
}

define <vscale x 8 x double> @test_llvm.epi.vfwredsum_nxv8f64(<vscale x 8 x float> %a, <vscale x 8 x double> %b, i64 %evl) {
; CHECK-LABEL: test_llvm.epi.vfwredsum_nxv8f64:
; CHECK:       # %bb.0:
; CHECK-NEXT:    vsetvli zero, zero, e64,m8
; CHECK-NEXT:    vle.v v8, (a0)
; CHECK-NEXT:    vsetvli zero, a1, e32,m4
; CHECK-NEXT:    vfwredsum.vs v16, v16, v8
; CHECK-NEXT:    ret
    %1 = call <vscale x 8 x double> @llvm.epi.vfwredsum.nxv8f64(<vscale x 8 x float> %a, <vscale x 8 x double> %b, i64 %evl)
    ret <vscale x 8 x double> %1
}

define <vscale x 2 x double> @test_llvm.epi.vfwredsum.mask_nxv2f64(<vscale x 2 x double> %merge, <vscale x 2 x float> %a, <vscale x 2 x double> %b, <vscale x 2 x i1> %mask, i64 %evl) {
; CHECK-LABEL: test_llvm.epi.vfwredsum.mask_nxv2f64:
; CHECK:       # %bb.0:
; CHECK-NEXT:    vsetvli zero, a0, e32,m1
; CHECK-NEXT:    vfwredsum.vs v16, v18, v20, v0.t
; CHECK-NEXT:    ret
    %1 = call <vscale x 2 x double> @llvm.epi.vfwredsum.mask.nxv2f64(<vscale x 2 x double> %merge, <vscale x 2 x float> %a, <vscale x 2 x double> %b, <vscale x 2 x i1> %mask, i64 %evl)
    ret <vscale x 2 x double> %1
}

define <vscale x 4 x double> @test_llvm.epi.vfwredsum.mask_nxv4f64(<vscale x 4 x double> %merge, <vscale x 4 x float> %a, <vscale x 4 x double> %b, <vscale x 4 x i1> %mask, i64 %evl) {
; CHECK-LABEL: test_llvm.epi.vfwredsum.mask_nxv4f64:
; CHECK:       # %bb.0:
; CHECK-NEXT:    vsetvli zero, zero, e64,m4
; CHECK-NEXT:    vle.v v4, (a0)
; CHECK-NEXT:    vsetvli zero, a1, e32,m2
; CHECK-NEXT:    vfwredsum.vs v16, v20, v4, v0.t
; CHECK-NEXT:    ret
    %1 = call <vscale x 4 x double> @llvm.epi.vfwredsum.mask.nxv4f64(<vscale x 4 x double> %merge, <vscale x 4 x float> %a, <vscale x 4 x double> %b, <vscale x 4 x i1> %mask, i64 %evl)
    ret <vscale x 4 x double> %1
}

define <vscale x 8 x double> @test_llvm.epi.vfwredsum.mask_nxv8f64(<vscale x 8 x double> %merge, <vscale x 8 x float> %a, <vscale x 8 x double> %b, <vscale x 8 x i1> %mask, i64 %evl) {
; CHECK-LABEL: test_llvm.epi.vfwredsum.mask_nxv8f64:
; CHECK:       # %bb.0:
; CHECK-NEXT:    vsetvli zero, zero, e64,m8
; CHECK-NEXT:    vle.v v8, (a1)
; CHECK-NEXT:    vsetvli zero, zero, e32,m4
; CHECK-NEXT:    vle.v v4, (a0)
; CHECK-NEXT:    vsetvli zero, a2, e32,m4
; CHECK-NEXT:    vfwredsum.vs v16, v4, v8, v0.t
; CHECK-NEXT:    ret
    %1 = call <vscale x 8 x double> @llvm.epi.vfwredsum.mask.nxv8f64(<vscale x 8 x double> %merge, <vscale x 8 x float> %a, <vscale x 8 x double> %b, <vscale x 8 x i1> %mask, i64 %evl)
    ret <vscale x 8 x double> %1
}
