; NOTE: Assertions have been autogenerated by utils/update_llc_test_checks.py
; RUN: llc -mtriple=riscv64 -mattr=+experimental-v -verify-machineinstrs < %s \
; RUN:    | FileCheck %s
; ModuleID = 't2.bc'
source_filename = "main-fe31e0.c"
target datalayout = "e-m:e-p:64:64-i64:64-i128:128-n64-S128-v128:128:128-v256:128:128-v512:128:128-v1024:128:128"
target triple = "riscv64-unknown-linux-gnu"

@str = external hidden unnamed_addr constant [28 x i8], align 1

; Function Attrs: nofree nounwind
define dso_local void @init_vector(double* nocapture %x, i32 signext %n, i32 signext %test_case) local_unnamed_addr #0 {
; CHECK-LABEL: init_vector:
; CHECK:       # %bb.0: # %entry
; CHECK-NEXT:    addi sp, sp, -16
; CHECK-NEXT:    sd ra, 8(sp) # 8-byte Folded Spill
; CHECK-NEXT:    beqz a2, .LBB0_6
; CHECK-NEXT:  # %bb.1: # %entry
; CHECK-NEXT:    addi a3, zero, 1
; CHECK-NEXT:    beq a2, a3, .LBB0_8
; CHECK-NEXT:  # %bb.2: # %entry
; CHECK-NEXT:    addi a3, zero, 2
; CHECK-NEXT:    bne a2, a3, .LBB0_12
; CHECK-NEXT:  # %bb.3: # %for.cond11.preheader
; CHECK-NEXT:    addi a2, zero, 1
; CHECK-NEXT:    blt a1, a2, .LBB0_11
; CHECK-NEXT:  # %bb.4: # %for.body13.preheader
; CHECK-NEXT:    mv a2, zero
; CHECK-NEXT:    slli a1, a1, 32
; CHECK-NEXT:    srli a6, a1, 32
; CHECK-NEXT:    vsetvli zero, zero, e64,m1
; CHECK-NEXT:    vid.v v1
; CHECK-NEXT:    vsetvli a3, zero, e64,m1
; CHECK-NEXT:    vsetvli zero, zero, e32,m1
; CHECK-NEXT:    vid.v v2
; CHECK-NEXT:  .LBB0_5: # %vector.body
; CHECK-NEXT:    # =>This Inner Loop Header: Depth=1
; CHECK-NEXT:    sub a4, a6, a2
; CHECK-NEXT:    vsetvli a5, a4, e64,m1
; CHECK-NEXT:    vsetvli zero, a5, e32,m1
; CHECK-NEXT:    vfwcvt.f.x.v v4, v2
; CHECK-NEXT:    vsetvli zero, zero, e64,m1
; CHECK-NEXT:    vmv.x.s a1, v1
; CHECK-NEXT:    slli a1, a1, 3
; CHECK-NEXT:    add a1, a1, a0
; CHECK-NEXT:    vsetvli zero, a4, e64,m1
; CHECK-NEXT:    vse.v v4, (a1)
; CHECK-NEXT:    add a2, a2, a5
; CHECK-NEXT:    vsetvli zero, zero, e64,m1
; CHECK-NEXT:    vadd.vx v1, v1, a3
; CHECK-NEXT:    vsetvli zero, zero, e32,m1
; CHECK-NEXT:    vadd.vx v2, v2, a3
; CHECK-NEXT:    bne a2, a6, .LBB0_5
; CHECK-NEXT:    j .LBB0_11
; CHECK-NEXT:  .LBB0_6: # %for.cond.preheader
; CHECK-NEXT:    addi a2, zero, 1
; CHECK-NEXT:    blt a1, a2, .LBB0_11
; CHECK-NEXT:  # %bb.7: # %for.body.preheader
; CHECK-NEXT:    slli a1, a1, 32
; CHECK-NEXT:    srli a1, a1, 32
; CHECK-NEXT:    slli a2, a1, 3
; CHECK-NEXT:    mv a1, zero
; CHECK-NEXT:    call memset
; CHECK-NEXT:    j .LBB0_11
; CHECK-NEXT:  .LBB0_8: # %for.cond2.preheader
; CHECK-NEXT:    blt a1, a3, .LBB0_11
; CHECK-NEXT:  # %bb.9: # %for.body4.preheader
; CHECK-NEXT:    slli a1, a1, 32
; CHECK-NEXT:    srli a1, a1, 32
; CHECK-NEXT:    addi a2, zero, 1023
; CHECK-NEXT:    slli a2, a2, 52
; CHECK-NEXT:  .LBB0_10: # %for.body4
; CHECK-NEXT:    # =>This Inner Loop Header: Depth=1
; CHECK-NEXT:    sd a2, 0(a0)
; CHECK-NEXT:    addi a1, a1, -1
; CHECK-NEXT:    addi a0, a0, 8
; CHECK-NEXT:    bnez a1, .LBB0_10
; CHECK-NEXT:  .LBB0_11: # %sw.epilog
; CHECK-NEXT:    ld ra, 8(sp) # 8-byte Folded Reload
; CHECK-NEXT:    addi sp, sp, 16
; CHECK-NEXT:    ret
; CHECK-NEXT:  .LBB0_12: # %sw.default
; CHECK-NEXT:    lui a0, %hi(str)
; CHECK-NEXT:    addi a0, a0, %lo(str)
; CHECK-NEXT:    ld ra, 8(sp) # 8-byte Folded Reload
; CHECK-NEXT:    addi sp, sp, 16
; CHECK-NEXT:    tail puts
entry:
  %x43 = bitcast double* %x to i8*
  switch i32 %test_case, label %sw.default [
    i32 0, label %for.cond.preheader
    i32 1, label %for.cond2.preheader
    i32 2, label %for.cond11.preheader
  ]

for.cond11.preheader:                             ; preds = %entry
  %cmp1239 = icmp sgt i32 %n, 0
  br i1 %cmp1239, label %for.body13.preheader, label %sw.epilog

for.body13.preheader:                             ; preds = %for.cond11.preheader
  %wide.trip.count46 = zext i32 %n to i64
  %0 = call <vscale x 1 x i64> @llvm.experimental.vector.stepvector.nxv1i64()
  %1 = call i64 @llvm.vscale.i64()
  %.splatinsert54 = insertelement <vscale x 1 x i64> undef, i64 %1, i32 0
  %.splat55 = shufflevector <vscale x 1 x i64> %.splatinsert54, <vscale x 1 x i64> undef, <vscale x 1 x i32> zeroinitializer
  %2 = call <vscale x 1 x i32> @llvm.experimental.vector.stepvector.nxv1i32()
  %3 = call i32 @llvm.vscale.i32()
  %.splatinsert63 = insertelement <vscale x 1 x i32> undef, i32 %3, i32 0
  %.splat64 = shufflevector <vscale x 1 x i32> %.splatinsert63, <vscale x 1 x i32> undef, <vscale x 1 x i32> zeroinitializer
  br label %vector.body

vector.body:                                      ; preds = %vector.body, %for.body13.preheader
  %index = phi i64 [ 0, %for.body13.preheader ], [ %index.next, %vector.body ]
  %vec.ind = phi <vscale x 1 x i64> [ %0, %for.body13.preheader ], [ %vec.ind.next, %vector.body ]
  %vec.ind65 = phi <vscale x 1 x i32> [ %2, %for.body13.preheader ], [ %vec.ind.next66, %vector.body ]
  %4 = sub i64 %wide.trip.count46, %index
  %5 = call i64 @llvm.epi.vsetvl(i64 %4, i64 3, i64 0)
  %6 = trunc i64 %5 to i32
  %vp.cast = call <vscale x 1 x double> @llvm.vp.sitofp.nxv1f64.nxv1i32(<vscale x 1 x i32> %vec.ind65, metadata !"round.tonearest", metadata !"fpexcept.ignore", <vscale x 1 x i1> shufflevector (<vscale x 1 x i1> insertelement (<vscale x 1 x i1> undef, i1 true, i32 0), <vscale x 1 x i1> undef, <vscale x 1 x i32> zeroinitializer), i32 %6)
  %7 = extractelement <vscale x 1 x i64> %vec.ind, i32 0
  %8 = getelementptr inbounds double, double* %x, i64 %7
  %9 = bitcast double* %8 to <vscale x 1 x double>*
  %10 = trunc i64 %5 to i32
  call void @llvm.vp.store.nxv1f64.p0nxv1f64(<vscale x 1 x double> %vp.cast, <vscale x 1 x double>* %9, i32 8, <vscale x 1 x i1> shufflevector (<vscale x 1 x i1> insertelement (<vscale x 1 x i1> undef, i1 true, i32 0), <vscale x 1 x i1> undef, <vscale x 1 x i32> zeroinitializer), i32 %10), !tbaa !4
  %index.next = add i64 %index, %5
  %vec.ind.next = add <vscale x 1 x i64> %vec.ind, %.splat55
  %vec.ind.next66 = add <vscale x 1 x i32> %vec.ind65, %.splat64
  %11 = icmp eq i64 %index.next, %wide.trip.count46
  br i1 %11, label %sw.epilog, label %vector.body, !llvm.loop !8

for.cond2.preheader:                              ; preds = %entry
  %cmp337 = icmp sgt i32 %n, 0
  br i1 %cmp337, label %for.body4.preheader, label %sw.epilog

for.body4.preheader:                              ; preds = %for.cond2.preheader
  %wide.trip.count = zext i32 %n to i64
  br label %for.body4

for.cond.preheader:                               ; preds = %entry
  %cmp35 = icmp sgt i32 %n, 0
  br i1 %cmp35, label %for.body.preheader, label %sw.epilog

for.body.preheader:                               ; preds = %for.cond.preheader
  %12 = zext i32 %n to i64
  %13 = shl nuw nsw i64 %12, 3
  call void @llvm.memset.p0i8.i64(i8* align 8 %x43, i8 0, i64 %13, i1 false)
  br label %sw.epilog

for.body4:                                        ; preds = %for.body4, %for.body4.preheader
  %indvars.iv = phi i64 [ 0, %for.body4.preheader ], [ %indvars.iv.next, %for.body4 ]
  %arrayidx6 = getelementptr inbounds double, double* %x, i64 %indvars.iv
  store double 1.000000e+00, double* %arrayidx6, align 8, !tbaa !4
  %indvars.iv.next = add nuw nsw i64 %indvars.iv, 1
  %exitcond.not = icmp eq i64 %indvars.iv.next, %wide.trip.count
  br i1 %exitcond.not, label %sw.epilog, label %for.body4, !llvm.loop !11

sw.default:                                       ; preds = %entry
  %puts = tail call i32 @puts(i8* nonnull dereferenceable(1) getelementptr inbounds ([28 x i8], [28 x i8]* @str, i64 0, i64 0))
  br label %sw.epilog

sw.epilog:                                        ; preds = %sw.default, %for.body4, %for.body.preheader, %for.cond.preheader, %for.cond2.preheader, %vector.body, %for.cond11.preheader
  ret void
}

; Function Attrs: nofree nounwind
declare noundef i32 @puts(i8* nocapture noundef readonly) local_unnamed_addr #1

; Function Attrs: argmemonly nofree nosync nounwind willreturn writeonly
declare void @llvm.memset.p0i8.i64(i8* nocapture writeonly, i8, i64, i1 immarg) #2

; Function Attrs: nounwind readnone
declare <vscale x 1 x i64> @llvm.experimental.vector.stepvector.nxv1i64() #3

; Function Attrs: nofree nosync nounwind readnone willreturn
declare i64 @llvm.vscale.i64() #4

; Function Attrs: nounwind readnone
declare <vscale x 1 x i32> @llvm.experimental.vector.stepvector.nxv1i32() #3

; Function Attrs: nofree nosync nounwind readnone willreturn
declare i32 @llvm.vscale.i32() #4

; Function Attrs: nounwind readnone
declare i64 @llvm.epi.vsetvl(i64, i64, i64) #3

; Function Attrs: nounwind readnone willreturn
declare <vscale x 1 x double> @llvm.vp.sitofp.nxv1f64.nxv1i32(<vscale x 1 x i32>, metadata, metadata, <vscale x 1 x i1>, i32) #5

; Function Attrs: argmemonly nosync nounwind willreturn writeonly
declare void @llvm.vp.store.nxv1f64.p0nxv1f64(<vscale x 1 x double>, <vscale x 1 x double>* nocapture, i32 immarg, <vscale x 1 x i1>, i32) #6

attributes #0 = { nofree nounwind "disable-tail-calls"="false" "frame-pointer"="none" "less-precise-fpmad"="false" "min-legal-vector-width"="0" "no-infs-fp-math"="false" "no-jump-tables"="false" "no-nans-fp-math"="false" "no-signed-zeros-fp-math"="false" "no-trapping-math"="true" "stack-protector-buffer-size"="8" "target-features"="+a,+c,+d,+experimental-v,+experimental-zvlsseg,+f,+m,-relax,-save-restore" "unsafe-fp-math"="false" "use-soft-float"="false" }
attributes #1 = { nofree nounwind }
attributes #2 = { argmemonly nofree nosync nounwind willreturn writeonly }
attributes #3 = { nounwind readnone }
attributes #4 = { nofree nosync nounwind readnone willreturn }
attributes #5 = { nounwind readnone willreturn }
attributes #6 = { argmemonly nosync nounwind willreturn writeonly }

!llvm.module.flags = !{!0, !1, !2}
!llvm.ident = !{!3}

!0 = !{i32 1, !"wchar_size", i32 4}
!1 = !{i32 1, !"target-abi", !"lp64d"}
!2 = !{i32 1, !"SmallDataLimit", i32 8}
!3 = !{!"clang version 12.0.0"}
!4 = !{!5, !5, i64 0}
!5 = !{!"double", !6, i64 0}
!6 = !{!"omnipotent char", !7, i64 0}
!7 = !{!"Simple C/C++ TBAA"}
!8 = distinct !{!8, !9, !10}
!9 = !{!"llvm.loop.mustprogress"}
!10 = !{!"llvm.loop.isvectorized", i32 1}
!11 = distinct !{!11, !9}
