; NOTE: Assertions have been autogenerated by utils/update_llc_test_checks.py
; RUN: llc -mtriple riscv64 -mattr +experimental-v -o - %s \
; RUN:   -verify-machineinstrs | FileCheck %s
define <vscale x 1 x i64> @do_select_reg(<vscale x 1 x i1> %mask,
; CHECK-LABEL: do_select_reg:
; CHECK:       # %bb.0:
; CHECK-NEXT:    vsetvli zero, zero, e64,m1
; CHECK-NEXT:    vmerge.vxm v16, v16, a0, v0
; CHECK-NEXT:    ret
                                         <vscale x 1 x i64> %b,
                                         i64 %value) {
  %ins = insertelement
            <vscale x 1 x i64> undef,
            i64 %value,
            i32 0

  %splat = shufflevector
            <vscale x 1 x i64> %ins,
            <vscale x 1 x i64> undef,
            <vscale x 1 x i32> zeroinitializer

  %sel = select <vscale x 1 x i1> %mask,
                <vscale x 1 x i64> %splat,
                <vscale x 1 x i64> %b
  ret <vscale x 1 x i64> %sel
}

define <vscale x 1 x i64> @do_select_imm(<vscale x 1 x i1> %mask,
; CHECK-LABEL: do_select_imm:
; CHECK:       # %bb.0:
; CHECK-NEXT:    vsetvli zero, zero, e64,m1
; CHECK-NEXT:    vmerge.vim v16, v16, 3, v0
; CHECK-NEXT:    ret
                                         <vscale x 1 x i64> %b) {
  %ins = insertelement
            <vscale x 1 x i64> undef,
            i64 3,
            i32 0

  %splat = shufflevector
            <vscale x 1 x i64> %ins,
            <vscale x 1 x i64> undef,
            <vscale x 1 x i32> zeroinitializer

  %sel = select <vscale x 1 x i1> %mask,
                <vscale x 1 x i64> %splat,
                <vscale x 1 x i64> %b
  ret <vscale x 1 x i64> %sel
}
