; NOTE: Assertions have been autogenerated by utils/update_llc_test_checks.py
; RUN: llc -mtriple=riscv64 -mattr=+m,+f,+d,+a,+c,+experimental-v,+only-lmul1 \
; RUN:    -target-abi lp64d -verify-machineinstrs < %s | FileCheck %s

; ModuleID = 'integer-widenings-narrowings-lmul1.c'
source_filename = "integer-widenings-narrowings-lmul1.c"
target datalayout = "e-m:e-p:64:64-i64:64-i128:128-n64-S128-v128:128:128-v256:128:128-v512:128:128-v1024:128:128"
target triple = "riscv64-unknown-linux-gnu"

; Function Attrs: nofree norecurse nounwind
define dso_local void @swiden2(i32 signext %N, i8* noalias nocapture readonly %c, i16* nocapture %s, i8* noalias nocapture readonly %d) local_unnamed_addr #0 {
; CHECK-LABEL: swiden2:
; CHECK:       # %bb.0: # %entry
; CHECK-NEXT:    addi a4, zero, 1
; CHECK-NEXT:    blt a0, a4, .LBB0_3
; CHECK-NEXT:  # %bb.1: # %for.body.preheader
; CHECK-NEXT:    mv a4, zero
; CHECK-NEXT:    slli a0, a0, 32
; CHECK-NEXT:    srli a6, a0, 32
; CHECK-NEXT:  .LBB0_2: # %vector.body
; CHECK-NEXT:    # =>This Inner Loop Header: Depth=1
; CHECK-NEXT:    add a7, a3, a4
; CHECK-NEXT:    sub a0, a6, a4
; CHECK-NEXT:    vsetvli t0, a0, e16,m1
; CHECK-NEXT:    vsetvli zero, t0, e8,m1
; CHECK-NEXT:    vle.v v1, (a7)
; CHECK-NEXT:    add a5, a1, a4
; CHECK-NEXT:    vle.v v2, (a5)
; CHECK-NEXT:    vwcvt.x.x.v v4, v1
; CHECK-NEXT:    vwcvt.x.x.v v6, v2
; CHECK-NEXT:    vsetvli zero, a0, e16,m1
; CHECK-NEXT:    vadd.vv v1, v6, v4
; CHECK-NEXT:    slli a0, a4, 1
; CHECK-NEXT:    add a0, a0, a2
; CHECK-NEXT:    add a4, a4, t0
; CHECK-NEXT:    vse.v v1, (a0)
; CHECK-NEXT:    bne a4, a6, .LBB0_2
; CHECK-NEXT:  .LBB0_3: # %for.cond.cleanup
; CHECK-NEXT:    ret
entry:
  %cmp12 = icmp sgt i32 %N, 0
  br i1 %cmp12, label %for.body.preheader, label %for.cond.cleanup

for.body.preheader:                               ; preds = %entry
  %wide.trip.count = zext i32 %N to i64
  br label %vector.body

vector.body:                                      ; preds = %vector.body, %for.body.preheader
  %index = phi i64 [ 0, %for.body.preheader ], [ %index.next, %vector.body ]
  %0 = getelementptr inbounds i8, i8* %d, i64 %index
  %1 = sub i64 %wide.trip.count, %index
  %2 = call i64 @llvm.epi.vsetvl(i64 %1, i64 1, i64 0)
  %3 = bitcast i8* %0 to <vscale x 4 x i8>*
  %4 = trunc i64 %2 to i32
  %vp.op.load = call <vscale x 4 x i8> @llvm.vp.load.nxv4i8.p0nxv4i8(<vscale x 4 x i8>* %3, i32 1, <vscale x 4 x i1> shufflevector (<vscale x 4 x i1> insertelement (<vscale x 4 x i1> undef, i1 true, i32 0), <vscale x 4 x i1> undef, <vscale x 4 x i32> zeroinitializer), i32 %4), !tbaa !4
  %5 = trunc i64 %2 to i32
  %vp.cast = call <vscale x 4 x i16> @llvm.vp.sext.nxv4i16.nxv4i8(<vscale x 4 x i8> %vp.op.load, <vscale x 4 x i1> shufflevector (<vscale x 4 x i1> insertelement (<vscale x 4 x i1> undef, i1 true, i32 0), <vscale x 4 x i1> undef, <vscale x 4 x i32> zeroinitializer), i32 %5)
  %6 = getelementptr inbounds i8, i8* %c, i64 %index
  %7 = bitcast i8* %6 to <vscale x 4 x i8>*
  %8 = trunc i64 %2 to i32
  %vp.op.load20 = call <vscale x 4 x i8> @llvm.vp.load.nxv4i8.p0nxv4i8(<vscale x 4 x i8>* %7, i32 1, <vscale x 4 x i1> shufflevector (<vscale x 4 x i1> insertelement (<vscale x 4 x i1> undef, i1 true, i32 0), <vscale x 4 x i1> undef, <vscale x 4 x i32> zeroinitializer), i32 %8), !tbaa !4
  %9 = trunc i64 %2 to i32
  %vp.cast23 = call <vscale x 4 x i16> @llvm.vp.sext.nxv4i16.nxv4i8(<vscale x 4 x i8> %vp.op.load20, <vscale x 4 x i1> shufflevector (<vscale x 4 x i1> insertelement (<vscale x 4 x i1> undef, i1 true, i32 0), <vscale x 4 x i1> undef, <vscale x 4 x i32> zeroinitializer), i32 %9)
  %10 = trunc i64 %2 to i32
  %vp.op = call <vscale x 4 x i16> @llvm.vp.add.nxv4i16(<vscale x 4 x i16> %vp.cast23, <vscale x 4 x i16> %vp.cast, <vscale x 4 x i1> shufflevector (<vscale x 4 x i1> insertelement (<vscale x 4 x i1> undef, i1 true, i32 0), <vscale x 4 x i1> undef, <vscale x 4 x i32> zeroinitializer), i32 %10)
  %11 = getelementptr inbounds i16, i16* %s, i64 %index
  %12 = bitcast i16* %11 to <vscale x 4 x i16>*
  %13 = trunc i64 %2 to i32
  call void @llvm.vp.store.nxv4i16.p0nxv4i16(<vscale x 4 x i16> %vp.op, <vscale x 4 x i16>* %12, i32 2, <vscale x 4 x i1> shufflevector (<vscale x 4 x i1> insertelement (<vscale x 4 x i1> undef, i1 true, i32 0), <vscale x 4 x i1> undef, <vscale x 4 x i32> zeroinitializer), i32 %13), !tbaa !7
  %index.next = add i64 %index, %2
  %14 = icmp eq i64 %index.next, %wide.trip.count
  br i1 %14, label %for.cond.cleanup, label %vector.body, !llvm.loop !9

for.cond.cleanup:                                 ; preds = %vector.body, %entry
  ret void
}

; Function Attrs: nofree norecurse nounwind
define dso_local void @swiden4(i32 signext %N, i8* noalias nocapture readonly %c, i32* nocapture %s, i8* noalias nocapture readonly %d) local_unnamed_addr #0 {
; CHECK-LABEL: swiden4:
; CHECK:       # %bb.0: # %entry
; CHECK-NEXT:    addi a4, zero, 1
; CHECK-NEXT:    blt a0, a4, .LBB1_3
; CHECK-NEXT:  # %bb.1: # %for.body.preheader
; CHECK-NEXT:    mv a4, zero
; CHECK-NEXT:    slli a0, a0, 32
; CHECK-NEXT:    srli a6, a0, 32
; CHECK-NEXT:  .LBB1_2: # %vector.body
; CHECK-NEXT:    # =>This Inner Loop Header: Depth=1
; CHECK-NEXT:    add a7, a3, a4
; CHECK-NEXT:    sub t0, a6, a4
; CHECK-NEXT:    vsetvli a5, t0, e32,m1
; CHECK-NEXT:    vsetvli zero, a5, e8,m1
; CHECK-NEXT:    vle.v v1, (a7)
; CHECK-NEXT:    vwcvt.x.x.v v2, v1
; CHECK-NEXT:    vsetvli zero, a5, e16,m1
; CHECK-NEXT:    vwcvt.x.x.v v4, v2
; CHECK-NEXT:    add a0, a1, a4
; CHECK-NEXT:    vsetvli zero, a5, e8,m1
; CHECK-NEXT:    vle.v v1, (a0)
; CHECK-NEXT:    vwcvt.x.x.v v2, v1
; CHECK-NEXT:    vsetvli zero, a5, e16,m1
; CHECK-NEXT:    vwcvt.x.x.v v6, v2
; CHECK-NEXT:    vsetvli zero, t0, e32,m1
; CHECK-NEXT:    vadd.vv v1, v6, v4
; CHECK-NEXT:    slli a0, a4, 2
; CHECK-NEXT:    add a0, a0, a2
; CHECK-NEXT:    add a4, a4, a5
; CHECK-NEXT:    vse.v v1, (a0)
; CHECK-NEXT:    bne a4, a6, .LBB1_2
; CHECK-NEXT:  .LBB1_3: # %for.cond.cleanup
; CHECK-NEXT:    ret
entry:
  %cmp11 = icmp sgt i32 %N, 0
  br i1 %cmp11, label %for.body.preheader, label %for.cond.cleanup

for.body.preheader:                               ; preds = %entry
  %wide.trip.count = zext i32 %N to i64
  br label %vector.body

vector.body:                                      ; preds = %vector.body, %for.body.preheader
  %index = phi i64 [ 0, %for.body.preheader ], [ %index.next, %vector.body ]
  %0 = getelementptr inbounds i8, i8* %d, i64 %index
  %1 = sub i64 %wide.trip.count, %index
  %2 = call i64 @llvm.epi.vsetvl(i64 %1, i64 2, i64 0)
  %3 = bitcast i8* %0 to <vscale x 2 x i8>*
  %4 = trunc i64 %2 to i32
  %vp.op.load = call <vscale x 2 x i8> @llvm.vp.load.nxv2i8.p0nxv2i8(<vscale x 2 x i8>* %3, i32 1, <vscale x 2 x i1> shufflevector (<vscale x 2 x i1> insertelement (<vscale x 2 x i1> undef, i1 true, i32 0), <vscale x 2 x i1> undef, <vscale x 2 x i32> zeroinitializer), i32 %4), !tbaa !4
  %5 = trunc i64 %2 to i32
  %vp.cast = call <vscale x 2 x i32> @llvm.vp.sext.nxv2i32.nxv2i8(<vscale x 2 x i8> %vp.op.load, <vscale x 2 x i1> shufflevector (<vscale x 2 x i1> insertelement (<vscale x 2 x i1> undef, i1 true, i32 0), <vscale x 2 x i1> undef, <vscale x 2 x i32> zeroinitializer), i32 %5)
  %6 = getelementptr inbounds i8, i8* %c, i64 %index
  %7 = bitcast i8* %6 to <vscale x 2 x i8>*
  %8 = trunc i64 %2 to i32
  %vp.op.load19 = call <vscale x 2 x i8> @llvm.vp.load.nxv2i8.p0nxv2i8(<vscale x 2 x i8>* %7, i32 1, <vscale x 2 x i1> shufflevector (<vscale x 2 x i1> insertelement (<vscale x 2 x i1> undef, i1 true, i32 0), <vscale x 2 x i1> undef, <vscale x 2 x i32> zeroinitializer), i32 %8), !tbaa !4
  %9 = trunc i64 %2 to i32
  %vp.cast22 = call <vscale x 2 x i32> @llvm.vp.sext.nxv2i32.nxv2i8(<vscale x 2 x i8> %vp.op.load19, <vscale x 2 x i1> shufflevector (<vscale x 2 x i1> insertelement (<vscale x 2 x i1> undef, i1 true, i32 0), <vscale x 2 x i1> undef, <vscale x 2 x i32> zeroinitializer), i32 %9)
  %10 = trunc i64 %2 to i32
  %vp.op = call <vscale x 2 x i32> @llvm.vp.add.nxv2i32(<vscale x 2 x i32> %vp.cast22, <vscale x 2 x i32> %vp.cast, <vscale x 2 x i1> shufflevector (<vscale x 2 x i1> insertelement (<vscale x 2 x i1> undef, i1 true, i32 0), <vscale x 2 x i1> undef, <vscale x 2 x i32> zeroinitializer), i32 %10)
  %11 = getelementptr inbounds i32, i32* %s, i64 %index
  %12 = bitcast i32* %11 to <vscale x 2 x i32>*
  %13 = trunc i64 %2 to i32
  call void @llvm.vp.store.nxv2i32.p0nxv2i32(<vscale x 2 x i32> %vp.op, <vscale x 2 x i32>* %12, i32 4, <vscale x 2 x i1> shufflevector (<vscale x 2 x i1> insertelement (<vscale x 2 x i1> undef, i1 true, i32 0), <vscale x 2 x i1> undef, <vscale x 2 x i32> zeroinitializer), i32 %13), !tbaa !12
  %index.next = add i64 %index, %2
  %14 = icmp eq i64 %index.next, %wide.trip.count
  br i1 %14, label %for.cond.cleanup, label %vector.body, !llvm.loop !14

for.cond.cleanup:                                 ; preds = %vector.body, %entry
  ret void
}

; Function Attrs: nofree norecurse nounwind
define dso_local void @swiden8(i32 signext %N, i8* noalias nocapture readonly %c, i64* nocapture %s, i8* noalias nocapture readonly %d) local_unnamed_addr #0 {
; CHECK-LABEL: swiden8:
; CHECK:       # %bb.0: # %entry
; CHECK-NEXT:    addi a4, zero, 1
; CHECK-NEXT:    blt a0, a4, .LBB2_3
; CHECK-NEXT:  # %bb.1: # %for.body.preheader
; CHECK-NEXT:    mv a4, zero
; CHECK-NEXT:    slli a0, a0, 32
; CHECK-NEXT:    srli a6, a0, 32
; CHECK-NEXT:  .LBB2_2: # %vector.body
; CHECK-NEXT:    # =>This Inner Loop Header: Depth=1
; CHECK-NEXT:    add a5, a3, a4
; CHECK-NEXT:    sub a7, a6, a4
; CHECK-NEXT:    vsetvli a0, a7, e64,m1
; CHECK-NEXT:    vsetvli zero, a0, e8,m1
; CHECK-NEXT:    vle.v v1, (a5)
; CHECK-NEXT:    vwcvt.x.x.v v2, v1
; CHECK-NEXT:    vsetvli zero, a0, e16,m1
; CHECK-NEXT:    vwcvt.x.x.v v4, v2
; CHECK-NEXT:    vsetvli zero, a0, e32,m1
; CHECK-NEXT:    vwcvt.x.x.v v2, v4
; CHECK-NEXT:    add a5, a1, a4
; CHECK-NEXT:    vsetvli zero, a0, e8,m1
; CHECK-NEXT:    vle.v v1, (a5)
; CHECK-NEXT:    vwcvt.x.x.v v4, v1
; CHECK-NEXT:    vsetvli zero, a0, e16,m1
; CHECK-NEXT:    vwcvt.x.x.v v6, v4
; CHECK-NEXT:    vsetvli zero, a0, e32,m1
; CHECK-NEXT:    vwcvt.x.x.v v4, v6
; CHECK-NEXT:    vsetvli zero, a7, e64,m1
; CHECK-NEXT:    vadd.vv v1, v4, v2
; CHECK-NEXT:    slli a5, a4, 3
; CHECK-NEXT:    add a5, a5, a2
; CHECK-NEXT:    add a4, a4, a0
; CHECK-NEXT:    vse.v v1, (a5)
; CHECK-NEXT:    bne a4, a6, .LBB2_2
; CHECK-NEXT:  .LBB2_3: # %for.cond.cleanup
; CHECK-NEXT:    ret
entry:
  %cmp12 = icmp sgt i32 %N, 0
  br i1 %cmp12, label %for.body.preheader, label %for.cond.cleanup

for.body.preheader:                               ; preds = %entry
  %wide.trip.count = zext i32 %N to i64
  br label %vector.body

vector.body:                                      ; preds = %vector.body, %for.body.preheader
  %index = phi i64 [ 0, %for.body.preheader ], [ %index.next, %vector.body ]
  %0 = getelementptr inbounds i8, i8* %d, i64 %index
  %1 = sub i64 %wide.trip.count, %index
  %2 = call i64 @llvm.epi.vsetvl(i64 %1, i64 3, i64 0)
  %3 = bitcast i8* %0 to <vscale x 1 x i8>*
  %4 = trunc i64 %2 to i32
  %vp.op.load = call <vscale x 1 x i8> @llvm.vp.load.nxv1i8.p0nxv1i8(<vscale x 1 x i8>* %3, i32 1, <vscale x 1 x i1> shufflevector (<vscale x 1 x i1> insertelement (<vscale x 1 x i1> undef, i1 true, i32 0), <vscale x 1 x i1> undef, <vscale x 1 x i32> zeroinitializer), i32 %4), !tbaa !4
  %5 = trunc i64 %2 to i32
  %vp.cast = call <vscale x 1 x i64> @llvm.vp.sext.nxv1i64.nxv1i8(<vscale x 1 x i8> %vp.op.load, <vscale x 1 x i1> shufflevector (<vscale x 1 x i1> insertelement (<vscale x 1 x i1> undef, i1 true, i32 0), <vscale x 1 x i1> undef, <vscale x 1 x i32> zeroinitializer), i32 %5)
  %6 = getelementptr inbounds i8, i8* %c, i64 %index
  %7 = bitcast i8* %6 to <vscale x 1 x i8>*
  %8 = trunc i64 %2 to i32
  %vp.op.load20 = call <vscale x 1 x i8> @llvm.vp.load.nxv1i8.p0nxv1i8(<vscale x 1 x i8>* %7, i32 1, <vscale x 1 x i1> shufflevector (<vscale x 1 x i1> insertelement (<vscale x 1 x i1> undef, i1 true, i32 0), <vscale x 1 x i1> undef, <vscale x 1 x i32> zeroinitializer), i32 %8), !tbaa !4
  %9 = trunc i64 %2 to i32
  %vp.cast23 = call <vscale x 1 x i64> @llvm.vp.sext.nxv1i64.nxv1i8(<vscale x 1 x i8> %vp.op.load20, <vscale x 1 x i1> shufflevector (<vscale x 1 x i1> insertelement (<vscale x 1 x i1> undef, i1 true, i32 0), <vscale x 1 x i1> undef, <vscale x 1 x i32> zeroinitializer), i32 %9)
  %10 = trunc i64 %2 to i32
  %vp.op = call <vscale x 1 x i64> @llvm.vp.add.nxv1i64(<vscale x 1 x i64> %vp.cast23, <vscale x 1 x i64> %vp.cast, <vscale x 1 x i1> shufflevector (<vscale x 1 x i1> insertelement (<vscale x 1 x i1> undef, i1 true, i32 0), <vscale x 1 x i1> undef, <vscale x 1 x i32> zeroinitializer), i32 %10)
  %11 = getelementptr inbounds i64, i64* %s, i64 %index
  %12 = bitcast i64* %11 to <vscale x 1 x i64>*
  %13 = trunc i64 %2 to i32
  call void @llvm.vp.store.nxv1i64.p0nxv1i64(<vscale x 1 x i64> %vp.op, <vscale x 1 x i64>* %12, i32 8, <vscale x 1 x i1> shufflevector (<vscale x 1 x i1> insertelement (<vscale x 1 x i1> undef, i1 true, i32 0), <vscale x 1 x i1> undef, <vscale x 1 x i32> zeroinitializer), i32 %13), !tbaa !15
  %index.next = add i64 %index, %2
  %14 = icmp eq i64 %index.next, %wide.trip.count
  br i1 %14, label %for.cond.cleanup, label %vector.body, !llvm.loop !17

for.cond.cleanup:                                 ; preds = %vector.body, %entry
  ret void
}

; Function Attrs: nofree norecurse nounwind
define dso_local void @snarrow2(i32 signext %N, i16* noalias nocapture readonly %c, i8* nocapture %s, i16* noalias nocapture readonly %d) local_unnamed_addr #0 {
; CHECK-LABEL: snarrow2:
; CHECK:       # %bb.0: # %entry
; CHECK-NEXT:    addi a4, zero, 1
; CHECK-NEXT:    blt a0, a4, .LBB3_3
; CHECK-NEXT:  # %bb.1: # %for.body.preheader
; CHECK-NEXT:    mv a4, zero
; CHECK-NEXT:    slli a0, a0, 32
; CHECK-NEXT:    srli a6, a0, 32
; CHECK-NEXT:  .LBB3_2: # %vector.body
; CHECK-NEXT:    # =>This Inner Loop Header: Depth=1
; CHECK-NEXT:    slli t0, a4, 1
; CHECK-NEXT:    add a7, a3, t0
; CHECK-NEXT:    sub a0, a6, a4
; CHECK-NEXT:    vsetvli a5, a0, e16,m1
; CHECK-NEXT:    vle.v v2, (a7)
; CHECK-NEXT:    vsetvli zero, a5, e8,m1
; CHECK-NEXT:    vnsrl.vi v1, v2, 0
; CHECK-NEXT:    add a7, a1, t0
; CHECK-NEXT:    vsetvli zero, a0, e16,m1
; CHECK-NEXT:    vle.v v2, (a7)
; CHECK-NEXT:    vsetvli zero, a5, e8,m1
; CHECK-NEXT:    vnsrl.vi v4, v2, 0
; CHECK-NEXT:    vadd.vv v1, v4, v1
; CHECK-NEXT:    add a0, a2, a4
; CHECK-NEXT:    add a4, a4, a5
; CHECK-NEXT:    vse.v v1, (a0)
; CHECK-NEXT:    bne a4, a6, .LBB3_2
; CHECK-NEXT:  .LBB3_3: # %for.cond.cleanup
; CHECK-NEXT:    ret
entry:
  %cmp12 = icmp sgt i32 %N, 0
  br i1 %cmp12, label %for.body.preheader, label %for.cond.cleanup

for.body.preheader:                               ; preds = %entry
  %wide.trip.count = zext i32 %N to i64
  br label %vector.body

vector.body:                                      ; preds = %vector.body, %for.body.preheader
  %index = phi i64 [ 0, %for.body.preheader ], [ %index.next, %vector.body ]
  %0 = getelementptr inbounds i16, i16* %d, i64 %index
  %1 = sub i64 %wide.trip.count, %index
  %2 = call i64 @llvm.epi.vsetvl(i64 %1, i64 1, i64 0)
  %3 = bitcast i16* %0 to <vscale x 4 x i16>*
  %4 = trunc i64 %2 to i32
  %vp.op.load = call <vscale x 4 x i16> @llvm.vp.load.nxv4i16.p0nxv4i16(<vscale x 4 x i16>* %3, i32 2, <vscale x 4 x i1> shufflevector (<vscale x 4 x i1> insertelement (<vscale x 4 x i1> undef, i1 true, i32 0), <vscale x 4 x i1> undef, <vscale x 4 x i32> zeroinitializer), i32 %4), !tbaa !7
  %5 = trunc i64 %2 to i32
  %vp.cast = call <vscale x 4 x i8> @llvm.vp.trunc.nxv4i8.nxv4i16(<vscale x 4 x i16> %vp.op.load, <vscale x 4 x i1> shufflevector (<vscale x 4 x i1> insertelement (<vscale x 4 x i1> undef, i1 true, i32 0), <vscale x 4 x i1> undef, <vscale x 4 x i32> zeroinitializer), i32 %5)
  %6 = getelementptr inbounds i16, i16* %c, i64 %index
  %7 = bitcast i16* %6 to <vscale x 4 x i16>*
  %8 = trunc i64 %2 to i32
  %vp.op.load20 = call <vscale x 4 x i16> @llvm.vp.load.nxv4i16.p0nxv4i16(<vscale x 4 x i16>* %7, i32 2, <vscale x 4 x i1> shufflevector (<vscale x 4 x i1> insertelement (<vscale x 4 x i1> undef, i1 true, i32 0), <vscale x 4 x i1> undef, <vscale x 4 x i32> zeroinitializer), i32 %8), !tbaa !7
  %9 = trunc i64 %2 to i32
  %vp.cast23 = call <vscale x 4 x i8> @llvm.vp.trunc.nxv4i8.nxv4i16(<vscale x 4 x i16> %vp.op.load20, <vscale x 4 x i1> shufflevector (<vscale x 4 x i1> insertelement (<vscale x 4 x i1> undef, i1 true, i32 0), <vscale x 4 x i1> undef, <vscale x 4 x i32> zeroinitializer), i32 %9)
  %10 = trunc i64 %2 to i32
  %vp.op = call <vscale x 4 x i8> @llvm.vp.add.nxv4i8(<vscale x 4 x i8> %vp.cast23, <vscale x 4 x i8> %vp.cast, <vscale x 4 x i1> shufflevector (<vscale x 4 x i1> insertelement (<vscale x 4 x i1> undef, i1 true, i32 0), <vscale x 4 x i1> undef, <vscale x 4 x i32> zeroinitializer), i32 %10)
  %11 = getelementptr inbounds i8, i8* %s, i64 %index
  %12 = bitcast i8* %11 to <vscale x 4 x i8>*
  %13 = trunc i64 %2 to i32
  call void @llvm.vp.store.nxv4i8.p0nxv4i8(<vscale x 4 x i8> %vp.op, <vscale x 4 x i8>* %12, i32 1, <vscale x 4 x i1> shufflevector (<vscale x 4 x i1> insertelement (<vscale x 4 x i1> undef, i1 true, i32 0), <vscale x 4 x i1> undef, <vscale x 4 x i32> zeroinitializer), i32 %13), !tbaa !4
  %index.next = add i64 %index, %2
  %14 = icmp eq i64 %index.next, %wide.trip.count
  br i1 %14, label %for.cond.cleanup, label %vector.body, !llvm.loop !18

for.cond.cleanup:                                 ; preds = %vector.body, %entry
  ret void
}

; Function Attrs: nofree norecurse nounwind
define dso_local void @snarrow4(i32 signext %N, i32* noalias nocapture readonly %c, i8* nocapture %s, i32* noalias nocapture readonly %d) local_unnamed_addr #0 {
; CHECK-LABEL: snarrow4:
; CHECK:       # %bb.0: # %entry
; CHECK-NEXT:    addi a4, zero, 1
; CHECK-NEXT:    blt a0, a4, .LBB4_3
; CHECK-NEXT:  # %bb.1: # %for.body.preheader
; CHECK-NEXT:    mv a4, zero
; CHECK-NEXT:    slli a0, a0, 32
; CHECK-NEXT:    srli a6, a0, 32
; CHECK-NEXT:  .LBB4_2: # %vector.body
; CHECK-NEXT:    # =>This Inner Loop Header: Depth=1
; CHECK-NEXT:    slli a5, a4, 2
; CHECK-NEXT:    add a7, a3, a5
; CHECK-NEXT:    sub a0, a6, a4
; CHECK-NEXT:    vsetvli a0, a0, e32,m1
; CHECK-NEXT:    vle.v v1, (a7)
; CHECK-NEXT:    add a5, a5, a1
; CHECK-NEXT:    vle.v v2, (a5)
; CHECK-NEXT:    vadd.vv v2, v2, v1
; CHECK-NEXT:    vsetvli zero, a0, e16,m1
; CHECK-NEXT:    vnsrl.vi v4, v2, 0
; CHECK-NEXT:    vsetvli zero, a0, e8,m1
; CHECK-NEXT:    vnsrl.vi v1, v4, 0
; CHECK-NEXT:    add a5, a2, a4
; CHECK-NEXT:    add a4, a4, a0
; CHECK-NEXT:    vse.v v1, (a5)
; CHECK-NEXT:    bne a4, a6, .LBB4_2
; CHECK-NEXT:  .LBB4_3: # %for.cond.cleanup
; CHECK-NEXT:    ret
entry:
  %cmp10 = icmp sgt i32 %N, 0
  br i1 %cmp10, label %for.body.preheader, label %for.cond.cleanup

for.body.preheader:                               ; preds = %entry
  %wide.trip.count = zext i32 %N to i64
  br label %vector.body

vector.body:                                      ; preds = %vector.body, %for.body.preheader
  %index = phi i64 [ 0, %for.body.preheader ], [ %index.next, %vector.body ]
  %0 = getelementptr inbounds i32, i32* %d, i64 %index
  %1 = sub i64 %wide.trip.count, %index
  %2 = call i64 @llvm.epi.vsetvl(i64 %1, i64 2, i64 0)
  %3 = bitcast i32* %0 to <vscale x 2 x i32>*
  %4 = trunc i64 %2 to i32
  %vp.op.load = call <vscale x 2 x i32> @llvm.vp.load.nxv2i32.p0nxv2i32(<vscale x 2 x i32>* %3, i32 4, <vscale x 2 x i1> shufflevector (<vscale x 2 x i1> insertelement (<vscale x 2 x i1> undef, i1 true, i32 0), <vscale x 2 x i1> undef, <vscale x 2 x i32> zeroinitializer), i32 %4), !tbaa !12
  %5 = getelementptr inbounds i32, i32* %c, i64 %index
  %6 = bitcast i32* %5 to <vscale x 2 x i32>*
  %7 = trunc i64 %2 to i32
  %vp.op.load16 = call <vscale x 2 x i32> @llvm.vp.load.nxv2i32.p0nxv2i32(<vscale x 2 x i32>* %6, i32 4, <vscale x 2 x i1> shufflevector (<vscale x 2 x i1> insertelement (<vscale x 2 x i1> undef, i1 true, i32 0), <vscale x 2 x i1> undef, <vscale x 2 x i32> zeroinitializer), i32 %7), !tbaa !12
  %8 = trunc i64 %2 to i32
  %vp.op = call <vscale x 2 x i32> @llvm.vp.add.nxv2i32(<vscale x 2 x i32> %vp.op.load16, <vscale x 2 x i32> %vp.op.load, <vscale x 2 x i1> shufflevector (<vscale x 2 x i1> insertelement (<vscale x 2 x i1> undef, i1 true, i32 0), <vscale x 2 x i1> undef, <vscale x 2 x i32> zeroinitializer), i32 %8)
  %9 = trunc i64 %2 to i32
  %vp.cast = call <vscale x 2 x i8> @llvm.vp.trunc.nxv2i8.nxv2i32(<vscale x 2 x i32> %vp.op, <vscale x 2 x i1> shufflevector (<vscale x 2 x i1> insertelement (<vscale x 2 x i1> undef, i1 true, i32 0), <vscale x 2 x i1> undef, <vscale x 2 x i32> zeroinitializer), i32 %9)
  %10 = getelementptr inbounds i8, i8* %s, i64 %index
  %11 = bitcast i8* %10 to <vscale x 2 x i8>*
  %12 = trunc i64 %2 to i32
  call void @llvm.vp.store.nxv2i8.p0nxv2i8(<vscale x 2 x i8> %vp.cast, <vscale x 2 x i8>* %11, i32 1, <vscale x 2 x i1> shufflevector (<vscale x 2 x i1> insertelement (<vscale x 2 x i1> undef, i1 true, i32 0), <vscale x 2 x i1> undef, <vscale x 2 x i32> zeroinitializer), i32 %12), !tbaa !4
  %index.next = add i64 %index, %2
  %13 = icmp eq i64 %index.next, %wide.trip.count
  br i1 %13, label %for.cond.cleanup, label %vector.body, !llvm.loop !19

for.cond.cleanup:                                 ; preds = %vector.body, %entry
  ret void
}

; Function Attrs: nofree norecurse nounwind
define dso_local void @snarrow8(i32 signext %N, i64* noalias nocapture readonly %c, i8* nocapture %s, i64* noalias nocapture readonly %d) local_unnamed_addr #0 {
; CHECK-LABEL: snarrow8:
; CHECK:       # %bb.0: # %entry
; CHECK-NEXT:    addi a4, zero, 1
; CHECK-NEXT:    blt a0, a4, .LBB5_3
; CHECK-NEXT:  # %bb.1: # %for.body.preheader
; CHECK-NEXT:    mv a4, zero
; CHECK-NEXT:    slli a0, a0, 32
; CHECK-NEXT:    srli a6, a0, 32
; CHECK-NEXT:  .LBB5_2: # %vector.body
; CHECK-NEXT:    # =>This Inner Loop Header: Depth=1
; CHECK-NEXT:    slli a5, a4, 3
; CHECK-NEXT:    add a7, a3, a5
; CHECK-NEXT:    sub a0, a6, a4
; CHECK-NEXT:    vsetvli a0, a0, e64,m1
; CHECK-NEXT:    vle.v v1, (a7)
; CHECK-NEXT:    add a5, a5, a1
; CHECK-NEXT:    vle.v v2, (a5)
; CHECK-NEXT:    vadd.vv v2, v2, v1
; CHECK-NEXT:    vsetvli zero, a0, e32,m1
; CHECK-NEXT:    vnsrl.vi v4, v2, 0
; CHECK-NEXT:    vsetvli zero, a0, e16,m1
; CHECK-NEXT:    vnsrl.vi v2, v4, 0
; CHECK-NEXT:    vsetvli zero, a0, e8,m1
; CHECK-NEXT:    vnsrl.vi v1, v2, 0
; CHECK-NEXT:    add a5, a2, a4
; CHECK-NEXT:    add a4, a4, a0
; CHECK-NEXT:    vse.v v1, (a5)
; CHECK-NEXT:    bne a4, a6, .LBB5_2
; CHECK-NEXT:  .LBB5_3: # %for.cond.cleanup
; CHECK-NEXT:    ret
entry:
  %cmp10 = icmp sgt i32 %N, 0
  br i1 %cmp10, label %for.body.preheader, label %for.cond.cleanup

for.body.preheader:                               ; preds = %entry
  %wide.trip.count = zext i32 %N to i64
  br label %vector.body

vector.body:                                      ; preds = %vector.body, %for.body.preheader
  %index = phi i64 [ 0, %for.body.preheader ], [ %index.next, %vector.body ]
  %0 = getelementptr inbounds i64, i64* %d, i64 %index
  %1 = sub i64 %wide.trip.count, %index
  %2 = call i64 @llvm.epi.vsetvl(i64 %1, i64 3, i64 0)
  %3 = bitcast i64* %0 to <vscale x 1 x i64>*
  %4 = trunc i64 %2 to i32
  %vp.op.load = call <vscale x 1 x i64> @llvm.vp.load.nxv1i64.p0nxv1i64(<vscale x 1 x i64>* %3, i32 8, <vscale x 1 x i1> shufflevector (<vscale x 1 x i1> insertelement (<vscale x 1 x i1> undef, i1 true, i32 0), <vscale x 1 x i1> undef, <vscale x 1 x i32> zeroinitializer), i32 %4), !tbaa !15
  %5 = getelementptr inbounds i64, i64* %c, i64 %index
  %6 = bitcast i64* %5 to <vscale x 1 x i64>*
  %7 = trunc i64 %2 to i32
  %vp.op.load16 = call <vscale x 1 x i64> @llvm.vp.load.nxv1i64.p0nxv1i64(<vscale x 1 x i64>* %6, i32 8, <vscale x 1 x i1> shufflevector (<vscale x 1 x i1> insertelement (<vscale x 1 x i1> undef, i1 true, i32 0), <vscale x 1 x i1> undef, <vscale x 1 x i32> zeroinitializer), i32 %7), !tbaa !15
  %8 = trunc i64 %2 to i32
  %vp.op = call <vscale x 1 x i64> @llvm.vp.add.nxv1i64(<vscale x 1 x i64> %vp.op.load16, <vscale x 1 x i64> %vp.op.load, <vscale x 1 x i1> shufflevector (<vscale x 1 x i1> insertelement (<vscale x 1 x i1> undef, i1 true, i32 0), <vscale x 1 x i1> undef, <vscale x 1 x i32> zeroinitializer), i32 %8)
  %9 = trunc i64 %2 to i32
  %vp.cast = call <vscale x 1 x i8> @llvm.vp.trunc.nxv1i8.nxv1i64(<vscale x 1 x i64> %vp.op, <vscale x 1 x i1> shufflevector (<vscale x 1 x i1> insertelement (<vscale x 1 x i1> undef, i1 true, i32 0), <vscale x 1 x i1> undef, <vscale x 1 x i32> zeroinitializer), i32 %9)
  %10 = getelementptr inbounds i8, i8* %s, i64 %index
  %11 = bitcast i8* %10 to <vscale x 1 x i8>*
  %12 = trunc i64 %2 to i32
  call void @llvm.vp.store.nxv1i8.p0nxv1i8(<vscale x 1 x i8> %vp.cast, <vscale x 1 x i8>* %11, i32 1, <vscale x 1 x i1> shufflevector (<vscale x 1 x i1> insertelement (<vscale x 1 x i1> undef, i1 true, i32 0), <vscale x 1 x i1> undef, <vscale x 1 x i32> zeroinitializer), i32 %12), !tbaa !4
  %index.next = add i64 %index, %2
  %13 = icmp eq i64 %index.next, %wide.trip.count
  br i1 %13, label %for.cond.cleanup, label %vector.body, !llvm.loop !20

for.cond.cleanup:                                 ; preds = %vector.body, %entry
  ret void
}

; Function Attrs: nofree norecurse nounwind
define dso_local void @uwiden2(i32 signext %N, i8* noalias nocapture readonly %c, i16* nocapture %s, i8* noalias nocapture readonly %d) local_unnamed_addr #0 {
; CHECK-LABEL: uwiden2:
; CHECK:       # %bb.0: # %entry
; CHECK-NEXT:    addi a4, zero, 1
; CHECK-NEXT:    blt a0, a4, .LBB6_3
; CHECK-NEXT:  # %bb.1: # %for.body.preheader
; CHECK-NEXT:    mv a4, zero
; CHECK-NEXT:    slli a0, a0, 32
; CHECK-NEXT:    srli a6, a0, 32
; CHECK-NEXT:  .LBB6_2: # %vector.body
; CHECK-NEXT:    # =>This Inner Loop Header: Depth=1
; CHECK-NEXT:    add a7, a3, a4
; CHECK-NEXT:    sub a0, a6, a4
; CHECK-NEXT:    vsetvli t0, a0, e16,m1
; CHECK-NEXT:    vsetvli zero, t0, e8,m1
; CHECK-NEXT:    vle.v v1, (a7)
; CHECK-NEXT:    add a5, a1, a4
; CHECK-NEXT:    vle.v v2, (a5)
; CHECK-NEXT:    vwcvtu.x.x.v v4, v1
; CHECK-NEXT:    vwcvtu.x.x.v v6, v2
; CHECK-NEXT:    vsetvli zero, a0, e16,m1
; CHECK-NEXT:    vadd.vv v1, v6, v4
; CHECK-NEXT:    slli a0, a4, 1
; CHECK-NEXT:    add a0, a0, a2
; CHECK-NEXT:    add a4, a4, t0
; CHECK-NEXT:    vse.v v1, (a0)
; CHECK-NEXT:    bne a4, a6, .LBB6_2
; CHECK-NEXT:  .LBB6_3: # %for.cond.cleanup
; CHECK-NEXT:    ret
entry:
  %cmp12 = icmp sgt i32 %N, 0
  br i1 %cmp12, label %for.body.preheader, label %for.cond.cleanup

for.body.preheader:                               ; preds = %entry
  %wide.trip.count = zext i32 %N to i64
  br label %vector.body

vector.body:                                      ; preds = %vector.body, %for.body.preheader
  %index = phi i64 [ 0, %for.body.preheader ], [ %index.next, %vector.body ]
  %0 = getelementptr inbounds i8, i8* %d, i64 %index
  %1 = sub i64 %wide.trip.count, %index
  %2 = call i64 @llvm.epi.vsetvl(i64 %1, i64 1, i64 0)
  %3 = bitcast i8* %0 to <vscale x 4 x i8>*
  %4 = trunc i64 %2 to i32
  %vp.op.load = call <vscale x 4 x i8> @llvm.vp.load.nxv4i8.p0nxv4i8(<vscale x 4 x i8>* %3, i32 1, <vscale x 4 x i1> shufflevector (<vscale x 4 x i1> insertelement (<vscale x 4 x i1> undef, i1 true, i32 0), <vscale x 4 x i1> undef, <vscale x 4 x i32> zeroinitializer), i32 %4), !tbaa !4
  %5 = trunc i64 %2 to i32
  %vp.cast = call <vscale x 4 x i16> @llvm.vp.zext.nxv4i16.nxv4i8(<vscale x 4 x i8> %vp.op.load, <vscale x 4 x i1> shufflevector (<vscale x 4 x i1> insertelement (<vscale x 4 x i1> undef, i1 true, i32 0), <vscale x 4 x i1> undef, <vscale x 4 x i32> zeroinitializer), i32 %5)
  %6 = getelementptr inbounds i8, i8* %c, i64 %index
  %7 = bitcast i8* %6 to <vscale x 4 x i8>*
  %8 = trunc i64 %2 to i32
  %vp.op.load20 = call <vscale x 4 x i8> @llvm.vp.load.nxv4i8.p0nxv4i8(<vscale x 4 x i8>* %7, i32 1, <vscale x 4 x i1> shufflevector (<vscale x 4 x i1> insertelement (<vscale x 4 x i1> undef, i1 true, i32 0), <vscale x 4 x i1> undef, <vscale x 4 x i32> zeroinitializer), i32 %8), !tbaa !4
  %9 = trunc i64 %2 to i32
  %vp.cast23 = call <vscale x 4 x i16> @llvm.vp.zext.nxv4i16.nxv4i8(<vscale x 4 x i8> %vp.op.load20, <vscale x 4 x i1> shufflevector (<vscale x 4 x i1> insertelement (<vscale x 4 x i1> undef, i1 true, i32 0), <vscale x 4 x i1> undef, <vscale x 4 x i32> zeroinitializer), i32 %9)
  %10 = trunc i64 %2 to i32
  %vp.op = call <vscale x 4 x i16> @llvm.vp.add.nxv4i16(<vscale x 4 x i16> %vp.cast23, <vscale x 4 x i16> %vp.cast, <vscale x 4 x i1> shufflevector (<vscale x 4 x i1> insertelement (<vscale x 4 x i1> undef, i1 true, i32 0), <vscale x 4 x i1> undef, <vscale x 4 x i32> zeroinitializer), i32 %10)
  %11 = getelementptr inbounds i16, i16* %s, i64 %index
  %12 = bitcast i16* %11 to <vscale x 4 x i16>*
  %13 = trunc i64 %2 to i32
  call void @llvm.vp.store.nxv4i16.p0nxv4i16(<vscale x 4 x i16> %vp.op, <vscale x 4 x i16>* %12, i32 2, <vscale x 4 x i1> shufflevector (<vscale x 4 x i1> insertelement (<vscale x 4 x i1> undef, i1 true, i32 0), <vscale x 4 x i1> undef, <vscale x 4 x i32> zeroinitializer), i32 %13), !tbaa !7
  %index.next = add i64 %index, %2
  %14 = icmp eq i64 %index.next, %wide.trip.count
  br i1 %14, label %for.cond.cleanup, label %vector.body, !llvm.loop !21

for.cond.cleanup:                                 ; preds = %vector.body, %entry
  ret void
}

; Function Attrs: nofree norecurse nounwind
define dso_local void @uwiden4(i32 signext %N, i8* noalias nocapture readonly %c, i32* nocapture %s, i8* noalias nocapture readonly %d) local_unnamed_addr #0 {
; CHECK-LABEL: uwiden4:
; CHECK:       # %bb.0: # %entry
; CHECK-NEXT:    addi a4, zero, 1
; CHECK-NEXT:    blt a0, a4, .LBB7_3
; CHECK-NEXT:  # %bb.1: # %for.body.preheader
; CHECK-NEXT:    mv a4, zero
; CHECK-NEXT:    slli a0, a0, 32
; CHECK-NEXT:    srli a6, a0, 32
; CHECK-NEXT:  .LBB7_2: # %vector.body
; CHECK-NEXT:    # =>This Inner Loop Header: Depth=1
; CHECK-NEXT:    add a7, a3, a4
; CHECK-NEXT:    sub t0, a6, a4
; CHECK-NEXT:    vsetvli a5, t0, e32,m1
; CHECK-NEXT:    vsetvli zero, a5, e8,m1
; CHECK-NEXT:    vle.v v1, (a7)
; CHECK-NEXT:    vwcvtu.x.x.v v2, v1
; CHECK-NEXT:    vsetvli zero, a5, e16,m1
; CHECK-NEXT:    vwcvtu.x.x.v v4, v2
; CHECK-NEXT:    add a0, a1, a4
; CHECK-NEXT:    vsetvli zero, a5, e8,m1
; CHECK-NEXT:    vle.v v1, (a0)
; CHECK-NEXT:    vwcvtu.x.x.v v2, v1
; CHECK-NEXT:    vsetvli zero, a5, e16,m1
; CHECK-NEXT:    vwcvtu.x.x.v v6, v2
; CHECK-NEXT:    vsetvli zero, t0, e32,m1
; CHECK-NEXT:    vadd.vv v1, v6, v4
; CHECK-NEXT:    slli a0, a4, 2
; CHECK-NEXT:    add a0, a0, a2
; CHECK-NEXT:    add a4, a4, a5
; CHECK-NEXT:    vse.v v1, (a0)
; CHECK-NEXT:    bne a4, a6, .LBB7_2
; CHECK-NEXT:  .LBB7_3: # %for.cond.cleanup
; CHECK-NEXT:    ret
entry:
  %cmp11 = icmp sgt i32 %N, 0
  br i1 %cmp11, label %for.body.preheader, label %for.cond.cleanup

for.body.preheader:                               ; preds = %entry
  %wide.trip.count = zext i32 %N to i64
  br label %vector.body

vector.body:                                      ; preds = %vector.body, %for.body.preheader
  %index = phi i64 [ 0, %for.body.preheader ], [ %index.next, %vector.body ]
  %0 = getelementptr inbounds i8, i8* %d, i64 %index
  %1 = sub i64 %wide.trip.count, %index
  %2 = call i64 @llvm.epi.vsetvl(i64 %1, i64 2, i64 0)
  %3 = bitcast i8* %0 to <vscale x 2 x i8>*
  %4 = trunc i64 %2 to i32
  %vp.op.load = call <vscale x 2 x i8> @llvm.vp.load.nxv2i8.p0nxv2i8(<vscale x 2 x i8>* %3, i32 1, <vscale x 2 x i1> shufflevector (<vscale x 2 x i1> insertelement (<vscale x 2 x i1> undef, i1 true, i32 0), <vscale x 2 x i1> undef, <vscale x 2 x i32> zeroinitializer), i32 %4), !tbaa !4
  %5 = trunc i64 %2 to i32
  %vp.cast = call <vscale x 2 x i32> @llvm.vp.zext.nxv2i32.nxv2i8(<vscale x 2 x i8> %vp.op.load, <vscale x 2 x i1> shufflevector (<vscale x 2 x i1> insertelement (<vscale x 2 x i1> undef, i1 true, i32 0), <vscale x 2 x i1> undef, <vscale x 2 x i32> zeroinitializer), i32 %5)
  %6 = getelementptr inbounds i8, i8* %c, i64 %index
  %7 = bitcast i8* %6 to <vscale x 2 x i8>*
  %8 = trunc i64 %2 to i32
  %vp.op.load19 = call <vscale x 2 x i8> @llvm.vp.load.nxv2i8.p0nxv2i8(<vscale x 2 x i8>* %7, i32 1, <vscale x 2 x i1> shufflevector (<vscale x 2 x i1> insertelement (<vscale x 2 x i1> undef, i1 true, i32 0), <vscale x 2 x i1> undef, <vscale x 2 x i32> zeroinitializer), i32 %8), !tbaa !4
  %9 = trunc i64 %2 to i32
  %vp.cast22 = call <vscale x 2 x i32> @llvm.vp.zext.nxv2i32.nxv2i8(<vscale x 2 x i8> %vp.op.load19, <vscale x 2 x i1> shufflevector (<vscale x 2 x i1> insertelement (<vscale x 2 x i1> undef, i1 true, i32 0), <vscale x 2 x i1> undef, <vscale x 2 x i32> zeroinitializer), i32 %9)
  %10 = trunc i64 %2 to i32
  %vp.op = call <vscale x 2 x i32> @llvm.vp.add.nxv2i32(<vscale x 2 x i32> %vp.cast22, <vscale x 2 x i32> %vp.cast, <vscale x 2 x i1> shufflevector (<vscale x 2 x i1> insertelement (<vscale x 2 x i1> undef, i1 true, i32 0), <vscale x 2 x i1> undef, <vscale x 2 x i32> zeroinitializer), i32 %10)
  %11 = getelementptr inbounds i32, i32* %s, i64 %index
  %12 = bitcast i32* %11 to <vscale x 2 x i32>*
  %13 = trunc i64 %2 to i32
  call void @llvm.vp.store.nxv2i32.p0nxv2i32(<vscale x 2 x i32> %vp.op, <vscale x 2 x i32>* %12, i32 4, <vscale x 2 x i1> shufflevector (<vscale x 2 x i1> insertelement (<vscale x 2 x i1> undef, i1 true, i32 0), <vscale x 2 x i1> undef, <vscale x 2 x i32> zeroinitializer), i32 %13), !tbaa !12
  %index.next = add i64 %index, %2
  %14 = icmp eq i64 %index.next, %wide.trip.count
  br i1 %14, label %for.cond.cleanup, label %vector.body, !llvm.loop !22

for.cond.cleanup:                                 ; preds = %vector.body, %entry
  ret void
}

; Function Attrs: nofree norecurse nounwind
define dso_local void @uwiden8(i32 signext %N, i8* noalias nocapture readonly %c, i64* nocapture %s, i8* noalias nocapture readonly %d) local_unnamed_addr #0 {
; CHECK-LABEL: uwiden8:
; CHECK:       # %bb.0: # %entry
; CHECK-NEXT:    addi a4, zero, 1
; CHECK-NEXT:    blt a0, a4, .LBB8_3
; CHECK-NEXT:  # %bb.1: # %for.body.preheader
; CHECK-NEXT:    mv a4, zero
; CHECK-NEXT:    slli a0, a0, 32
; CHECK-NEXT:    srli a6, a0, 32
; CHECK-NEXT:  .LBB8_2: # %vector.body
; CHECK-NEXT:    # =>This Inner Loop Header: Depth=1
; CHECK-NEXT:    add a5, a3, a4
; CHECK-NEXT:    sub a7, a6, a4
; CHECK-NEXT:    vsetvli a0, a7, e64,m1
; CHECK-NEXT:    vsetvli zero, a0, e8,m1
; CHECK-NEXT:    vle.v v1, (a5)
; CHECK-NEXT:    vwcvtu.x.x.v v2, v1
; CHECK-NEXT:    vsetvli zero, a0, e16,m1
; CHECK-NEXT:    vwcvtu.x.x.v v4, v2
; CHECK-NEXT:    vsetvli zero, a0, e32,m1
; CHECK-NEXT:    vwcvtu.x.x.v v2, v4
; CHECK-NEXT:    add a5, a1, a4
; CHECK-NEXT:    vsetvli zero, a0, e8,m1
; CHECK-NEXT:    vle.v v1, (a5)
; CHECK-NEXT:    vwcvtu.x.x.v v4, v1
; CHECK-NEXT:    vsetvli zero, a0, e16,m1
; CHECK-NEXT:    vwcvtu.x.x.v v6, v4
; CHECK-NEXT:    vsetvli zero, a0, e32,m1
; CHECK-NEXT:    vwcvtu.x.x.v v4, v6
; CHECK-NEXT:    vsetvli zero, a7, e64,m1
; CHECK-NEXT:    vadd.vv v1, v4, v2
; CHECK-NEXT:    slli a5, a4, 3
; CHECK-NEXT:    add a5, a5, a2
; CHECK-NEXT:    add a4, a4, a0
; CHECK-NEXT:    vse.v v1, (a5)
; CHECK-NEXT:    bne a4, a6, .LBB8_2
; CHECK-NEXT:  .LBB8_3: # %for.cond.cleanup
; CHECK-NEXT:    ret
entry:
  %cmp12 = icmp sgt i32 %N, 0
  br i1 %cmp12, label %for.body.preheader, label %for.cond.cleanup

for.body.preheader:                               ; preds = %entry
  %wide.trip.count = zext i32 %N to i64
  br label %vector.body

vector.body:                                      ; preds = %vector.body, %for.body.preheader
  %index = phi i64 [ 0, %for.body.preheader ], [ %index.next, %vector.body ]
  %0 = getelementptr inbounds i8, i8* %d, i64 %index
  %1 = sub i64 %wide.trip.count, %index
  %2 = call i64 @llvm.epi.vsetvl(i64 %1, i64 3, i64 0)
  %3 = bitcast i8* %0 to <vscale x 1 x i8>*
  %4 = trunc i64 %2 to i32
  %vp.op.load = call <vscale x 1 x i8> @llvm.vp.load.nxv1i8.p0nxv1i8(<vscale x 1 x i8>* %3, i32 1, <vscale x 1 x i1> shufflevector (<vscale x 1 x i1> insertelement (<vscale x 1 x i1> undef, i1 true, i32 0), <vscale x 1 x i1> undef, <vscale x 1 x i32> zeroinitializer), i32 %4), !tbaa !4
  %5 = trunc i64 %2 to i32
  %vp.cast = call <vscale x 1 x i64> @llvm.vp.zext.nxv1i64.nxv1i8(<vscale x 1 x i8> %vp.op.load, <vscale x 1 x i1> shufflevector (<vscale x 1 x i1> insertelement (<vscale x 1 x i1> undef, i1 true, i32 0), <vscale x 1 x i1> undef, <vscale x 1 x i32> zeroinitializer), i32 %5)
  %6 = getelementptr inbounds i8, i8* %c, i64 %index
  %7 = bitcast i8* %6 to <vscale x 1 x i8>*
  %8 = trunc i64 %2 to i32
  %vp.op.load20 = call <vscale x 1 x i8> @llvm.vp.load.nxv1i8.p0nxv1i8(<vscale x 1 x i8>* %7, i32 1, <vscale x 1 x i1> shufflevector (<vscale x 1 x i1> insertelement (<vscale x 1 x i1> undef, i1 true, i32 0), <vscale x 1 x i1> undef, <vscale x 1 x i32> zeroinitializer), i32 %8), !tbaa !4
  %9 = trunc i64 %2 to i32
  %vp.cast23 = call <vscale x 1 x i64> @llvm.vp.zext.nxv1i64.nxv1i8(<vscale x 1 x i8> %vp.op.load20, <vscale x 1 x i1> shufflevector (<vscale x 1 x i1> insertelement (<vscale x 1 x i1> undef, i1 true, i32 0), <vscale x 1 x i1> undef, <vscale x 1 x i32> zeroinitializer), i32 %9)
  %10 = trunc i64 %2 to i32
  %vp.op = call <vscale x 1 x i64> @llvm.vp.add.nxv1i64(<vscale x 1 x i64> %vp.cast23, <vscale x 1 x i64> %vp.cast, <vscale x 1 x i1> shufflevector (<vscale x 1 x i1> insertelement (<vscale x 1 x i1> undef, i1 true, i32 0), <vscale x 1 x i1> undef, <vscale x 1 x i32> zeroinitializer), i32 %10)
  %11 = getelementptr inbounds i64, i64* %s, i64 %index
  %12 = bitcast i64* %11 to <vscale x 1 x i64>*
  %13 = trunc i64 %2 to i32
  call void @llvm.vp.store.nxv1i64.p0nxv1i64(<vscale x 1 x i64> %vp.op, <vscale x 1 x i64>* %12, i32 8, <vscale x 1 x i1> shufflevector (<vscale x 1 x i1> insertelement (<vscale x 1 x i1> undef, i1 true, i32 0), <vscale x 1 x i1> undef, <vscale x 1 x i32> zeroinitializer), i32 %13), !tbaa !15
  %index.next = add i64 %index, %2
  %14 = icmp eq i64 %index.next, %wide.trip.count
  br i1 %14, label %for.cond.cleanup, label %vector.body, !llvm.loop !23

for.cond.cleanup:                                 ; preds = %vector.body, %entry
  ret void
}

; Function Attrs: nofree norecurse nounwind
define dso_local void @unarrow2(i32 signext %N, i16* noalias nocapture readonly %c, i8* nocapture %s, i16* noalias nocapture readonly %d) local_unnamed_addr #0 {
; CHECK-LABEL: unarrow2:
; CHECK:       # %bb.0: # %entry
; CHECK-NEXT:    addi a4, zero, 1
; CHECK-NEXT:    blt a0, a4, .LBB9_3
; CHECK-NEXT:  # %bb.1: # %for.body.preheader
; CHECK-NEXT:    mv a4, zero
; CHECK-NEXT:    slli a0, a0, 32
; CHECK-NEXT:    srli a6, a0, 32
; CHECK-NEXT:  .LBB9_2: # %vector.body
; CHECK-NEXT:    # =>This Inner Loop Header: Depth=1
; CHECK-NEXT:    slli t0, a4, 1
; CHECK-NEXT:    add a7, a3, t0
; CHECK-NEXT:    sub a0, a6, a4
; CHECK-NEXT:    vsetvli a5, a0, e16,m1
; CHECK-NEXT:    vle.v v2, (a7)
; CHECK-NEXT:    vsetvli zero, a5, e8,m1
; CHECK-NEXT:    vnsrl.vi v1, v2, 0
; CHECK-NEXT:    add a7, a1, t0
; CHECK-NEXT:    vsetvli zero, a0, e16,m1
; CHECK-NEXT:    vle.v v2, (a7)
; CHECK-NEXT:    vsetvli zero, a5, e8,m1
; CHECK-NEXT:    vnsrl.vi v4, v2, 0
; CHECK-NEXT:    vadd.vv v1, v4, v1
; CHECK-NEXT:    add a0, a2, a4
; CHECK-NEXT:    add a4, a4, a5
; CHECK-NEXT:    vse.v v1, (a0)
; CHECK-NEXT:    bne a4, a6, .LBB9_2
; CHECK-NEXT:  .LBB9_3: # %for.cond.cleanup
; CHECK-NEXT:    ret
entry:
  %cmp12 = icmp sgt i32 %N, 0
  br i1 %cmp12, label %for.body.preheader, label %for.cond.cleanup

for.body.preheader:                               ; preds = %entry
  %wide.trip.count = zext i32 %N to i64
  br label %vector.body

vector.body:                                      ; preds = %vector.body, %for.body.preheader
  %index = phi i64 [ 0, %for.body.preheader ], [ %index.next, %vector.body ]
  %0 = getelementptr inbounds i16, i16* %d, i64 %index
  %1 = sub i64 %wide.trip.count, %index
  %2 = call i64 @llvm.epi.vsetvl(i64 %1, i64 1, i64 0)
  %3 = bitcast i16* %0 to <vscale x 4 x i16>*
  %4 = trunc i64 %2 to i32
  %vp.op.load = call <vscale x 4 x i16> @llvm.vp.load.nxv4i16.p0nxv4i16(<vscale x 4 x i16>* %3, i32 2, <vscale x 4 x i1> shufflevector (<vscale x 4 x i1> insertelement (<vscale x 4 x i1> undef, i1 true, i32 0), <vscale x 4 x i1> undef, <vscale x 4 x i32> zeroinitializer), i32 %4), !tbaa !7
  %5 = trunc i64 %2 to i32
  %vp.cast = call <vscale x 4 x i8> @llvm.vp.trunc.nxv4i8.nxv4i16(<vscale x 4 x i16> %vp.op.load, <vscale x 4 x i1> shufflevector (<vscale x 4 x i1> insertelement (<vscale x 4 x i1> undef, i1 true, i32 0), <vscale x 4 x i1> undef, <vscale x 4 x i32> zeroinitializer), i32 %5)
  %6 = getelementptr inbounds i16, i16* %c, i64 %index
  %7 = bitcast i16* %6 to <vscale x 4 x i16>*
  %8 = trunc i64 %2 to i32
  %vp.op.load20 = call <vscale x 4 x i16> @llvm.vp.load.nxv4i16.p0nxv4i16(<vscale x 4 x i16>* %7, i32 2, <vscale x 4 x i1> shufflevector (<vscale x 4 x i1> insertelement (<vscale x 4 x i1> undef, i1 true, i32 0), <vscale x 4 x i1> undef, <vscale x 4 x i32> zeroinitializer), i32 %8), !tbaa !7
  %9 = trunc i64 %2 to i32
  %vp.cast23 = call <vscale x 4 x i8> @llvm.vp.trunc.nxv4i8.nxv4i16(<vscale x 4 x i16> %vp.op.load20, <vscale x 4 x i1> shufflevector (<vscale x 4 x i1> insertelement (<vscale x 4 x i1> undef, i1 true, i32 0), <vscale x 4 x i1> undef, <vscale x 4 x i32> zeroinitializer), i32 %9)
  %10 = trunc i64 %2 to i32
  %vp.op = call <vscale x 4 x i8> @llvm.vp.add.nxv4i8(<vscale x 4 x i8> %vp.cast23, <vscale x 4 x i8> %vp.cast, <vscale x 4 x i1> shufflevector (<vscale x 4 x i1> insertelement (<vscale x 4 x i1> undef, i1 true, i32 0), <vscale x 4 x i1> undef, <vscale x 4 x i32> zeroinitializer), i32 %10)
  %11 = getelementptr inbounds i8, i8* %s, i64 %index
  %12 = bitcast i8* %11 to <vscale x 4 x i8>*
  %13 = trunc i64 %2 to i32
  call void @llvm.vp.store.nxv4i8.p0nxv4i8(<vscale x 4 x i8> %vp.op, <vscale x 4 x i8>* %12, i32 1, <vscale x 4 x i1> shufflevector (<vscale x 4 x i1> insertelement (<vscale x 4 x i1> undef, i1 true, i32 0), <vscale x 4 x i1> undef, <vscale x 4 x i32> zeroinitializer), i32 %13), !tbaa !4
  %index.next = add i64 %index, %2
  %14 = icmp eq i64 %index.next, %wide.trip.count
  br i1 %14, label %for.cond.cleanup, label %vector.body, !llvm.loop !24

for.cond.cleanup:                                 ; preds = %vector.body, %entry
  ret void
}

; Function Attrs: nofree norecurse nounwind
define dso_local void @unarrow4(i32 signext %N, i32* noalias nocapture readonly %c, i8* nocapture %s, i32* noalias nocapture readonly %d) local_unnamed_addr #0 {
; CHECK-LABEL: unarrow4:
; CHECK:       # %bb.0: # %entry
; CHECK-NEXT:    addi a4, zero, 1
; CHECK-NEXT:    blt a0, a4, .LBB10_3
; CHECK-NEXT:  # %bb.1: # %for.body.preheader
; CHECK-NEXT:    mv a4, zero
; CHECK-NEXT:    slli a0, a0, 32
; CHECK-NEXT:    srli a6, a0, 32
; CHECK-NEXT:  .LBB10_2: # %vector.body
; CHECK-NEXT:    # =>This Inner Loop Header: Depth=1
; CHECK-NEXT:    slli a5, a4, 2
; CHECK-NEXT:    add a7, a3, a5
; CHECK-NEXT:    sub a0, a6, a4
; CHECK-NEXT:    vsetvli a0, a0, e32,m1
; CHECK-NEXT:    vle.v v1, (a7)
; CHECK-NEXT:    add a5, a5, a1
; CHECK-NEXT:    vle.v v2, (a5)
; CHECK-NEXT:    vadd.vv v2, v2, v1
; CHECK-NEXT:    vsetvli zero, a0, e16,m1
; CHECK-NEXT:    vnsrl.vi v4, v2, 0
; CHECK-NEXT:    vsetvli zero, a0, e8,m1
; CHECK-NEXT:    vnsrl.vi v1, v4, 0
; CHECK-NEXT:    add a5, a2, a4
; CHECK-NEXT:    add a4, a4, a0
; CHECK-NEXT:    vse.v v1, (a5)
; CHECK-NEXT:    bne a4, a6, .LBB10_2
; CHECK-NEXT:  .LBB10_3: # %for.cond.cleanup
; CHECK-NEXT:    ret
entry:
  %cmp10 = icmp sgt i32 %N, 0
  br i1 %cmp10, label %for.body.preheader, label %for.cond.cleanup

for.body.preheader:                               ; preds = %entry
  %wide.trip.count = zext i32 %N to i64
  br label %vector.body

vector.body:                                      ; preds = %vector.body, %for.body.preheader
  %index = phi i64 [ 0, %for.body.preheader ], [ %index.next, %vector.body ]
  %0 = getelementptr inbounds i32, i32* %d, i64 %index
  %1 = sub i64 %wide.trip.count, %index
  %2 = call i64 @llvm.epi.vsetvl(i64 %1, i64 2, i64 0)
  %3 = bitcast i32* %0 to <vscale x 2 x i32>*
  %4 = trunc i64 %2 to i32
  %vp.op.load = call <vscale x 2 x i32> @llvm.vp.load.nxv2i32.p0nxv2i32(<vscale x 2 x i32>* %3, i32 4, <vscale x 2 x i1> shufflevector (<vscale x 2 x i1> insertelement (<vscale x 2 x i1> undef, i1 true, i32 0), <vscale x 2 x i1> undef, <vscale x 2 x i32> zeroinitializer), i32 %4), !tbaa !12
  %5 = getelementptr inbounds i32, i32* %c, i64 %index
  %6 = bitcast i32* %5 to <vscale x 2 x i32>*
  %7 = trunc i64 %2 to i32
  %vp.op.load16 = call <vscale x 2 x i32> @llvm.vp.load.nxv2i32.p0nxv2i32(<vscale x 2 x i32>* %6, i32 4, <vscale x 2 x i1> shufflevector (<vscale x 2 x i1> insertelement (<vscale x 2 x i1> undef, i1 true, i32 0), <vscale x 2 x i1> undef, <vscale x 2 x i32> zeroinitializer), i32 %7), !tbaa !12
  %8 = trunc i64 %2 to i32
  %vp.op = call <vscale x 2 x i32> @llvm.vp.add.nxv2i32(<vscale x 2 x i32> %vp.op.load16, <vscale x 2 x i32> %vp.op.load, <vscale x 2 x i1> shufflevector (<vscale x 2 x i1> insertelement (<vscale x 2 x i1> undef, i1 true, i32 0), <vscale x 2 x i1> undef, <vscale x 2 x i32> zeroinitializer), i32 %8)
  %9 = trunc i64 %2 to i32
  %vp.cast = call <vscale x 2 x i8> @llvm.vp.trunc.nxv2i8.nxv2i32(<vscale x 2 x i32> %vp.op, <vscale x 2 x i1> shufflevector (<vscale x 2 x i1> insertelement (<vscale x 2 x i1> undef, i1 true, i32 0), <vscale x 2 x i1> undef, <vscale x 2 x i32> zeroinitializer), i32 %9)
  %10 = getelementptr inbounds i8, i8* %s, i64 %index
  %11 = bitcast i8* %10 to <vscale x 2 x i8>*
  %12 = trunc i64 %2 to i32
  call void @llvm.vp.store.nxv2i8.p0nxv2i8(<vscale x 2 x i8> %vp.cast, <vscale x 2 x i8>* %11, i32 1, <vscale x 2 x i1> shufflevector (<vscale x 2 x i1> insertelement (<vscale x 2 x i1> undef, i1 true, i32 0), <vscale x 2 x i1> undef, <vscale x 2 x i32> zeroinitializer), i32 %12), !tbaa !4
  %index.next = add i64 %index, %2
  %13 = icmp eq i64 %index.next, %wide.trip.count
  br i1 %13, label %for.cond.cleanup, label %vector.body, !llvm.loop !25

for.cond.cleanup:                                 ; preds = %vector.body, %entry
  ret void
}

; Function Attrs: nofree norecurse nounwind
define dso_local void @unarrow8(i32 signext %N, i64* noalias nocapture readonly %c, i8* nocapture %s, i64* noalias nocapture readonly %d) local_unnamed_addr #0 {
; CHECK-LABEL: unarrow8:
; CHECK:       # %bb.0: # %entry
; CHECK-NEXT:    addi a4, zero, 1
; CHECK-NEXT:    blt a0, a4, .LBB11_3
; CHECK-NEXT:  # %bb.1: # %for.body.preheader
; CHECK-NEXT:    mv a4, zero
; CHECK-NEXT:    slli a0, a0, 32
; CHECK-NEXT:    srli a6, a0, 32
; CHECK-NEXT:  .LBB11_2: # %vector.body
; CHECK-NEXT:    # =>This Inner Loop Header: Depth=1
; CHECK-NEXT:    slli a5, a4, 3
; CHECK-NEXT:    add a7, a3, a5
; CHECK-NEXT:    sub a0, a6, a4
; CHECK-NEXT:    vsetvli a0, a0, e64,m1
; CHECK-NEXT:    vle.v v1, (a7)
; CHECK-NEXT:    add a5, a5, a1
; CHECK-NEXT:    vle.v v2, (a5)
; CHECK-NEXT:    vadd.vv v2, v2, v1
; CHECK-NEXT:    vsetvli zero, a0, e32,m1
; CHECK-NEXT:    vnsrl.vi v4, v2, 0
; CHECK-NEXT:    vsetvli zero, a0, e16,m1
; CHECK-NEXT:    vnsrl.vi v2, v4, 0
; CHECK-NEXT:    vsetvli zero, a0, e8,m1
; CHECK-NEXT:    vnsrl.vi v1, v2, 0
; CHECK-NEXT:    add a5, a2, a4
; CHECK-NEXT:    add a4, a4, a0
; CHECK-NEXT:    vse.v v1, (a5)
; CHECK-NEXT:    bne a4, a6, .LBB11_2
; CHECK-NEXT:  .LBB11_3: # %for.cond.cleanup
; CHECK-NEXT:    ret
entry:
  %cmp10 = icmp sgt i32 %N, 0
  br i1 %cmp10, label %for.body.preheader, label %for.cond.cleanup

for.body.preheader:                               ; preds = %entry
  %wide.trip.count = zext i32 %N to i64
  br label %vector.body

vector.body:                                      ; preds = %vector.body, %for.body.preheader
  %index = phi i64 [ 0, %for.body.preheader ], [ %index.next, %vector.body ]
  %0 = getelementptr inbounds i64, i64* %d, i64 %index
  %1 = sub i64 %wide.trip.count, %index
  %2 = call i64 @llvm.epi.vsetvl(i64 %1, i64 3, i64 0)
  %3 = bitcast i64* %0 to <vscale x 1 x i64>*
  %4 = trunc i64 %2 to i32
  %vp.op.load = call <vscale x 1 x i64> @llvm.vp.load.nxv1i64.p0nxv1i64(<vscale x 1 x i64>* %3, i32 8, <vscale x 1 x i1> shufflevector (<vscale x 1 x i1> insertelement (<vscale x 1 x i1> undef, i1 true, i32 0), <vscale x 1 x i1> undef, <vscale x 1 x i32> zeroinitializer), i32 %4), !tbaa !15
  %5 = getelementptr inbounds i64, i64* %c, i64 %index
  %6 = bitcast i64* %5 to <vscale x 1 x i64>*
  %7 = trunc i64 %2 to i32
  %vp.op.load16 = call <vscale x 1 x i64> @llvm.vp.load.nxv1i64.p0nxv1i64(<vscale x 1 x i64>* %6, i32 8, <vscale x 1 x i1> shufflevector (<vscale x 1 x i1> insertelement (<vscale x 1 x i1> undef, i1 true, i32 0), <vscale x 1 x i1> undef, <vscale x 1 x i32> zeroinitializer), i32 %7), !tbaa !15
  %8 = trunc i64 %2 to i32
  %vp.op = call <vscale x 1 x i64> @llvm.vp.add.nxv1i64(<vscale x 1 x i64> %vp.op.load16, <vscale x 1 x i64> %vp.op.load, <vscale x 1 x i1> shufflevector (<vscale x 1 x i1> insertelement (<vscale x 1 x i1> undef, i1 true, i32 0), <vscale x 1 x i1> undef, <vscale x 1 x i32> zeroinitializer), i32 %8)
  %9 = trunc i64 %2 to i32
  %vp.cast = call <vscale x 1 x i8> @llvm.vp.trunc.nxv1i8.nxv1i64(<vscale x 1 x i64> %vp.op, <vscale x 1 x i1> shufflevector (<vscale x 1 x i1> insertelement (<vscale x 1 x i1> undef, i1 true, i32 0), <vscale x 1 x i1> undef, <vscale x 1 x i32> zeroinitializer), i32 %9)
  %10 = getelementptr inbounds i8, i8* %s, i64 %index
  %11 = bitcast i8* %10 to <vscale x 1 x i8>*
  %12 = trunc i64 %2 to i32
  call void @llvm.vp.store.nxv1i8.p0nxv1i8(<vscale x 1 x i8> %vp.cast, <vscale x 1 x i8>* %11, i32 1, <vscale x 1 x i1> shufflevector (<vscale x 1 x i1> insertelement (<vscale x 1 x i1> undef, i1 true, i32 0), <vscale x 1 x i1> undef, <vscale x 1 x i32> zeroinitializer), i32 %12), !tbaa !4
  %index.next = add i64 %index, %2
  %13 = icmp eq i64 %index.next, %wide.trip.count
  br i1 %13, label %for.cond.cleanup, label %vector.body, !llvm.loop !26

for.cond.cleanup:                                 ; preds = %vector.body, %entry
  ret void
}

; Function Attrs: nounwind readnone
declare i64 @llvm.epi.vsetvl(i64, i64, i64) #1

; Function Attrs: argmemonly nosync nounwind readonly willreturn
declare <vscale x 4 x i8> @llvm.vp.load.nxv4i8.p0nxv4i8(<vscale x 4 x i8>* nocapture, i32 immarg, <vscale x 4 x i1>, i32) #2

; Function Attrs: nounwind readnone willreturn
declare <vscale x 4 x i16> @llvm.vp.sext.nxv4i16.nxv4i8(<vscale x 4 x i8>, <vscale x 4 x i1>, i32) #3

; Function Attrs: nofree nosync nounwind readnone speculatable willreturn
declare <vscale x 4 x i16> @llvm.vp.add.nxv4i16(<vscale x 4 x i16>, <vscale x 4 x i16>, <vscale x 4 x i1>, i32) #4

; Function Attrs: argmemonly nosync nounwind willreturn writeonly
declare void @llvm.vp.store.nxv4i16.p0nxv4i16(<vscale x 4 x i16>, <vscale x 4 x i16>* nocapture, i32 immarg, <vscale x 4 x i1>, i32) #5

; Function Attrs: argmemonly nosync nounwind readonly willreturn
declare <vscale x 2 x i8> @llvm.vp.load.nxv2i8.p0nxv2i8(<vscale x 2 x i8>* nocapture, i32 immarg, <vscale x 2 x i1>, i32) #2

; Function Attrs: nounwind readnone willreturn
declare <vscale x 2 x i32> @llvm.vp.sext.nxv2i32.nxv2i8(<vscale x 2 x i8>, <vscale x 2 x i1>, i32) #3

; Function Attrs: nofree nosync nounwind readnone speculatable willreturn
declare <vscale x 2 x i32> @llvm.vp.add.nxv2i32(<vscale x 2 x i32>, <vscale x 2 x i32>, <vscale x 2 x i1>, i32) #4

; Function Attrs: argmemonly nosync nounwind willreturn writeonly
declare void @llvm.vp.store.nxv2i32.p0nxv2i32(<vscale x 2 x i32>, <vscale x 2 x i32>* nocapture, i32 immarg, <vscale x 2 x i1>, i32) #5

; Function Attrs: argmemonly nosync nounwind readonly willreturn
declare <vscale x 1 x i8> @llvm.vp.load.nxv1i8.p0nxv1i8(<vscale x 1 x i8>* nocapture, i32 immarg, <vscale x 1 x i1>, i32) #2

; Function Attrs: nounwind readnone willreturn
declare <vscale x 1 x i64> @llvm.vp.sext.nxv1i64.nxv1i8(<vscale x 1 x i8>, <vscale x 1 x i1>, i32) #3

; Function Attrs: nofree nosync nounwind readnone speculatable willreturn
declare <vscale x 1 x i64> @llvm.vp.add.nxv1i64(<vscale x 1 x i64>, <vscale x 1 x i64>, <vscale x 1 x i1>, i32) #4

; Function Attrs: argmemonly nosync nounwind willreturn writeonly
declare void @llvm.vp.store.nxv1i64.p0nxv1i64(<vscale x 1 x i64>, <vscale x 1 x i64>* nocapture, i32 immarg, <vscale x 1 x i1>, i32) #5

; Function Attrs: argmemonly nosync nounwind readonly willreturn
declare <vscale x 4 x i16> @llvm.vp.load.nxv4i16.p0nxv4i16(<vscale x 4 x i16>* nocapture, i32 immarg, <vscale x 4 x i1>, i32) #2

; Function Attrs: nounwind readnone willreturn
declare <vscale x 4 x i8> @llvm.vp.trunc.nxv4i8.nxv4i16(<vscale x 4 x i16>, <vscale x 4 x i1>, i32) #3

; Function Attrs: nofree nosync nounwind readnone speculatable willreturn
declare <vscale x 4 x i8> @llvm.vp.add.nxv4i8(<vscale x 4 x i8>, <vscale x 4 x i8>, <vscale x 4 x i1>, i32) #4

; Function Attrs: argmemonly nosync nounwind willreturn writeonly
declare void @llvm.vp.store.nxv4i8.p0nxv4i8(<vscale x 4 x i8>, <vscale x 4 x i8>* nocapture, i32 immarg, <vscale x 4 x i1>, i32) #5

; Function Attrs: argmemonly nosync nounwind readonly willreturn
declare <vscale x 2 x i32> @llvm.vp.load.nxv2i32.p0nxv2i32(<vscale x 2 x i32>* nocapture, i32 immarg, <vscale x 2 x i1>, i32) #2

; Function Attrs: nounwind readnone willreturn
declare <vscale x 2 x i8> @llvm.vp.trunc.nxv2i8.nxv2i32(<vscale x 2 x i32>, <vscale x 2 x i1>, i32) #3

; Function Attrs: argmemonly nosync nounwind willreturn writeonly
declare void @llvm.vp.store.nxv2i8.p0nxv2i8(<vscale x 2 x i8>, <vscale x 2 x i8>* nocapture, i32 immarg, <vscale x 2 x i1>, i32) #5

; Function Attrs: argmemonly nosync nounwind readonly willreturn
declare <vscale x 1 x i64> @llvm.vp.load.nxv1i64.p0nxv1i64(<vscale x 1 x i64>* nocapture, i32 immarg, <vscale x 1 x i1>, i32) #2

; Function Attrs: nounwind readnone willreturn
declare <vscale x 1 x i8> @llvm.vp.trunc.nxv1i8.nxv1i64(<vscale x 1 x i64>, <vscale x 1 x i1>, i32) #3

; Function Attrs: argmemonly nosync nounwind willreturn writeonly
declare void @llvm.vp.store.nxv1i8.p0nxv1i8(<vscale x 1 x i8>, <vscale x 1 x i8>* nocapture, i32 immarg, <vscale x 1 x i1>, i32) #5

; Function Attrs: nounwind readnone willreturn
declare <vscale x 4 x i16> @llvm.vp.zext.nxv4i16.nxv4i8(<vscale x 4 x i8>, <vscale x 4 x i1>, i32) #3

; Function Attrs: nounwind readnone willreturn
declare <vscale x 2 x i32> @llvm.vp.zext.nxv2i32.nxv2i8(<vscale x 2 x i8>, <vscale x 2 x i1>, i32) #3

; Function Attrs: nounwind readnone willreturn
declare <vscale x 1 x i64> @llvm.vp.zext.nxv1i64.nxv1i8(<vscale x 1 x i8>, <vscale x 1 x i1>, i32) #3

attributes #0 = { nofree norecurse nounwind "disable-tail-calls"="false" "frame-pointer"="none" "less-precise-fpmad"="false" "min-legal-vector-width"="0" "no-infs-fp-math"="false" "no-jump-tables"="false" "no-nans-fp-math"="false" "no-signed-zeros-fp-math"="false" "no-trapping-math"="true" "stack-protector-buffer-size"="8" "target-features"="+a,+c,+d,+experimental-v,+experimental-zvlsseg,+f,+m,+only-lmul1,-relax,-save-restore" "unsafe-fp-math"="false" "use-soft-float"="false" }
attributes #1 = { nounwind readnone }
attributes #2 = { argmemonly nosync nounwind readonly willreturn }
attributes #3 = { nounwind readnone willreturn }
attributes #4 = { nofree nosync nounwind readnone speculatable willreturn }
attributes #5 = { argmemonly nosync nounwind willreturn writeonly }

!llvm.module.flags = !{!0, !1, !2}
!llvm.ident = !{!3}

!0 = !{i32 1, !"wchar_size", i32 4}
!1 = !{i32 1, !"target-abi", !"lp64d"}
!2 = !{i32 1, !"SmallDataLimit", i32 8}
!3 = !{!"clang version 12.0.0"}
!4 = !{!5, !5, i64 0}
!5 = !{!"omnipotent char", !6, i64 0}
!6 = !{!"Simple C/C++ TBAA"}
!7 = !{!8, !8, i64 0}
!8 = !{!"short", !5, i64 0}
!9 = distinct !{!9, !10, !11}
!10 = !{!"llvm.loop.mustprogress"}
!11 = !{!"llvm.loop.isvectorized", i32 1}
!12 = !{!13, !13, i64 0}
!13 = !{!"int", !5, i64 0}
!14 = distinct !{!14, !10, !11}
!15 = !{!16, !16, i64 0}
!16 = !{!"long", !5, i64 0}
!17 = distinct !{!17, !10, !11}
!18 = distinct !{!18, !10, !11}
!19 = distinct !{!19, !10, !11}
!20 = distinct !{!20, !10, !11}
!21 = distinct !{!21, !10, !11}
!22 = distinct !{!22, !10, !11}
!23 = distinct !{!23, !10, !11}
!24 = distinct !{!24, !10, !11}
!25 = distinct !{!25, !10, !11}
!26 = distinct !{!26, !10, !11}
