; NOTE: Assertions have been autogenerated by utils/update_test_checks.py
; RUN: opt -mtriple riscv64 -mattr +m,+a,+f,+d,+experimental-v -prefer-predicate-over-epilogue=predicate-dont-vectorize -S -O2 < %s  -o - | FileCheck %s
; ModuleID = './scatter-vpred.c'
source_filename = "./scatter-vpred.c"
target datalayout = "e-m:e-p:64:64-i64:64-i128:128-n64-S128-v128:128:128-v256:128:128-v512:128:128-v1024:128:128"
target triple = "riscv64-unknown-linux-gnu"

; Function Attrs: nofree norecurse nounwind
define dso_local void @simple_add(i32 signext %N, i64* noalias nocapture %isA, i64* noalias nocapture readonly %B) local_unnamed_addr {
; CHECK-LABEL: @simple_add(
; CHECK-NEXT:  entry:
; CHECK-NEXT:    [[CMP5:%.*]] = icmp sgt i32 [[N:%.*]], 0
; CHECK-NEXT:    br i1 [[CMP5]], label [[FOR_BODY_PREHEADER:%.*]], label [[FOR_COND_CLEANUP:%.*]]
; CHECK:       for.body.preheader:
; CHECK-NEXT:    [[WIDE_TRIP_COUNT:%.*]] = zext i32 [[N]] to i64
; CHECK-NEXT:    [[DOTSPLATINSERT:%.*]] = insertelement <vscale x 1 x i64*> undef, i64* [[ISA:%.*]], i32 0
; CHECK-NEXT:    [[DOTSPLAT:%.*]] = shufflevector <vscale x 1 x i64*> [[DOTSPLATINSERT]], <vscale x 1 x i64*> undef, <vscale x 1 x i32> zeroinitializer
; CHECK-NEXT:    br label [[VECTOR_BODY:%.*]]
; CHECK:       vector.body:
; CHECK-NEXT:    [[INDEX:%.*]] = phi i64 [ 0, [[FOR_BODY_PREHEADER]] ], [ [[INDEX_NEXT:%.*]], [[VECTOR_BODY]] ]
; CHECK-NEXT:    [[TMP0:%.*]] = getelementptr inbounds i64, i64* [[B:%.*]], i64 [[INDEX]]
; CHECK-NEXT:    [[TMP1:%.*]] = sub i64 [[WIDE_TRIP_COUNT]], [[INDEX]]
; CHECK-NEXT:    [[TMP2:%.*]] = call i64 @llvm.epi.vsetvl(i64 [[TMP1]], i64 3, i64 0)
; CHECK-NEXT:    [[TMP3:%.*]] = trunc i64 [[TMP2]] to i32
; CHECK-NEXT:    [[TMP4:%.*]] = bitcast i64* [[TMP0]] to <vscale x 1 x i64>*
; CHECK-NEXT:    [[VP_OP_LOAD:%.*]] = call <vscale x 1 x i64> @llvm.vp.load.nxv1i64.p0nxv1i64(<vscale x 1 x i64>* [[TMP4]], i32 8, <vscale x 1 x i1> shufflevector (<vscale x 1 x i1> insertelement (<vscale x 1 x i1> undef, i1 true, i32 0), <vscale x 1 x i1> undef, <vscale x 1 x i32> zeroinitializer), i32 [[TMP3]])
; CHECK-NEXT:    [[TMP5:%.*]] = call <vscale x 1 x i64> @llvm.vp.shl.nxv1i64(<vscale x 1 x i64> [[VP_OP_LOAD]], <vscale x 1 x i64> shufflevector (<vscale x 1 x i64> insertelement (<vscale x 1 x i64> undef, i64 3, i32 0), <vscale x 1 x i64> undef, <vscale x 1 x i32> zeroinitializer), <vscale x 1 x i1> shufflevector (<vscale x 1 x i1> insertelement (<vscale x 1 x i1> undef, i1 true, i32 0), <vscale x 1 x i1> undef, <vscale x 1 x i32> zeroinitializer), i32 [[TMP3]])
; CHECK-NEXT:    [[TMP6:%.*]] = call <vscale x 1 x i64> @llvm.vp.ptrtoint.nxv1i64.nxv1p0i64(<vscale x 1 x i64*> [[DOTSPLAT]], <vscale x 1 x i1> shufflevector (<vscale x 1 x i1> insertelement (<vscale x 1 x i1> undef, i1 true, i32 0), <vscale x 1 x i1> undef, <vscale x 1 x i32> zeroinitializer), i32 [[TMP3]])
; CHECK-NEXT:    [[TMP7:%.*]] = call <vscale x 1 x i64> @llvm.vp.add.nxv1i64(<vscale x 1 x i64> [[TMP6]], <vscale x 1 x i64> [[TMP5]], <vscale x 1 x i1> shufflevector (<vscale x 1 x i1> insertelement (<vscale x 1 x i1> undef, i1 true, i32 0), <vscale x 1 x i1> undef, <vscale x 1 x i32> zeroinitializer), i32 [[TMP3]])
; CHECK-NEXT:    [[TMP8:%.*]] = call <vscale x 1 x i64*> @llvm.vp.inttoptr.nxv1p0i64.nxv1i64(<vscale x 1 x i64> [[TMP7]], <vscale x 1 x i1> shufflevector (<vscale x 1 x i1> insertelement (<vscale x 1 x i1> undef, i1 true, i32 0), <vscale x 1 x i1> undef, <vscale x 1 x i32> zeroinitializer), i32 [[TMP3]])
; CHECK-NEXT:    call void @llvm.vp.scatter.nxv1i64.nxv1p0i64(<vscale x 1 x i64> shufflevector (<vscale x 1 x i64> insertelement (<vscale x 1 x i64> undef, i64 0, i32 0), <vscale x 1 x i64> undef, <vscale x 1 x i32> zeroinitializer), <vscale x 1 x i64*> [[TMP8]], i32 1, <vscale x 1 x i1> shufflevector (<vscale x 1 x i1> insertelement (<vscale x 1 x i1> undef, i1 true, i32 0), <vscale x 1 x i1> undef, <vscale x 1 x i32> zeroinitializer), i32 [[TMP3]])
; CHECK-NEXT:    [[TMP9:%.*]] = and i64 [[TMP2]], 4294967295
; CHECK-NEXT:    [[INDEX_NEXT]] = add i64 [[INDEX]], [[TMP9]]
; CHECK-NEXT:    [[TMP10:%.*]] = icmp eq i64 [[INDEX_NEXT]], [[WIDE_TRIP_COUNT]]
; CHECK-NEXT:    br i1 [[TMP10]], label [[FOR_COND_CLEANUP]], label [[VECTOR_BODY]], [[LOOP0:!llvm.loop !.*]]
; CHECK:       for.cond.cleanup:
; CHECK-NEXT:    ret void
;
entry:
  %cmp5 = icmp sgt i32 %N, 0
  br i1 %cmp5, label %for.body.preheader, label %for.cond.cleanup

for.body.preheader:                               ; preds = %entry
  %wide.trip.count = zext i32 %N to i64
  br label %for.body

for.cond.cleanup.loopexit:                        ; preds = %for.body
  br label %for.cond.cleanup

for.cond.cleanup:                                 ; preds = %for.cond.cleanup.loopexit, %entry
  ret void

for.body:                                         ; preds = %for.body, %for.body.preheader
  %indvars.iv = phi i64 [ 0, %for.body.preheader ], [ %indvars.iv.next, %for.body ]
  %arrayidx = getelementptr inbounds i64, i64* %B, i64 %indvars.iv
  %0 = load i64, i64* %arrayidx, align 8
  %arrayidx1 = getelementptr inbounds i64, i64* %isA, i64 %0
  store i64 0, i64* %arrayidx1, align 1
  %indvars.iv.next = add nuw nsw i64 %indvars.iv, 1
  %exitcond = icmp eq i64 %indvars.iv.next, %wide.trip.count
  br i1 %exitcond, label %for.cond.cleanup.loopexit, label %for.body
}
