; NOTE: Assertions have been autogenerated by utils/update_llc_test_checks.py
; RUN: llc -mtriple=riscv64 -mattr=+m,+a,+f,+d,+c,+experimental-v -o - < %s \
; RUN:     --verify-machineinstrs | FileCheck %s

define void @lmul1() nounwind optnone noinline {
; CHECK-LABEL: lmul1:
; CHECK:       # %bb.0:
; CHECK-NEXT:    addi sp, sp, -48
; CHECK-NEXT:    sd ra, 40(sp)
; CHECK-NEXT:    sd s0, 32(sp)
; CHECK-NEXT:    addi s0, sp, 48
; CHECK-NEXT:    rdvtype ra
; CHECK-NEXT:    rdvl t0
; CHECK-NEXT:    vsetvli a0, zero, e8,m1
; CHECK-NEXT:    vsetvl zero, t0, ra
; CHECK-NEXT:    sub sp, sp, a0
; CHECK-NEXT:    sd sp, -48(s0)
; CHECK-NEXT:    addi sp, s0, -48
; CHECK-NEXT:    ld s0, 32(sp)
; CHECK-NEXT:    ld ra, 40(sp)
; CHECK-NEXT:    addi sp, sp, 48
; CHECK-NEXT:    ret
  %v = alloca <vscale x 1 x i64>
  ret void
}
