; NOTE: Assertions have been autogenerated by utils/update_llc_test_checks.py
; RUN: llc -mtriple=riscv64 -mattr=+experimental-v -verify-machineinstrs -O0 \
; RUN:    < %s | FileCheck --check-prefix=SPILL-O0 %s
; RUN: llc -mtriple=riscv64 -mattr=+experimental-v -verify-machineinstrs -O2 \
; RUN:    < %s | FileCheck --check-prefix=SPILL-O2 %s

@.str = private unnamed_addr constant [6 x i8] c"hello\00", align 1

define <vscale x 1 x double> @foo(<vscale x 1 x double> %a, <vscale x 1 x double> %b, <vscale x 1 x double> %c, i64 %gvl) nounwind
; SPILL-O0-LABEL: foo:
; SPILL-O0:       # %bb.0:
; SPILL-O0-NEXT:    addi sp, sp, -80
; SPILL-O0-NEXT:    sd ra, 72(sp) # 8-byte Folded Spill
; SPILL-O0-NEXT:    sd s0, 64(sp) # 8-byte Folded Spill
; SPILL-O0-NEXT:    addi s0, sp, 80
; SPILL-O0-NEXT:    rdvtype ra
; SPILL-O0-NEXT:    rdvl t0
; SPILL-O0-NEXT:    vsetvli a1, zero, e8,m1
; SPILL-O0-NEXT:    vsetvl zero, t0, ra
; SPILL-O0-NEXT:    sub sp, sp, a1
; SPILL-O0-NEXT:    sd sp, -72(s0)
; SPILL-O0-NEXT:    sub sp, sp, a1
; SPILL-O0-NEXT:    sd sp, -80(s0)
; SPILL-O0-NEXT:    sd a0, -56(s0) # 8-byte Folded Spill
; SPILL-O0-NEXT:    ld a3, -72(s0)
; SPILL-O0-NEXT:    rdvtype a2
; SPILL-O0-NEXT:    rdvl a1
; SPILL-O0-NEXT:    vsetvli zero, zero, e64,m1
; SPILL-O0-NEXT:    vse.v v16, (a3)
; SPILL-O0-NEXT:    vsetvl zero, a1, a2
; SPILL-O0-NEXT:    # implicit-def: $v1
; SPILL-O0-NEXT:    vsetvli zero, a0, e64,m1
; SPILL-O0-NEXT:    vfadd.vv v1, v16, v17
; SPILL-O0-NEXT:    ld a2, -80(s0)
; SPILL-O0-NEXT:    rdvtype a1
; SPILL-O0-NEXT:    rdvl a0
; SPILL-O0-NEXT:    vsetvli zero, zero, e64,m1
; SPILL-O0-NEXT:    vse.v v1, (a2)
; SPILL-O0-NEXT:    vsetvl zero, a0, a1
; SPILL-O0-NEXT:    lui a0, %hi(.L.str)
; SPILL-O0-NEXT:    addi a0, a0, %lo(.L.str)
; SPILL-O0-NEXT:    call puts
; SPILL-O0-NEXT:    ld a3, -80(s0)
; SPILL-O0-NEXT:    rdvtype a2
; SPILL-O0-NEXT:    rdvl a1
; SPILL-O0-NEXT:    vsetvli zero, zero, e64,m1
; SPILL-O0-NEXT:    # implicit-def: $v2
; SPILL-O0-NEXT:    vle.v v2, (a3)
; SPILL-O0-NEXT:    vsetvl zero, a1, a2
; SPILL-O0-NEXT:    ld a3, -72(s0)
; SPILL-O0-NEXT:    rdvtype a2
; SPILL-O0-NEXT:    rdvl a1
; SPILL-O0-NEXT:    vsetvli zero, zero, e64,m1
; SPILL-O0-NEXT:    # implicit-def: $v1
; SPILL-O0-NEXT:    vle.v v1, (a3)
; SPILL-O0-NEXT:    vsetvl zero, a1, a2
; SPILL-O0-NEXT:    # kill: def $x11 killed $x10
; SPILL-O0-NEXT:    ld a0, -56(s0) # 8-byte Folded Reload
; SPILL-O0-NEXT:    # implicit-def: $v16
; SPILL-O0-NEXT:    vsetvli zero, a0, e64,m1
; SPILL-O0-NEXT:    vfadd.vv v16, v1, v2
; SPILL-O0-NEXT:    addi sp, s0, -80
; SPILL-O0-NEXT:    ld s0, 64(sp) # 8-byte Folded Reload
; SPILL-O0-NEXT:    ld ra, 72(sp) # 8-byte Folded Reload
; SPILL-O0-NEXT:    addi sp, sp, 80
; SPILL-O0-NEXT:    ret
;
; SPILL-O2-LABEL: foo:
; SPILL-O2:       # %bb.0:
; SPILL-O2-NEXT:    addi sp, sp, -80
; SPILL-O2-NEXT:    sd ra, 72(sp) # 8-byte Folded Spill
; SPILL-O2-NEXT:    sd s0, 64(sp) # 8-byte Folded Spill
; SPILL-O2-NEXT:    sd s1, 56(sp) # 8-byte Folded Spill
; SPILL-O2-NEXT:    addi s0, sp, 80
; SPILL-O2-NEXT:    rdvtype ra
; SPILL-O2-NEXT:    rdvl t0
; SPILL-O2-NEXT:    vsetvli a1, zero, e8,m1
; SPILL-O2-NEXT:    vsetvl zero, t0, ra
; SPILL-O2-NEXT:    sub sp, sp, a1
; SPILL-O2-NEXT:    sd sp, -72(s0)
; SPILL-O2-NEXT:    sub sp, sp, a1
; SPILL-O2-NEXT:    sd sp, -80(s0)
; SPILL-O2-NEXT:    mv s1, a0
; SPILL-O2-NEXT:    ld a3, -80(s0)
; SPILL-O2-NEXT:    rdvtype a2
; SPILL-O2-NEXT:    rdvl a1
; SPILL-O2-NEXT:    vsetvli zero, zero, e64,m1
; SPILL-O2-NEXT:    vse.v v16, (a3)
; SPILL-O2-NEXT:    vsetvl zero, a1, a2
; SPILL-O2-NEXT:    vsetvli zero, a0, e64,m1
; SPILL-O2-NEXT:    vfadd.vv v1, v16, v17
; SPILL-O2-NEXT:    ld a2, -72(s0)
; SPILL-O2-NEXT:    rdvtype a1
; SPILL-O2-NEXT:    rdvl a0
; SPILL-O2-NEXT:    vsetvli zero, zero, e64,m1
; SPILL-O2-NEXT:    vse.v v1, (a2)
; SPILL-O2-NEXT:    vsetvl zero, a0, a1
; SPILL-O2-NEXT:    lui a0, %hi(.L.str)
; SPILL-O2-NEXT:    addi a0, a0, %lo(.L.str)
; SPILL-O2-NEXT:    call puts
; SPILL-O2-NEXT:    vsetvli zero, s1, e64,m1
; SPILL-O2-NEXT:    ld a2, -72(s0)
; SPILL-O2-NEXT:    rdvtype a1
; SPILL-O2-NEXT:    rdvl a0
; SPILL-O2-NEXT:    vsetvli zero, zero, e64,m1
; SPILL-O2-NEXT:    # implicit-def: $v1
; SPILL-O2-NEXT:    vle.v v1, (a2)
; SPILL-O2-NEXT:    vsetvl zero, a0, a1
; SPILL-O2-NEXT:    ld a2, -80(s0)
; SPILL-O2-NEXT:    rdvtype a1
; SPILL-O2-NEXT:    rdvl a0
; SPILL-O2-NEXT:    vsetvli zero, zero, e64,m1
; SPILL-O2-NEXT:    # implicit-def: $v2
; SPILL-O2-NEXT:    vle.v v2, (a2)
; SPILL-O2-NEXT:    vsetvl zero, a0, a1
; SPILL-O2-NEXT:    vfadd.vv v16, v2, v1
; SPILL-O2-NEXT:    addi sp, s0, -80
; SPILL-O2-NEXT:    ld s1, 56(sp) # 8-byte Folded Reload
; SPILL-O2-NEXT:    ld s0, 64(sp) # 8-byte Folded Reload
; SPILL-O2-NEXT:    ld ra, 72(sp) # 8-byte Folded Reload
; SPILL-O2-NEXT:    addi sp, sp, 80
; SPILL-O2-NEXT:    ret
{
   %x = call <vscale x 1 x double> @llvm.epi.vfadd.nxv1f64.nxv1f64(<vscale x 1 x double> %a, <vscale x 1 x double> %b, i64 %gvl)
   %call = call signext i32 @puts(i8* getelementptr inbounds ([6 x i8], [6 x i8]* @.str, i64 0, i64 0))
   %z = call <vscale x 1 x double> @llvm.epi.vfadd.nxv1f64.nxv1f64(<vscale x 1 x double> %a, <vscale x 1 x double> %x, i64 %gvl)
   ret <vscale x 1 x double> %z
}

declare <vscale x 1 x double> @llvm.epi.vfadd.nxv1f64.nxv1f64(<vscale x 1 x double> %a, <vscale x 1 x double> %b, i64 %gvl)
declare i32 @puts(i8*);
