; NOTE: Assertions have been autogenerated by utils/update_test_checks.py
; RUN: opt -mtriple riscv64 -mattr +m,+a,+f,+d,+experimental-v \
; RUN:    -prefer-predicate-over-epilogue=predicate-dont-vectorize -S -O2 \
; RUN:    < %s -o - | FileCheck %s

define dso_local void @foo(i32* nocapture %a, i32 signext %N) {
; CHECK-LABEL: @foo(
; CHECK-NEXT:  entry:
; CHECK-NEXT:    [[CMP19:%.*]] = icmp sgt i32 [[N:%.*]], 0
; CHECK-NEXT:    br i1 [[CMP19]], label [[FOR_BODY_PREHEADER:%.*]], label [[FOR_COND_CLEANUP:%.*]]
; CHECK:       for.body.preheader:
; CHECK-NEXT:    [[WIDE_TRIP_COUNT:%.*]] = zext i32 [[N]] to i64
; CHECK-NEXT:    br label [[FOR_BODY:%.*]]
; CHECK:       for.cond.cleanup:
; CHECK-NEXT:    ret void
; CHECK:       for.body:
; CHECK-NEXT:    [[INDVARS_IV:%.*]] = phi i64 [ 0, [[FOR_BODY_PREHEADER]] ], [ [[INDVARS_IV_NEXT:%.*]], [[FOR_BODY]] ]
; CHECK-NEXT:    [[ARRAYIDX:%.*]] = getelementptr inbounds i32, i32* [[A:%.*]], i64 [[INDVARS_IV]]
; CHECK-NEXT:    [[TMP0:%.*]] = load i32, i32* [[ARRAYIDX]], align 4
; CHECK-NEXT:    [[OR7:%.*]] = tail call i32 @llvm.bswap.i32(i32 [[TMP0]])
; CHECK-NEXT:    store i32 [[OR7]], i32* [[ARRAYIDX]], align 4
; CHECK-NEXT:    [[INDVARS_IV_NEXT]] = add nuw nsw i64 [[INDVARS_IV]], 1
; CHECK-NEXT:    [[EXITCOND_NOT:%.*]] = icmp eq i64 [[INDVARS_IV_NEXT]], [[WIDE_TRIP_COUNT]]
; CHECK-NEXT:    br i1 [[EXITCOND_NOT]], label [[FOR_COND_CLEANUP]], label [[FOR_BODY]]
;
entry:
  %cmp19 = icmp sgt i32 %N, 0
  br i1 %cmp19, label %for.body.preheader, label %for.cond.cleanup

for.body.preheader:                               ; preds = %entry
  %wide.trip.count = zext i32 %N to i64
  br label %for.body

for.cond.cleanup.loopexit:                        ; preds = %for.body
  br label %for.cond.cleanup

for.cond.cleanup:                                 ; preds = %for.cond.cleanup.loopexit, %entry
  ret void

for.body:                                         ; preds = %for.body.preheader, %for.body
  %indvars.iv = phi i64 [ 0, %for.body.preheader ], [ %indvars.iv.next, %for.body ]
  %arrayidx = getelementptr inbounds i32, i32* %a, i64 %indvars.iv
  %0 = load i32, i32* %arrayidx, align 4
  %or7 = tail call i32 @llvm.bswap.i32(i32 %0)
  store i32 %or7, i32* %arrayidx, align 4
  %indvars.iv.next = add nuw nsw i64 %indvars.iv, 1
  %exitcond.not = icmp eq i64 %indvars.iv.next, %wide.trip.count
  br i1 %exitcond.not, label %for.cond.cleanup.loopexit, label %for.body
}

declare i32 @llvm.bswap.i32(i32) #1
