; NOTE: Assertions have been autogenerated by utils/update_test_checks.py
; RUN: opt < %s -mtriple riscv64 -mattr +m,+a,+f,+d,+experimental-v \
; RUN:   -prefer-predicate-over-epilogue=predicate-dont-vectorize -S \
; RUN:   -loop-vectorize -vector-register-width-factor=8 -debug-only=loop-vectorize 2>&1 \
; RUN:   | FileCheck %s
; RUN: opt < %s -mtriple riscv64 -mattr +m,+a,+f,+d,+experimental-v \
; RUN:   -prefer-predicate-over-epilogue=predicate-dont-vectorize -S \
; RUN:   -loop-vectorize -debug-only=loop-vectorize 2>&1 \
; RUN:   | FileCheck %s --check-prefix=CHECK1

;Check that register usage for VF=8 is >32, thus selecting MaxVF=4.
;void highRegUage(int N, double *restrict c, double *restrict a,
;                 double *restrict b, double *restrict e, double *restrict f,
;                 double *restrict g) {
;  int i;
;  for (i = 1; i < N + 1; i++) {
;    c[i] = a[i] + b[i];
;    e[i] = a[i] - b[i] + c[i];
;    f[i] = a[i] * b[i] + c[i] - e[i];
;    g[i] = a[i] * c[i] + b[i] + e[i] - f[i];
;  }
;}

; CHECK-LABEL: highRegUage
; CHECK: LV: The Smallest and Widest types: 64 / 64 bits.
; CHECK: LV: The Widest register safe to use is: 512 bits.
; CHECK: LV(REG): Calculating max register usage:
; CHECK: LV(REG): VF = vscale x 2
; CHECK-NEXT: LV(REG): Found max usage: 2 item
; CHECK-NEXT: LV(REG): RegisterClass: Generic::ScalarRC, 2 registers
; CHECK-NEXT: LV(REG): RegisterClass: Generic::VectorRC, 10 registers
; CHECK-NEXT: LV(REG): Found invariant usage: 1 item
; CHECK-NEXT: LV(REG): RegisterClass: Generic::VectorRC, 2 registers
; CHECK-NEXT: LV(REG): VF = vscale x 4
; CHECK-NEXT: LV(REG): Found max usage: 2 item
; CHECK-NEXT: LV(REG): RegisterClass: Generic::ScalarRC, 2 registers
; CHECK-NEXT: LV(REG): RegisterClass: Generic::VectorRC, 20 registers
; CHECK-NEXT: LV(REG): Found invariant usage: 1 item
; CHECK-NEXT: LV(REG): RegisterClass: Generic::VectorRC, 4 registers
; CHECK-NEXT: LV(REG): VF = vscale x 8
; CHECK-NEXT: LV(REG): Found max usage: 2 item
; CHECK-NEXT: LV(REG): RegisterClass: Generic::ScalarRC, 2 registers
; CHECK-NEXT: LV(REG): RegisterClass: Generic::VectorRC, 40 registers
; CHECK-NEXT: LV(REG): Found invariant usage: 1 item
; CHECK-NEXT: LV(REG): RegisterClass: Generic::VectorRC, 8 registers
; CHECK: LV: Selecting VF: vscale x 4.
;
; ModuleID = './vec-reg-usage.c'
source_filename = "./vec-reg-usage.c"
target datalayout = "e-m:e-p:64:64-i64:64-i128:128-n64-S128-v128:128:128-v256:128:128-v512:128:128-v1024:128:128"
target triple = "riscv64-unknown-linux-gnu"

; Function Attrs: nofree norecurse nounwind
define dso_local void @highRegUage(i32 signext %N, double* noalias nocapture %c, double* noalias nocapture readonly %a, double* noalias nocapture readonly %b, double* noalias nocapture %e, double* noalias nocapture %f, double* noalias nocapture %g) local_unnamed_addr {
; CHECK-LABEL: @highRegUage(
; CHECK-NEXT:  entry:
; CHECK-NEXT:    [[CMP_NOT75:%.*]] = icmp slt i32 [[N:%.*]], 1
; CHECK-NEXT:    br i1 [[CMP_NOT75]], label [[FOR_END:%.*]], label [[FOR_BODY_PREHEADER:%.*]]
; CHECK:       for.body.preheader:
; CHECK-NEXT:    [[TMP0:%.*]] = add nuw i32 [[N]], 1
; CHECK-NEXT:    [[WIDE_TRIP_COUNT:%.*]] = zext i32 [[TMP0]] to i64
; CHECK-NEXT:    [[TMP1:%.*]] = add nsw i64 [[WIDE_TRIP_COUNT]], -1
; CHECK-NEXT:    br i1 false, label [[SCALAR_PH:%.*]], label [[VECTOR_PH:%.*]]
; CHECK:       vector.ph:
; CHECK-NEXT:    [[IND_END:%.*]] = add i64 1, [[TMP1]]
; CHECK-NEXT:    [[TRIP_COUNT_MINUS_1:%.*]] = sub i64 [[TMP1]], 1
; CHECK-NEXT:    [[BROADCAST_SPLATINSERT:%.*]] = insertelement <vscale x 4 x i64> undef, i64 [[TRIP_COUNT_MINUS_1]], i32 0
; CHECK-NEXT:    [[BROADCAST_SPLAT:%.*]] = shufflevector <vscale x 4 x i64> [[BROADCAST_SPLATINSERT]], <vscale x 4 x i64> undef, <vscale x 4 x i32> zeroinitializer
; CHECK-NEXT:    br label [[VECTOR_BODY:%.*]]
; CHECK:       vector.body:
; CHECK-NEXT:    [[INDEX:%.*]] = phi i64 [ 0, [[VECTOR_PH]] ], [ [[INDEX_NEXT:%.*]], [[VECTOR_BODY]] ]
; CHECK-NEXT:    [[OFFSET_IDX:%.*]] = add i64 1, [[INDEX]]
; CHECK-NEXT:    [[BROADCAST_SPLATINSERT1:%.*]] = insertelement <vscale x 4 x i64> undef, i64 [[OFFSET_IDX]], i32 0
; CHECK-NEXT:    [[BROADCAST_SPLAT2:%.*]] = shufflevector <vscale x 4 x i64> [[BROADCAST_SPLATINSERT1]], <vscale x 4 x i64> undef, <vscale x 4 x i32> zeroinitializer
; CHECK-NEXT:    [[TMP2:%.*]] = call <vscale x 4 x i64> @llvm.experimental.vector.stepvector.nxv4i64()
; CHECK-NEXT:    [[DOTSPLATINSERT:%.*]] = insertelement <vscale x 4 x i64> undef, i64 0, i32 0
; CHECK-NEXT:    [[DOTSPLAT:%.*]] = shufflevector <vscale x 4 x i64> [[DOTSPLATINSERT]], <vscale x 4 x i64> undef, <vscale x 4 x i32> zeroinitializer
; CHECK-NEXT:    [[TMP3:%.*]] = add <vscale x 4 x i64> [[TMP2]], [[DOTSPLAT]]
; CHECK-NEXT:    [[DOTSPLATINSERT3:%.*]] = insertelement <vscale x 4 x i64> undef, i64 1, i32 0
; CHECK-NEXT:    [[DOTSPLAT4:%.*]] = shufflevector <vscale x 4 x i64> [[DOTSPLATINSERT3]], <vscale x 4 x i64> undef, <vscale x 4 x i32> zeroinitializer
; CHECK-NEXT:    [[TMP4:%.*]] = mul <vscale x 4 x i64> [[TMP3]], [[DOTSPLAT4]]
; CHECK-NEXT:    [[INDUCTION:%.*]] = add <vscale x 4 x i64> [[BROADCAST_SPLAT2]], [[TMP4]]
; CHECK-NEXT:    [[TMP5:%.*]] = add i64 [[OFFSET_IDX]], 0
; CHECK-NEXT:    [[BROADCAST_SPLATINSERT5:%.*]] = insertelement <vscale x 4 x i64> undef, i64 [[INDEX]], i32 0
; CHECK-NEXT:    [[BROADCAST_SPLAT6:%.*]] = shufflevector <vscale x 4 x i64> [[BROADCAST_SPLATINSERT5]], <vscale x 4 x i64> undef, <vscale x 4 x i32> zeroinitializer
; CHECK-NEXT:    [[STEPVECTOR:%.*]] = call <vscale x 4 x i64> @llvm.experimental.vector.stepvector.nxv4i64()
; CHECK-NEXT:    [[VEC_IV:%.*]] = add <vscale x 4 x i64> [[BROADCAST_SPLAT6]], [[STEPVECTOR]]
; CHECK-NEXT:    [[TMP6:%.*]] = icmp ule <vscale x 4 x i64> [[VEC_IV]], [[BROADCAST_SPLAT]]
; CHECK-NEXT:    [[TMP7:%.*]] = getelementptr inbounds double, double* [[A:%.*]], i64 [[TMP5]]
; CHECK-NEXT:    [[TMP8:%.*]] = sub i64 [[TMP1]], [[INDEX]]
; CHECK-NEXT:    [[TMP9:%.*]] = call i64 @llvm.epi.vsetvl(i64 [[TMP8]], i64 3, i64 2)
; CHECK-NEXT:    [[TMP10:%.*]] = trunc i64 [[TMP9]] to i32
; CHECK-NEXT:    [[TMP11:%.*]] = getelementptr inbounds double, double* [[TMP7]], i32 0
; CHECK-NEXT:    [[TMP12:%.*]] = bitcast double* [[TMP11]] to <vscale x 4 x double>*
; CHECK-NEXT:    [[DOTSPLATINSERT7:%.*]] = insertelement <vscale x 4 x i1> undef, i1 true, i32 0
; CHECK-NEXT:    [[DOTSPLAT8:%.*]] = shufflevector <vscale x 4 x i1> [[DOTSPLATINSERT7]], <vscale x 4 x i1> undef, <vscale x 4 x i32> zeroinitializer
; CHECK-NEXT:    [[VP_OP_LOAD:%.*]] = call <vscale x 4 x double> @llvm.vp.load.nxv4f64.p0nxv4f64(<vscale x 4 x double>* [[TMP12]], i32 8, <vscale x 4 x i1> [[DOTSPLAT8]], i32 [[TMP10]])
; CHECK-NEXT:    [[TMP13:%.*]] = getelementptr inbounds double, double* [[B:%.*]], i64 [[TMP5]]
; CHECK-NEXT:    [[TMP14:%.*]] = getelementptr inbounds double, double* [[TMP13]], i32 0
; CHECK-NEXT:    [[TMP15:%.*]] = bitcast double* [[TMP14]] to <vscale x 4 x double>*
; CHECK-NEXT:    [[VP_OP_LOAD11:%.*]] = call <vscale x 4 x double> @llvm.vp.load.nxv4f64.p0nxv4f64(<vscale x 4 x double>* [[TMP15]], i32 8, <vscale x 4 x i1> [[DOTSPLAT8]], i32 [[TMP10]])
; CHECK-NEXT:    [[VP_OP:%.*]] = call <vscale x 4 x double> @llvm.vp.fadd.nxv4f64(<vscale x 4 x double> [[VP_OP_LOAD]], <vscale x 4 x double> [[VP_OP_LOAD11]], metadata !"round.tonearest", metadata !"fpexcept.ignore", <vscale x 4 x i1> [[DOTSPLAT8]], i32 [[TMP10]])
; CHECK-NEXT:    [[TMP16:%.*]] = getelementptr inbounds double, double* [[C:%.*]], i64 [[TMP5]]
; CHECK-NEXT:    [[TMP17:%.*]] = getelementptr inbounds double, double* [[TMP16]], i32 0
; CHECK-NEXT:    [[TMP18:%.*]] = bitcast double* [[TMP17]] to <vscale x 4 x double>*
; CHECK-NEXT:    call void @llvm.vp.store.nxv4f64.p0nxv4f64(<vscale x 4 x double> [[VP_OP]], <vscale x 4 x double>* [[TMP18]], i32 8, <vscale x 4 x i1> [[DOTSPLAT8]], i32 [[TMP10]])
; CHECK-NEXT:    [[VP_OP18:%.*]] = call <vscale x 4 x double> @llvm.vp.fsub.nxv4f64(<vscale x 4 x double> [[VP_OP_LOAD]], <vscale x 4 x double> [[VP_OP_LOAD11]], metadata !"round.tonearest", metadata !"fpexcept.ignore", <vscale x 4 x i1> [[DOTSPLAT8]], i32 [[TMP10]])
; CHECK-NEXT:    [[VP_OP21:%.*]] = call <vscale x 4 x double> @llvm.vp.fadd.nxv4f64(<vscale x 4 x double> [[VP_OP18]], <vscale x 4 x double> [[VP_OP]], metadata !"round.tonearest", metadata !"fpexcept.ignore", <vscale x 4 x i1> [[DOTSPLAT8]], i32 [[TMP10]])
; CHECK-NEXT:    [[TMP19:%.*]] = getelementptr inbounds double, double* [[E:%.*]], i64 [[TMP5]]
; CHECK-NEXT:    [[TMP20:%.*]] = getelementptr inbounds double, double* [[TMP19]], i32 0
; CHECK-NEXT:    [[TMP21:%.*]] = bitcast double* [[TMP20]] to <vscale x 4 x double>*
; CHECK-NEXT:    call void @llvm.vp.store.nxv4f64.p0nxv4f64(<vscale x 4 x double> [[VP_OP21]], <vscale x 4 x double>* [[TMP21]], i32 8, <vscale x 4 x i1> [[DOTSPLAT8]], i32 [[TMP10]])
; CHECK-NEXT:    [[VP_OP26:%.*]] = call <vscale x 4 x double> @llvm.vp.fmul.nxv4f64(<vscale x 4 x double> [[VP_OP_LOAD]], <vscale x 4 x double> [[VP_OP_LOAD11]], metadata !"round.tonearest", metadata !"fpexcept.ignore", <vscale x 4 x i1> [[DOTSPLAT8]], i32 [[TMP10]])
; CHECK-NEXT:    [[VP_OP29:%.*]] = call <vscale x 4 x double> @llvm.vp.fadd.nxv4f64(<vscale x 4 x double> [[VP_OP26]], <vscale x 4 x double> [[VP_OP]], metadata !"round.tonearest", metadata !"fpexcept.ignore", <vscale x 4 x i1> [[DOTSPLAT8]], i32 [[TMP10]])
; CHECK-NEXT:    [[VP_OP32:%.*]] = call <vscale x 4 x double> @llvm.vp.fsub.nxv4f64(<vscale x 4 x double> [[VP_OP29]], <vscale x 4 x double> [[VP_OP21]], metadata !"round.tonearest", metadata !"fpexcept.ignore", <vscale x 4 x i1> [[DOTSPLAT8]], i32 [[TMP10]])
; CHECK-NEXT:    [[TMP22:%.*]] = getelementptr inbounds double, double* [[F:%.*]], i64 [[TMP5]]
; CHECK-NEXT:    [[TMP23:%.*]] = getelementptr inbounds double, double* [[TMP22]], i32 0
; CHECK-NEXT:    [[TMP24:%.*]] = bitcast double* [[TMP23]] to <vscale x 4 x double>*
; CHECK-NEXT:    call void @llvm.vp.store.nxv4f64.p0nxv4f64(<vscale x 4 x double> [[VP_OP32]], <vscale x 4 x double>* [[TMP24]], i32 8, <vscale x 4 x i1> [[DOTSPLAT8]], i32 [[TMP10]])
; CHECK-NEXT:    [[VP_OP37:%.*]] = call <vscale x 4 x double> @llvm.vp.fmul.nxv4f64(<vscale x 4 x double> [[VP_OP_LOAD]], <vscale x 4 x double> [[VP_OP]], metadata !"round.tonearest", metadata !"fpexcept.ignore", <vscale x 4 x i1> [[DOTSPLAT8]], i32 [[TMP10]])
; CHECK-NEXT:    [[VP_OP40:%.*]] = call <vscale x 4 x double> @llvm.vp.fadd.nxv4f64(<vscale x 4 x double> [[VP_OP_LOAD11]], <vscale x 4 x double> [[VP_OP37]], metadata !"round.tonearest", metadata !"fpexcept.ignore", <vscale x 4 x i1> [[DOTSPLAT8]], i32 [[TMP10]])
; CHECK-NEXT:    [[VP_OP43:%.*]] = call <vscale x 4 x double> @llvm.vp.fadd.nxv4f64(<vscale x 4 x double> [[VP_OP21]], <vscale x 4 x double> [[VP_OP40]], metadata !"round.tonearest", metadata !"fpexcept.ignore", <vscale x 4 x i1> [[DOTSPLAT8]], i32 [[TMP10]])
; CHECK-NEXT:    [[VP_OP46:%.*]] = call <vscale x 4 x double> @llvm.vp.fsub.nxv4f64(<vscale x 4 x double> [[VP_OP43]], <vscale x 4 x double> [[VP_OP32]], metadata !"round.tonearest", metadata !"fpexcept.ignore", <vscale x 4 x i1> [[DOTSPLAT8]], i32 [[TMP10]])
; CHECK-NEXT:    [[TMP25:%.*]] = getelementptr inbounds double, double* [[G:%.*]], i64 [[TMP5]]
; CHECK-NEXT:    [[TMP26:%.*]] = getelementptr inbounds double, double* [[TMP25]], i32 0
; CHECK-NEXT:    [[TMP27:%.*]] = bitcast double* [[TMP26]] to <vscale x 4 x double>*
; CHECK-NEXT:    call void @llvm.vp.store.nxv4f64.p0nxv4f64(<vscale x 4 x double> [[VP_OP46]], <vscale x 4 x double>* [[TMP27]], i32 8, <vscale x 4 x i1> [[DOTSPLAT8]], i32 [[TMP10]])
; CHECK-NEXT:    [[TMP28:%.*]] = zext i32 [[TMP10]] to i64
; CHECK-NEXT:    [[INDEX_NEXT]] = add i64 [[INDEX]], [[TMP28]]
; CHECK-NEXT:    [[TMP29:%.*]] = icmp eq i64 [[INDEX_NEXT]], [[TMP1]]
; CHECK-NEXT:    br i1 [[TMP29]], label [[MIDDLE_BLOCK:%.*]], label [[VECTOR_BODY]], [[LOOP0:!llvm.loop !.*]]
; CHECK:       middle.block:
; CHECK-NEXT:    br i1 true, label [[FOR_END_LOOPEXIT:%.*]], label [[SCALAR_PH]]
; CHECK:       scalar.ph:
; CHECK-NEXT:    [[BC_RESUME_VAL:%.*]] = phi i64 [ [[IND_END]], [[MIDDLE_BLOCK]] ], [ 1, [[FOR_BODY_PREHEADER]] ]
; CHECK-NEXT:    br label [[FOR_BODY:%.*]]
; CHECK:       for.body:
; CHECK-NEXT:    [[INDVARS_IV:%.*]] = phi i64 [ [[BC_RESUME_VAL]], [[SCALAR_PH]] ], [ [[INDVARS_IV_NEXT:%.*]], [[FOR_BODY]] ]
; CHECK-NEXT:    [[ARRAYIDX:%.*]] = getelementptr inbounds double, double* [[A]], i64 [[INDVARS_IV]]
; CHECK-NEXT:    [[TMP30:%.*]] = load double, double* [[ARRAYIDX]], align 8
; CHECK-NEXT:    [[ARRAYIDX2:%.*]] = getelementptr inbounds double, double* [[B]], i64 [[INDVARS_IV]]
; CHECK-NEXT:    [[TMP31:%.*]] = load double, double* [[ARRAYIDX2]], align 8
; CHECK-NEXT:    [[ADD3:%.*]] = fadd double [[TMP30]], [[TMP31]]
; CHECK-NEXT:    [[ARRAYIDX5:%.*]] = getelementptr inbounds double, double* [[C]], i64 [[INDVARS_IV]]
; CHECK-NEXT:    store double [[ADD3]], double* [[ARRAYIDX5]], align 8
; CHECK-NEXT:    [[SUB:%.*]] = fsub double [[TMP30]], [[TMP31]]
; CHECK-NEXT:    [[ADD12:%.*]] = fadd double [[SUB]], [[ADD3]]
; CHECK-NEXT:    [[ARRAYIDX14:%.*]] = getelementptr inbounds double, double* [[E]], i64 [[INDVARS_IV]]
; CHECK-NEXT:    store double [[ADD12]], double* [[ARRAYIDX14]], align 8
; CHECK-NEXT:    [[MUL:%.*]] = fmul double [[TMP30]], [[TMP31]]
; CHECK-NEXT:    [[ADD21:%.*]] = fadd double [[MUL]], [[ADD3]]
; CHECK-NEXT:    [[SUB24:%.*]] = fsub double [[ADD21]], [[ADD12]]
; CHECK-NEXT:    [[ARRAYIDX26:%.*]] = getelementptr inbounds double, double* [[F]], i64 [[INDVARS_IV]]
; CHECK-NEXT:    store double [[SUB24]], double* [[ARRAYIDX26]], align 8
; CHECK-NEXT:    [[MUL31:%.*]] = fmul double [[TMP30]], [[ADD3]]
; CHECK-NEXT:    [[ADD34:%.*]] = fadd double [[TMP31]], [[MUL31]]
; CHECK-NEXT:    [[ADD37:%.*]] = fadd double [[ADD12]], [[ADD34]]
; CHECK-NEXT:    [[SUB40:%.*]] = fsub double [[ADD37]], [[SUB24]]
; CHECK-NEXT:    [[ARRAYIDX42:%.*]] = getelementptr inbounds double, double* [[G]], i64 [[INDVARS_IV]]
; CHECK-NEXT:    store double [[SUB40]], double* [[ARRAYIDX42]], align 8
; CHECK-NEXT:    [[INDVARS_IV_NEXT]] = add nuw nsw i64 [[INDVARS_IV]], 1
; CHECK-NEXT:    [[EXITCOND_NOT:%.*]] = icmp eq i64 [[INDVARS_IV_NEXT]], [[WIDE_TRIP_COUNT]]
; CHECK-NEXT:    br i1 [[EXITCOND_NOT]], label [[FOR_END_LOOPEXIT]], label [[FOR_BODY]], [[LOOP2:!llvm.loop !.*]]
; CHECK:       for.end.loopexit:
; CHECK-NEXT:    br label [[FOR_END]]
; CHECK:       for.end:
; CHECK-NEXT:    ret void
;
; CHECK1-LABEL: @highRegUage(
; CHECK1-NEXT:  entry:
; CHECK1-NEXT:    [[CMP_NOT75:%.*]] = icmp slt i32 [[N:%.*]], 1
; CHECK1-NEXT:    br i1 [[CMP_NOT75]], label [[FOR_END:%.*]], label [[FOR_BODY_PREHEADER:%.*]]
; CHECK1:       for.body.preheader:
; CHECK1-NEXT:    [[TMP0:%.*]] = add nuw i32 [[N]], 1
; CHECK1-NEXT:    [[WIDE_TRIP_COUNT:%.*]] = zext i32 [[TMP0]] to i64
; CHECK1-NEXT:    [[TMP1:%.*]] = add nsw i64 [[WIDE_TRIP_COUNT]], -1
; CHECK1-NEXT:    br i1 false, label [[SCALAR_PH:%.*]], label [[VECTOR_PH:%.*]]
; CHECK1:       vector.ph:
; CHECK1-NEXT:    [[IND_END:%.*]] = add i64 1, [[TMP1]]
; CHECK1-NEXT:    [[TRIP_COUNT_MINUS_1:%.*]] = sub i64 [[TMP1]], 1
; CHECK1-NEXT:    [[BROADCAST_SPLATINSERT:%.*]] = insertelement <vscale x 1 x i64> undef, i64 [[TRIP_COUNT_MINUS_1]], i32 0
; CHECK1-NEXT:    [[BROADCAST_SPLAT:%.*]] = shufflevector <vscale x 1 x i64> [[BROADCAST_SPLATINSERT]], <vscale x 1 x i64> undef, <vscale x 1 x i32> zeroinitializer
; CHECK1-NEXT:    br label [[VECTOR_BODY:%.*]]
; CHECK1:       vector.body:
; CHECK1-NEXT:    [[INDEX:%.*]] = phi i64 [ 0, [[VECTOR_PH]] ], [ [[INDEX_NEXT:%.*]], [[VECTOR_BODY]] ]
; CHECK1-NEXT:    [[OFFSET_IDX:%.*]] = add i64 1, [[INDEX]]
; CHECK1-NEXT:    [[BROADCAST_SPLATINSERT1:%.*]] = insertelement <vscale x 1 x i64> undef, i64 [[OFFSET_IDX]], i32 0
; CHECK1-NEXT:    [[BROADCAST_SPLAT2:%.*]] = shufflevector <vscale x 1 x i64> [[BROADCAST_SPLATINSERT1]], <vscale x 1 x i64> undef, <vscale x 1 x i32> zeroinitializer
; CHECK1-NEXT:    [[TMP2:%.*]] = call <vscale x 1 x i64> @llvm.experimental.vector.stepvector.nxv1i64()
; CHECK1-NEXT:    [[DOTSPLATINSERT:%.*]] = insertelement <vscale x 1 x i64> undef, i64 0, i32 0
; CHECK1-NEXT:    [[DOTSPLAT:%.*]] = shufflevector <vscale x 1 x i64> [[DOTSPLATINSERT]], <vscale x 1 x i64> undef, <vscale x 1 x i32> zeroinitializer
; CHECK1-NEXT:    [[TMP3:%.*]] = add <vscale x 1 x i64> [[TMP2]], [[DOTSPLAT]]
; CHECK1-NEXT:    [[DOTSPLATINSERT3:%.*]] = insertelement <vscale x 1 x i64> undef, i64 1, i32 0
; CHECK1-NEXT:    [[DOTSPLAT4:%.*]] = shufflevector <vscale x 1 x i64> [[DOTSPLATINSERT3]], <vscale x 1 x i64> undef, <vscale x 1 x i32> zeroinitializer
; CHECK1-NEXT:    [[TMP4:%.*]] = mul <vscale x 1 x i64> [[TMP3]], [[DOTSPLAT4]]
; CHECK1-NEXT:    [[INDUCTION:%.*]] = add <vscale x 1 x i64> [[BROADCAST_SPLAT2]], [[TMP4]]
; CHECK1-NEXT:    [[TMP5:%.*]] = add i64 [[OFFSET_IDX]], 0
; CHECK1-NEXT:    [[BROADCAST_SPLATINSERT5:%.*]] = insertelement <vscale x 1 x i64> undef, i64 [[INDEX]], i32 0
; CHECK1-NEXT:    [[BROADCAST_SPLAT6:%.*]] = shufflevector <vscale x 1 x i64> [[BROADCAST_SPLATINSERT5]], <vscale x 1 x i64> undef, <vscale x 1 x i32> zeroinitializer
; CHECK1-NEXT:    [[STEPVECTOR:%.*]] = call <vscale x 1 x i64> @llvm.experimental.vector.stepvector.nxv1i64()
; CHECK1-NEXT:    [[VEC_IV:%.*]] = add <vscale x 1 x i64> [[BROADCAST_SPLAT6]], [[STEPVECTOR]]
; CHECK1-NEXT:    [[TMP6:%.*]] = icmp ule <vscale x 1 x i64> [[VEC_IV]], [[BROADCAST_SPLAT]]
; CHECK1-NEXT:    [[TMP7:%.*]] = getelementptr inbounds double, double* [[A:%.*]], i64 [[TMP5]]
; CHECK1-NEXT:    [[TMP8:%.*]] = sub i64 [[TMP1]], [[INDEX]]
; CHECK1-NEXT:    [[TMP9:%.*]] = call i64 @llvm.epi.vsetvl(i64 [[TMP8]], i64 3, i64 0)
; CHECK1-NEXT:    [[TMP10:%.*]] = trunc i64 [[TMP9]] to i32
; CHECK1-NEXT:    [[TMP11:%.*]] = getelementptr inbounds double, double* [[TMP7]], i32 0
; CHECK1-NEXT:    [[TMP12:%.*]] = bitcast double* [[TMP11]] to <vscale x 1 x double>*
; CHECK1-NEXT:    [[DOTSPLATINSERT7:%.*]] = insertelement <vscale x 1 x i1> undef, i1 true, i32 0
; CHECK1-NEXT:    [[DOTSPLAT8:%.*]] = shufflevector <vscale x 1 x i1> [[DOTSPLATINSERT7]], <vscale x 1 x i1> undef, <vscale x 1 x i32> zeroinitializer
; CHECK1-NEXT:    [[VP_OP_LOAD:%.*]] = call <vscale x 1 x double> @llvm.vp.load.nxv1f64.p0nxv1f64(<vscale x 1 x double>* [[TMP12]], i32 8, <vscale x 1 x i1> [[DOTSPLAT8]], i32 [[TMP10]])
; CHECK1-NEXT:    [[TMP13:%.*]] = getelementptr inbounds double, double* [[B:%.*]], i64 [[TMP5]]
; CHECK1-NEXT:    [[TMP14:%.*]] = getelementptr inbounds double, double* [[TMP13]], i32 0
; CHECK1-NEXT:    [[TMP15:%.*]] = bitcast double* [[TMP14]] to <vscale x 1 x double>*
; CHECK1-NEXT:    [[VP_OP_LOAD11:%.*]] = call <vscale x 1 x double> @llvm.vp.load.nxv1f64.p0nxv1f64(<vscale x 1 x double>* [[TMP15]], i32 8, <vscale x 1 x i1> [[DOTSPLAT8]], i32 [[TMP10]])
; CHECK1-NEXT:    [[VP_OP:%.*]] = call <vscale x 1 x double> @llvm.vp.fadd.nxv1f64(<vscale x 1 x double> [[VP_OP_LOAD]], <vscale x 1 x double> [[VP_OP_LOAD11]], metadata !"round.tonearest", metadata !"fpexcept.ignore", <vscale x 1 x i1> [[DOTSPLAT8]], i32 [[TMP10]])
; CHECK1-NEXT:    [[TMP16:%.*]] = getelementptr inbounds double, double* [[C:%.*]], i64 [[TMP5]]
; CHECK1-NEXT:    [[TMP17:%.*]] = getelementptr inbounds double, double* [[TMP16]], i32 0
; CHECK1-NEXT:    [[TMP18:%.*]] = bitcast double* [[TMP17]] to <vscale x 1 x double>*
; CHECK1-NEXT:    call void @llvm.vp.store.nxv1f64.p0nxv1f64(<vscale x 1 x double> [[VP_OP]], <vscale x 1 x double>* [[TMP18]], i32 8, <vscale x 1 x i1> [[DOTSPLAT8]], i32 [[TMP10]])
; CHECK1-NEXT:    [[VP_OP18:%.*]] = call <vscale x 1 x double> @llvm.vp.fsub.nxv1f64(<vscale x 1 x double> [[VP_OP_LOAD]], <vscale x 1 x double> [[VP_OP_LOAD11]], metadata !"round.tonearest", metadata !"fpexcept.ignore", <vscale x 1 x i1> [[DOTSPLAT8]], i32 [[TMP10]])
; CHECK1-NEXT:    [[VP_OP21:%.*]] = call <vscale x 1 x double> @llvm.vp.fadd.nxv1f64(<vscale x 1 x double> [[VP_OP18]], <vscale x 1 x double> [[VP_OP]], metadata !"round.tonearest", metadata !"fpexcept.ignore", <vscale x 1 x i1> [[DOTSPLAT8]], i32 [[TMP10]])
; CHECK1-NEXT:    [[TMP19:%.*]] = getelementptr inbounds double, double* [[E:%.*]], i64 [[TMP5]]
; CHECK1-NEXT:    [[TMP20:%.*]] = getelementptr inbounds double, double* [[TMP19]], i32 0
; CHECK1-NEXT:    [[TMP21:%.*]] = bitcast double* [[TMP20]] to <vscale x 1 x double>*
; CHECK1-NEXT:    call void @llvm.vp.store.nxv1f64.p0nxv1f64(<vscale x 1 x double> [[VP_OP21]], <vscale x 1 x double>* [[TMP21]], i32 8, <vscale x 1 x i1> [[DOTSPLAT8]], i32 [[TMP10]])
; CHECK1-NEXT:    [[VP_OP26:%.*]] = call <vscale x 1 x double> @llvm.vp.fmul.nxv1f64(<vscale x 1 x double> [[VP_OP_LOAD]], <vscale x 1 x double> [[VP_OP_LOAD11]], metadata !"round.tonearest", metadata !"fpexcept.ignore", <vscale x 1 x i1> [[DOTSPLAT8]], i32 [[TMP10]])
; CHECK1-NEXT:    [[VP_OP29:%.*]] = call <vscale x 1 x double> @llvm.vp.fadd.nxv1f64(<vscale x 1 x double> [[VP_OP26]], <vscale x 1 x double> [[VP_OP]], metadata !"round.tonearest", metadata !"fpexcept.ignore", <vscale x 1 x i1> [[DOTSPLAT8]], i32 [[TMP10]])
; CHECK1-NEXT:    [[VP_OP32:%.*]] = call <vscale x 1 x double> @llvm.vp.fsub.nxv1f64(<vscale x 1 x double> [[VP_OP29]], <vscale x 1 x double> [[VP_OP21]], metadata !"round.tonearest", metadata !"fpexcept.ignore", <vscale x 1 x i1> [[DOTSPLAT8]], i32 [[TMP10]])
; CHECK1-NEXT:    [[TMP22:%.*]] = getelementptr inbounds double, double* [[F:%.*]], i64 [[TMP5]]
; CHECK1-NEXT:    [[TMP23:%.*]] = getelementptr inbounds double, double* [[TMP22]], i32 0
; CHECK1-NEXT:    [[TMP24:%.*]] = bitcast double* [[TMP23]] to <vscale x 1 x double>*
; CHECK1-NEXT:    call void @llvm.vp.store.nxv1f64.p0nxv1f64(<vscale x 1 x double> [[VP_OP32]], <vscale x 1 x double>* [[TMP24]], i32 8, <vscale x 1 x i1> [[DOTSPLAT8]], i32 [[TMP10]])
; CHECK1-NEXT:    [[VP_OP37:%.*]] = call <vscale x 1 x double> @llvm.vp.fmul.nxv1f64(<vscale x 1 x double> [[VP_OP_LOAD]], <vscale x 1 x double> [[VP_OP]], metadata !"round.tonearest", metadata !"fpexcept.ignore", <vscale x 1 x i1> [[DOTSPLAT8]], i32 [[TMP10]])
; CHECK1-NEXT:    [[VP_OP40:%.*]] = call <vscale x 1 x double> @llvm.vp.fadd.nxv1f64(<vscale x 1 x double> [[VP_OP_LOAD11]], <vscale x 1 x double> [[VP_OP37]], metadata !"round.tonearest", metadata !"fpexcept.ignore", <vscale x 1 x i1> [[DOTSPLAT8]], i32 [[TMP10]])
; CHECK1-NEXT:    [[VP_OP43:%.*]] = call <vscale x 1 x double> @llvm.vp.fadd.nxv1f64(<vscale x 1 x double> [[VP_OP21]], <vscale x 1 x double> [[VP_OP40]], metadata !"round.tonearest", metadata !"fpexcept.ignore", <vscale x 1 x i1> [[DOTSPLAT8]], i32 [[TMP10]])
; CHECK1-NEXT:    [[VP_OP46:%.*]] = call <vscale x 1 x double> @llvm.vp.fsub.nxv1f64(<vscale x 1 x double> [[VP_OP43]], <vscale x 1 x double> [[VP_OP32]], metadata !"round.tonearest", metadata !"fpexcept.ignore", <vscale x 1 x i1> [[DOTSPLAT8]], i32 [[TMP10]])
; CHECK1-NEXT:    [[TMP25:%.*]] = getelementptr inbounds double, double* [[G:%.*]], i64 [[TMP5]]
; CHECK1-NEXT:    [[TMP26:%.*]] = getelementptr inbounds double, double* [[TMP25]], i32 0
; CHECK1-NEXT:    [[TMP27:%.*]] = bitcast double* [[TMP26]] to <vscale x 1 x double>*
; CHECK1-NEXT:    call void @llvm.vp.store.nxv1f64.p0nxv1f64(<vscale x 1 x double> [[VP_OP46]], <vscale x 1 x double>* [[TMP27]], i32 8, <vscale x 1 x i1> [[DOTSPLAT8]], i32 [[TMP10]])
; CHECK1-NEXT:    [[TMP28:%.*]] = zext i32 [[TMP10]] to i64
; CHECK1-NEXT:    [[INDEX_NEXT]] = add i64 [[INDEX]], [[TMP28]]
; CHECK1-NEXT:    [[TMP29:%.*]] = icmp eq i64 [[INDEX_NEXT]], [[TMP1]]
; CHECK1-NEXT:    br i1 [[TMP29]], label [[MIDDLE_BLOCK:%.*]], label [[VECTOR_BODY]], [[LOOP0:!llvm.loop !.*]]
; CHECK1:       middle.block:
; CHECK1-NEXT:    br i1 true, label [[FOR_END_LOOPEXIT:%.*]], label [[SCALAR_PH]]
; CHECK1:       scalar.ph:
; CHECK1-NEXT:    [[BC_RESUME_VAL:%.*]] = phi i64 [ [[IND_END]], [[MIDDLE_BLOCK]] ], [ 1, [[FOR_BODY_PREHEADER]] ]
; CHECK1-NEXT:    br label [[FOR_BODY:%.*]]
; CHECK1:       for.body:
; CHECK1-NEXT:    [[INDVARS_IV:%.*]] = phi i64 [ [[BC_RESUME_VAL]], [[SCALAR_PH]] ], [ [[INDVARS_IV_NEXT:%.*]], [[FOR_BODY]] ]
; CHECK1-NEXT:    [[ARRAYIDX:%.*]] = getelementptr inbounds double, double* [[A]], i64 [[INDVARS_IV]]
; CHECK1-NEXT:    [[TMP30:%.*]] = load double, double* [[ARRAYIDX]], align 8
; CHECK1-NEXT:    [[ARRAYIDX2:%.*]] = getelementptr inbounds double, double* [[B]], i64 [[INDVARS_IV]]
; CHECK1-NEXT:    [[TMP31:%.*]] = load double, double* [[ARRAYIDX2]], align 8
; CHECK1-NEXT:    [[ADD3:%.*]] = fadd double [[TMP30]], [[TMP31]]
; CHECK1-NEXT:    [[ARRAYIDX5:%.*]] = getelementptr inbounds double, double* [[C]], i64 [[INDVARS_IV]]
; CHECK1-NEXT:    store double [[ADD3]], double* [[ARRAYIDX5]], align 8
; CHECK1-NEXT:    [[SUB:%.*]] = fsub double [[TMP30]], [[TMP31]]
; CHECK1-NEXT:    [[ADD12:%.*]] = fadd double [[SUB]], [[ADD3]]
; CHECK1-NEXT:    [[ARRAYIDX14:%.*]] = getelementptr inbounds double, double* [[E]], i64 [[INDVARS_IV]]
; CHECK1-NEXT:    store double [[ADD12]], double* [[ARRAYIDX14]], align 8
; CHECK1-NEXT:    [[MUL:%.*]] = fmul double [[TMP30]], [[TMP31]]
; CHECK1-NEXT:    [[ADD21:%.*]] = fadd double [[MUL]], [[ADD3]]
; CHECK1-NEXT:    [[SUB24:%.*]] = fsub double [[ADD21]], [[ADD12]]
; CHECK1-NEXT:    [[ARRAYIDX26:%.*]] = getelementptr inbounds double, double* [[F]], i64 [[INDVARS_IV]]
; CHECK1-NEXT:    store double [[SUB24]], double* [[ARRAYIDX26]], align 8
; CHECK1-NEXT:    [[MUL31:%.*]] = fmul double [[TMP30]], [[ADD3]]
; CHECK1-NEXT:    [[ADD34:%.*]] = fadd double [[TMP31]], [[MUL31]]
; CHECK1-NEXT:    [[ADD37:%.*]] = fadd double [[ADD12]], [[ADD34]]
; CHECK1-NEXT:    [[SUB40:%.*]] = fsub double [[ADD37]], [[SUB24]]
; CHECK1-NEXT:    [[ARRAYIDX42:%.*]] = getelementptr inbounds double, double* [[G]], i64 [[INDVARS_IV]]
; CHECK1-NEXT:    store double [[SUB40]], double* [[ARRAYIDX42]], align 8
; CHECK1-NEXT:    [[INDVARS_IV_NEXT]] = add nuw nsw i64 [[INDVARS_IV]], 1
; CHECK1-NEXT:    [[EXITCOND_NOT:%.*]] = icmp eq i64 [[INDVARS_IV_NEXT]], [[WIDE_TRIP_COUNT]]
; CHECK1-NEXT:    br i1 [[EXITCOND_NOT]], label [[FOR_END_LOOPEXIT]], label [[FOR_BODY]], [[LOOP2:!llvm.loop !.*]]
; CHECK1:       for.end.loopexit:
; CHECK1-NEXT:    br label [[FOR_END]]
; CHECK1:       for.end:
; CHECK1-NEXT:    ret void
;
entry:
  %cmp.not75 = icmp slt i32 %N, 1
  br i1 %cmp.not75, label %for.end, label %for.body.preheader

for.body.preheader:                               ; preds = %entry
  %0 = add nuw i32 %N, 1
  %wide.trip.count = zext i32 %0 to i64
  br label %for.body

for.body:                                         ; preds = %for.body.preheader, %for.body
  %indvars.iv = phi i64 [ 1, %for.body.preheader ], [ %indvars.iv.next, %for.body ]
  %arrayidx = getelementptr inbounds double, double* %a, i64 %indvars.iv
  %1 = load double, double* %arrayidx, align 8
  %arrayidx2 = getelementptr inbounds double, double* %b, i64 %indvars.iv
  %2 = load double, double* %arrayidx2, align 8
  %add3 = fadd double %1, %2
  %arrayidx5 = getelementptr inbounds double, double* %c, i64 %indvars.iv
  store double %add3, double* %arrayidx5, align 8
  %sub = fsub double %1, %2
  %add12 = fadd double %sub, %add3
  %arrayidx14 = getelementptr inbounds double, double* %e, i64 %indvars.iv
  store double %add12, double* %arrayidx14, align 8
  %mul = fmul double %1, %2
  %add21 = fadd double %mul, %add3
  %sub24 = fsub double %add21, %add12
  %arrayidx26 = getelementptr inbounds double, double* %f, i64 %indvars.iv
  store double %sub24, double* %arrayidx26, align 8
  %mul31 = fmul double %1, %add3
  %add34 = fadd double %2, %mul31
  %add37 = fadd double %add12, %add34
  %sub40 = fsub double %add37, %sub24
  %arrayidx42 = getelementptr inbounds double, double* %g, i64 %indvars.iv
  store double %sub40, double* %arrayidx42, align 8
  %indvars.iv.next = add nuw nsw i64 %indvars.iv, 1
  %exitcond.not = icmp eq i64 %indvars.iv.next, %wide.trip.count
  br i1 %exitcond.not, label %for.end.loopexit, label %for.body

for.end.loopexit:                                 ; preds = %for.body
  br label %for.end

for.end:                                          ; preds = %for.end.loopexit, %entry
  ret void
}
