; NOTE: Assertions have been autogenerated by utils/update_llc_test_checks.py
; RUN: llc -mtriple=riscv64 -mattr=+m,+f,+d,+a,+c,+experimental-v \
; RUN:    -verify-machineinstrs < %s | FileCheck %s

define void @foo(<vscale x 8 x i32> %value, <vscale x 8 x i8>* %ptr, i32 %gvl)
; CHECK-LABEL: foo:
; CHECK:       # %bb.0:
; CHECK-NEXT:    vsetvli zero, a1, e16,m2
; CHECK-NEXT:    vnsrl.vi v2, v16, 0
; CHECK-NEXT:    vsetvli zero, a1, e8,m1
; CHECK-NEXT:    vnsrl.vi v1, v2, 0
; CHECK-NEXT:    vse.v v1, (a0)
; CHECK-NEXT:    ret
{
  %vp.cast100 = call <vscale x 8 x i8> @llvm.vp.trunc.nxv8i8.nxv8i32(<vscale x 8 x i32> %value, <vscale x 8 x i1> shufflevector (<vscale x 8 x i1> insertelement (<vscale x 8 x i1> undef, i1 true, i32 0), <vscale x 8 x i1> undef, <vscale x 8 x i32> zeroinitializer), i32 %gvl)
  call void @llvm.vp.store.nxv8i8.p0nxv8i8(<vscale x 8 x i8> %vp.cast100, <vscale x 8 x i8>* %ptr, i32 1, <vscale x 8 x i1> shufflevector (<vscale x 8 x i1> insertelement (<vscale x 8 x i1> undef, i1 true, i32 0), <vscale x 8 x i1> undef, <vscale x 8 x i32> zeroinitializer), i32 %gvl)
  ret void
}

; Function Attrs: nounwind readnone willreturn
declare <vscale x 8 x i8> @llvm.vp.trunc.nxv8i8.nxv8i32(<vscale x 8 x i32>, <vscale x 8 x i1>, i32) #3

; Function Attrs: argmemonly nosync nounwind willreturn writeonly
declare void @llvm.vp.store.nxv8i8.p0nxv8i8(<vscale x 8 x i8>, <vscale x 8 x i8>* nocapture, i32 immarg, <vscale x 8 x i1>, i32) #6
