; NOTE: Assertions have been autogenerated by utils/update_llc_test_checks.py
; RUN: llc -mtriple=riscv64 -mattr=+m,+f,+d,+c,+experimental-v < %s | \
; RUN:     FileCheck %s

define <vscale x 2 x float> @fptrunc.f32.f64(<vscale x 2 x double> %a, i32 %gvl)
; CHECK-LABEL: fptrunc.f32.f64:
; CHECK:       # %bb.0:
; CHECK-NEXT:    vsetvli zero, a0, e32,m1
; CHECK-NEXT:    vfncvt.f.f.v v1, v16
; CHECK-NEXT:    rdvtype t0
; CHECK-NEXT:    rdvl t1
; CHECK-NEXT:    vsetvli zero, zero, e64,m1
; CHECK-NEXT:    vmv.v.v v16, v1
; CHECK-NEXT:    vsetvl zero, t1, t0
; CHECK-NEXT:    ret
{
  %b = call <vscale x 2 x float> @llvm.vp.fptrunc.nxv2f32.nxv2f64(<vscale x 2 x double> %a,
            metadata !"round.tonearest", metadata !"fpexcept.ignore",
            <vscale x 2 x i1> shufflevector (<vscale x 2 x i1> insertelement (<vscale x 2 x i1> undef, i1 true, i32 0), <vscale x 2 x i1> undef, <vscale x 2 x i32> zeroinitializer),
            i32 %gvl)
  ret <vscale x 2 x float> %b
}

define <vscale x 2 x float> @fptrunc.f32.f64.mask(<vscale x 2 x double> %a, <vscale x 2 x i1> %mask, i32 %gvl)
; CHECK-LABEL: fptrunc.f32.f64.mask:
; CHECK:       # %bb.0:
; CHECK-NEXT:    vsetvli zero, a0, e32,m1
; CHECK-NEXT:    vfncvt.f.f.v v1, v16, v0.t
; CHECK-NEXT:    rdvtype t0
; CHECK-NEXT:    rdvl t1
; CHECK-NEXT:    vsetvli zero, zero, e64,m1
; CHECK-NEXT:    vmv.v.v v16, v1
; CHECK-NEXT:    vsetvl zero, t1, t0
; CHECK-NEXT:    ret
{
  %b = call <vscale x 2 x float> @llvm.vp.fptrunc.nxv2f32.nxv2f64(
               <vscale x 2 x double> %a,
               metadata !"round.tonearest", metadata !"fpexcept.ignore",
               <vscale x 2 x i1> %mask,
               i32 %gvl)
  ret <vscale x 2 x float> %b
}

declare <vscale x 2 x float> @llvm.vp.fptrunc.nxv2f32.nxv2f64(<vscale x 2 x double>, metadata, metadata, <vscale x 2 x i1>, i32) #3
