; NOTE: Assertions have been autogenerated by utils/update_llc_test_checks.py
; RUN: llc -mtriple=riscv64 -mattr=+m,+f,+d,+c,+experimental-v < %s | \
; RUN:     FileCheck %s

define <vscale x 2 x double> @fpext.f64.f32(<vscale x 2 x float> %a, i32 %gvl)
; CHECK-LABEL: fpext.f64.f32:
; CHECK:       # %bb.0:
; CHECK-NEXT:    vsetvli zero, a0, e32,m1
; CHECK-NEXT:    vfwcvt.f.f.v v2, v16
; CHECK-NEXT:    rdvtype t0
; CHECK-NEXT:    rdvl t1
; CHECK-NEXT:    vsetvli zero, zero, e64,m2
; CHECK-NEXT:    vmv.v.v v16, v2
; CHECK-NEXT:    vsetvl zero, t1, t0
; CHECK-NEXT:    ret
{
  %b = call <vscale x 2 x double> @llvm.vp.fpext.nxv2f64.nxv2f32(<vscale x 2 x float> %a,
            metadata !"fpexcept.ignore",
            <vscale x 2 x i1> shufflevector (<vscale x 2 x i1> insertelement (<vscale x 2 x i1> undef, i1 true, i32 0), <vscale x 2 x i1> undef, <vscale x 2 x i32> zeroinitializer),
            i32 %gvl)
  ret <vscale x 2 x double> %b
}

define <vscale x 2 x double> @fpext.f64.f32.mask(<vscale x 2 x float> %a, <vscale x 2 x i1> %mask, i32 %gvl)
; CHECK-LABEL: fpext.f64.f32.mask:
; CHECK:       # %bb.0:
; CHECK-NEXT:    vsetvli zero, a0, e32,m1
; CHECK-NEXT:    vfwcvt.f.f.v v2, v16, v0.t
; CHECK-NEXT:    rdvtype t0
; CHECK-NEXT:    rdvl t1
; CHECK-NEXT:    vsetvli zero, zero, e64,m2
; CHECK-NEXT:    vmv.v.v v16, v2
; CHECK-NEXT:    vsetvl zero, t1, t0
; CHECK-NEXT:    ret
{
  %b = call <vscale x 2 x double> @llvm.vp.fpext.nxv2f64.nxv2f32(
               <vscale x 2 x float> %a,
               metadata !"fpexcept.ignore",
               <vscale x 2 x i1> %mask,
               i32 %gvl)
  ret <vscale x 2 x double> %b
}

declare <vscale x 2 x double> @llvm.vp.fpext.nxv2f64.nxv2f32(<vscale x 2 x float> %a, metadata, <vscale x 2 x i1> %mask, i32 %gvl)
