; NOTE: Assertions have been autogenerated by utils/update_test_checks.py
; RUN: opt -passes=instcombine -expand-vector-gep-to-vp=false %s -S | FileCheck %s

; ModuleID = '/home/lalbano/tmp/gep_optimization.c'
source_filename = "/home/lalbano/tmp/gep_optimization.c"
target datalayout = "e-m:e-p:64:64-i64:64-i128:128-n64-S128-v128:128:128-v256:128:128-v512:128:128-v1024:128:128"
target triple = "riscv64-unknown-linux-gnu"

; Function Attrs: nofree norecurse nounwind
define dso_local void @geps_random(i32 signext %N, double* nocapture %A, i32* nocapture readonly %K, i32 signext %v) local_unnamed_addr #0 {
; CHECK-LABEL: @geps_random(
; CHECK-NEXT:  entry:
; CHECK-NEXT:    [[CMP6:%.*]] = icmp sgt i32 [[N:%.*]], 0
; CHECK-NEXT:    br i1 [[CMP6]], label [[FOR_BODY_PREHEADER:%.*]], label [[FOR_COND_CLEANUP:%.*]]
; CHECK:       for.body.preheader:
; CHECK-NEXT:    [[WIDE_TRIP_COUNT:%.*]] = zext i32 [[N]] to i64
; CHECK-NEXT:    br i1 false, label [[SCALAR_PH:%.*]], label [[VECTOR_PH:%.*]]
; CHECK:       vector.ph:
; CHECK-NEXT:    br label [[VECTOR_BODY:%.*]]
; CHECK:       vector.body:
; CHECK-NEXT:    [[INDEX:%.*]] = phi i64 [ 0, [[VECTOR_PH]] ], [ [[INDEX_NEXT:%.*]], [[VECTOR_BODY]] ]
; CHECK-NEXT:    [[TMP0:%.*]] = getelementptr inbounds i32, i32* [[K:%.*]], i64 [[INDEX]]
; CHECK-NEXT:    [[TMP1:%.*]] = sub i64 [[WIDE_TRIP_COUNT]], [[INDEX]]
; CHECK-NEXT:    [[TMP2:%.*]] = call i64 @llvm.epi.vsetvl(i64 [[TMP1]], i64 3, i64 1)
; CHECK-NEXT:    [[TMP3:%.*]] = trunc i64 [[TMP2]] to i32
; CHECK-NEXT:    [[TMP4:%.*]] = bitcast i32* [[TMP0]] to <vscale x 2 x i32>*
; CHECK-NEXT:    [[VP_OP_LOAD:%.*]] = call <vscale x 2 x i32> @llvm.vp.load.nxv2i32.p0nxv2i32(<vscale x 2 x i32>* [[TMP4]], i32 4, <vscale x 2 x i1> shufflevector (<vscale x 2 x i1> insertelement (<vscale x 2 x i1> undef, i1 true, i32 0), <vscale x 2 x i1> undef, <vscale x 2 x i32> zeroinitializer), i32 [[TMP3]]), [[TBAA4:!tbaa !.*]], !llvm.access.group !8
; CHECK-NEXT:    [[TMP5:%.*]] = sext i32 [[V:%.*]] to i64
; CHECK-NEXT:    [[BASE_PTR:%.*]] = getelementptr inbounds double, double* [[A:%.*]], i64 [[TMP5]]
; CHECK-NEXT:    [[TMP6:%.*]] = sext <vscale x 2 x i32> [[VP_OP_LOAD]] to <vscale x 2 x i64>
; CHECK-NEXT:    [[GEP_OPT:%.*]] = getelementptr inbounds double, double* [[BASE_PTR]], <vscale x 2 x i64> [[TMP6]]
; CHECK-NEXT:    call void @llvm.vp.scatter.nxv2f64.nxv2p0f64(<vscale x 2 x double> shufflevector (<vscale x 2 x double> insertelement (<vscale x 2 x double> undef, double 3.000000e+00, i32 0), <vscale x 2 x double> undef, <vscale x 2 x i32> zeroinitializer), <vscale x 2 x double*> [[GEP_OPT]], i32 8, <vscale x 2 x i1> shufflevector (<vscale x 2 x i1> insertelement (<vscale x 2 x i1> undef, i1 true, i32 0), <vscale x 2 x i1> undef, <vscale x 2 x i32> zeroinitializer), i32 [[TMP3]]), [[TBAA9:!tbaa !.*]], !llvm.access.group !8
; CHECK-NEXT:    [[TMP7:%.*]] = and i64 [[TMP2]], 4294967295
; CHECK-NEXT:    [[INDEX_NEXT]] = add i64 [[INDEX]], [[TMP7]]
; CHECK-NEXT:    [[TMP8:%.*]] = icmp eq i64 [[INDEX_NEXT]], [[WIDE_TRIP_COUNT]]
; CHECK-NEXT:    br i1 [[TMP8]], label [[MIDDLE_BLOCK:%.*]], label [[VECTOR_BODY]], [[LOOP11:!llvm.loop !.*]]
; CHECK:       middle.block:
; CHECK-NEXT:    br i1 true, label [[FOR_COND_CLEANUP_LOOPEXIT:%.*]], label [[SCALAR_PH]]
; CHECK:       scalar.ph:
; CHECK-NEXT:    br label [[FOR_BODY:%.*]]
; CHECK:       for.cond.cleanup.loopexit.loopexit:
; CHECK-NEXT:    br label [[FOR_COND_CLEANUP_LOOPEXIT]]
; CHECK:       for.cond.cleanup.loopexit:
; CHECK-NEXT:    br label [[FOR_COND_CLEANUP]]
; CHECK:       for.cond.cleanup:
; CHECK-NEXT:    ret void
; CHECK:       for.body:
; CHECK-NEXT:    br i1 undef, label [[FOR_COND_CLEANUP_LOOPEXIT_LOOPEXIT:%.*]], label [[FOR_BODY]], [[LOOP15:!llvm.loop !.*]]
;
entry:
  %cmp6 = icmp sgt i32 %N, 0
  br i1 %cmp6, label %for.body.preheader, label %for.cond.cleanup

for.body.preheader:                               ; preds = %entry
  %wide.trip.count = zext i32 %N to i64
  br i1 false, label %scalar.ph, label %vector.ph

vector.ph:                                        ; preds = %for.body.preheader
  %trip.count.minus.1 = sub i64 %wide.trip.count, 1
  %broadcast.splatinsert = insertelement <vscale x 2 x i64> undef, i64 %trip.count.minus.1, i32 0
  %broadcast.splat = shufflevector <vscale x 2 x i64> %broadcast.splatinsert, <vscale x 2 x i64> undef, <vscale x 2 x i32> zeroinitializer
  %broadcast.splatinsert14 = insertelement <vscale x 2 x i32> undef, i32 %v, i32 0
  %broadcast.splat15 = shufflevector <vscale x 2 x i32> %broadcast.splatinsert14, <vscale x 2 x i32> undef, <vscale x 2 x i32> zeroinitializer
  %broadcast.splatinsert20 = insertelement <vscale x 2 x double> undef, double 3.000000e+00, i32 0
  %broadcast.splat21 = shufflevector <vscale x 2 x double> %broadcast.splatinsert20, <vscale x 2 x double> undef, <vscale x 2 x i32> zeroinitializer
  br label %vector.body

vector.body:                                      ; preds = %vector.body, %vector.ph
  %index = phi i64 [ 0, %vector.ph ], [ %index.next, %vector.body ]
  %broadcast.splatinsert8 = insertelement <vscale x 2 x i64> undef, i64 %index, i32 0
  %broadcast.splat9 = shufflevector <vscale x 2 x i64> %broadcast.splatinsert8, <vscale x 2 x i64> undef, <vscale x 2 x i32> zeroinitializer
  %0 = call <vscale x 2 x i64> @llvm.experimental.vector.stepvector.nxv2i64()
  %.splatinsert = insertelement <vscale x 2 x i64> undef, i64 0, i32 0
  %.splat = shufflevector <vscale x 2 x i64> %.splatinsert, <vscale x 2 x i64> undef, <vscale x 2 x i32> zeroinitializer
  %1 = add <vscale x 2 x i64> %0, %.splat
  %.splatinsert10 = insertelement <vscale x 2 x i64> undef, i64 1, i32 0
  %.splat11 = shufflevector <vscale x 2 x i64> %.splatinsert10, <vscale x 2 x i64> undef, <vscale x 2 x i32> zeroinitializer
  %2 = mul <vscale x 2 x i64> %1, %.splat11
  %induction = add <vscale x 2 x i64> %broadcast.splat9, %2
  %3 = add i64 %index, 0
  %4 = icmp ule <vscale x 2 x i64> %induction, %broadcast.splat
  %5 = getelementptr inbounds i32, i32* %K, i64 %3
  %6 = sub i64 %wide.trip.count, %index
  %7 = call i64 @llvm.epi.vsetvl(i64 %6, i64 3, i64 1)
  %8 = trunc i64 %7 to i32
  %9 = getelementptr inbounds i32, i32* %5, i32 0
  %10 = bitcast i32* %9 to <vscale x 2 x i32>*
  %.splatinsert12 = insertelement <vscale x 2 x i1> undef, i1 true, i32 0
  %.splat13 = shufflevector <vscale x 2 x i1> %.splatinsert12, <vscale x 2 x i1> undef, <vscale x 2 x i32> zeroinitializer
  %vp.op.load = call <vscale x 2 x i32> @llvm.vp.load.nxv2i32.p0nxv2i32(<vscale x 2 x i32>* %10, i32 4, <vscale x 2 x i1> %.splat13, i32 %8), !tbaa !4, !llvm.access.group !8
  %vp.op = call <vscale x 2 x i32> @llvm.vp.add.nxv2i32(<vscale x 2 x i32> %vp.op.load, <vscale x 2 x i32> %broadcast.splat15, <vscale x 2 x i1> %.splat13, i32 %8)
  %vp.cast = call <vscale x 2 x i64> @llvm.vp.sext.nxv2i64.nxv2i32(<vscale x 2 x i32> %vp.op, <vscale x 2 x i1> %.splat13, i32 %8)
  %11 = getelementptr inbounds double, double* %A, <vscale x 2 x i64> %vp.cast
  call void @llvm.vp.scatter.nxv2f64.nxv2p0f64(<vscale x 2 x double> %broadcast.splat21, <vscale x 2 x double*> %11, i32 8, <vscale x 2 x i1> %.splat13, i32 %8), !tbaa !9, !llvm.access.group !8
  %12 = zext i32 %8 to i64
  %index.next = add i64 %index, %12
  %13 = icmp eq i64 %index.next, %wide.trip.count
  br i1 %13, label %middle.block, label %vector.body, !llvm.loop !11

middle.block:                                     ; preds = %vector.body
  br i1 true, label %for.cond.cleanup.loopexit, label %scalar.ph

scalar.ph:                                        ; preds = %middle.block, %for.body.preheader
  %bc.resume.val = phi i64 [ %wide.trip.count, %middle.block ], [ 0, %for.body.preheader ]
  br label %for.body

for.cond.cleanup.loopexit.loopexit:               ; preds = %for.body
  br label %for.cond.cleanup.loopexit

for.cond.cleanup.loopexit:                        ; preds = %for.cond.cleanup.loopexit.loopexit, %middle.block
  br label %for.cond.cleanup

for.cond.cleanup:                                 ; preds = %for.cond.cleanup.loopexit, %entry
  ret void

for.body:                                         ; preds = %scalar.ph, %for.body
  %indvars.iv = phi i64 [ %bc.resume.val, %scalar.ph ], [ %indvars.iv.next, %for.body ]
  %arrayidx = getelementptr inbounds i32, i32* %K, i64 %indvars.iv
  %14 = load i32, i32* %arrayidx, align 4, !tbaa !4, !llvm.access.group !8
  %add = add nsw i32 %14, %v
  %idxprom1 = sext i32 %add to i64
  %arrayidx2 = getelementptr inbounds double, double* %A, i64 %idxprom1
  store double 3.000000e+00, double* %arrayidx2, align 8, !tbaa !9, !llvm.access.group !8
  %indvars.iv.next = add nuw nsw i64 %indvars.iv, 1
  %exitcond.not = icmp eq i64 %indvars.iv.next, %wide.trip.count
  br i1 %exitcond.not, label %for.cond.cleanup.loopexit.loopexit, label %for.body, !llvm.loop !15
}

; Function Attrs: nounwind readnone
declare <vscale x 2 x i64> @llvm.experimental.vector.stepvector.nxv2i64() #1

; Function Attrs: nounwind readnone
declare i64 @llvm.epi.vsetvl(i64, i64, i64) #1

; Function Attrs: argmemonly nosync nounwind readonly willreturn
declare <vscale x 2 x i32> @llvm.vp.load.nxv2i32.p0nxv2i32(<vscale x 2 x i32>* nocapture, i32 immarg, <vscale x 2 x i1>, i32) #2

; Function Attrs: nofree nosync nounwind readnone speculatable willreturn
declare <vscale x 2 x i32> @llvm.vp.add.nxv2i32(<vscale x 2 x i32>, <vscale x 2 x i32>, <vscale x 2 x i1>, i32) #3

; Function Attrs: nounwind readnone willreturn
declare <vscale x 2 x i64> @llvm.vp.sext.nxv2i64.nxv2i32(<vscale x 2 x i32>, <vscale x 2 x i1>, i32) #4

; Function Attrs: argmemonly nosync nounwind willreturn writeonly
declare void @llvm.vp.scatter.nxv2f64.nxv2p0f64(<vscale x 2 x double>, <vscale x 2 x double*>, i32 immarg, <vscale x 2 x i1>, i32) #5

attributes #0 = { nofree norecurse nounwind "disable-tail-calls"="false" "frame-pointer"="none" "less-precise-fpmad"="false" "min-legal-vector-width"="0" "no-infs-fp-math"="false" "no-jump-tables"="false" "no-nans-fp-math"="false" "no-signed-zeros-fp-math"="false" "no-trapping-math"="true" "stack-protector-buffer-size"="8" "target-features"="+a,+c,+d,+experimental-v,+experimental-zvlsseg,+f,+m,-relax,-save-restore" "unsafe-fp-math"="false" "use-soft-float"="false" }
attributes #1 = { nounwind readnone }
attributes #2 = { argmemonly nosync nounwind readonly willreturn }
attributes #3 = { nofree nosync nounwind readnone speculatable willreturn }
attributes #4 = { nounwind readnone willreturn }
attributes #5 = { argmemonly nosync nounwind willreturn writeonly }

!llvm.module.flags = !{!0, !1, !2}
!llvm.ident = !{!3}

!0 = !{i32 1, !"wchar_size", i32 4}
!1 = !{i32 1, !"target-abi", !"lp64d"}
!2 = !{i32 1, !"SmallDataLimit", i32 8}
!3 = !{!"clang version 12.0.0"}
!4 = !{!5, !5, i64 0}
!5 = !{!"int", !6, i64 0}
!6 = !{!"omnipotent char", !7, i64 0}
!7 = !{!"Simple C/C++ TBAA"}
!8 = distinct !{}
!9 = !{!10, !10, i64 0}
!10 = !{!"double", !6, i64 0}
!11 = distinct !{!11, !12, !13, !14}
!12 = !{!"llvm.loop.mustprogress"}
!13 = !{!"llvm.loop.parallel_accesses", !8}
!14 = !{!"llvm.loop.isvectorized", i32 1}
!15 = distinct !{!15, !12, !13, !16, !14}
!16 = !{!"llvm.loop.unroll.runtime.disable"}
