; NOTE: Assertions have been autogenerated by utils/update_llc_test_checks.py
; RUN: llc -mtriple=riscv64 -mattr=+m,+f,+d,+c,+experimental-v < %s | \
; RUN:     FileCheck %s

define <vscale x 2 x i64> @zext.i64.i32(<vscale x 2 x i32> %a, i32 %gvl)
; CHECK-LABEL: zext.i64.i32:
; CHECK:       # %bb.0:
; CHECK-NEXT:    vsetvli zero, a0, e32,m1
; CHECK-NEXT:    vwcvtu.x.x.v v2, v16
; CHECK-NEXT:    rdvtype t0
; CHECK-NEXT:    rdvl t1
; CHECK-NEXT:    vsetvli zero, zero, e64,m2
; CHECK-NEXT:    vmv.v.v v16, v2
; CHECK-NEXT:    vsetvl zero, t1, t0
; CHECK-NEXT:    ret
{
  %b = call <vscale x 2 x i64> @llvm.vp.zext.nxv2i64.nxv2i32(<vscale x 2 x i32> %a,
            <vscale x 2 x i1> shufflevector (<vscale x 2 x i1> insertelement (<vscale x 2 x i1> undef, i1 true, i32 0), <vscale x 2 x i1> undef, <vscale x 2 x i32> zeroinitializer),
            i32 %gvl)
  ret <vscale x 2 x i64> %b
}

define <vscale x 2 x i64> @zext.i64.i32.mask(<vscale x 2 x i32> %a, <vscale x 2 x i1> %mask, i32 %gvl)
; CHECK-LABEL: zext.i64.i32.mask:
; CHECK:       # %bb.0:
; CHECK-NEXT:    vsetvli zero, a0, e32,m1
; CHECK-NEXT:    vwcvtu.x.x.v v2, v16, v0.t
; CHECK-NEXT:    rdvtype t0
; CHECK-NEXT:    rdvl t1
; CHECK-NEXT:    vsetvli zero, zero, e64,m2
; CHECK-NEXT:    vmv.v.v v16, v2
; CHECK-NEXT:    vsetvl zero, t1, t0
; CHECK-NEXT:    ret
{
  %b = call <vscale x 2 x i64> @llvm.vp.zext.nxv2i64.nxv2i32(
               <vscale x 2 x i32> %a,
               <vscale x 2 x i1> %mask,
               i32 %gvl)
  ret <vscale x 2 x i64> %b
}

declare <vscale x 2 x i64> @llvm.vp.zext.nxv2i64.nxv2i32(<vscale x 2 x i32> %a, <vscale x 2 x i1> %mask, i32 %gvl)

define <vscale x 8 x i32> @test_vp_zext_nxv8i32_nxv8i8(<vscale x 8 x i8> %a, i32 %evl) {
; CHECK-LABEL: test_vp_zext_nxv8i32_nxv8i8:
; CHECK:       # %bb.0:
; CHECK-NEXT:    vsetvli zero, a0, e8,m1
; CHECK-NEXT:    vwcvtu.x.x.v v2, v16
; CHECK-NEXT:    vsetvli zero, a0, e16,m2
; CHECK-NEXT:    vwcvtu.x.x.v v16, v2
; CHECK-NEXT:    ret
    %m.first = insertelement <vscale x 8 x i1> undef, i1 1, i32 0
    %m.splat = shufflevector <vscale x 8 x i1> %m.first, <vscale x 8 x i1> undef, <vscale x 8 x i32> zeroinitializer
    %x = call <vscale x 8 x i32> @llvm.vp.zext.nxv8i32.nxv8i8(<vscale x 8 x i8> %a, <vscale x 8 x i1> %m.splat, i32 %evl)
    ret <vscale x 8 x i32> %x
}

define <vscale x 8 x i64> @test_vp_zext_nxv8i64_nxv8i8(<vscale x 8 x i8> %a, i32 %evl) {
; CHECK-LABEL: test_vp_zext_nxv8i64_nxv8i8:
; CHECK:       # %bb.0:
; CHECK-NEXT:    vsetvli zero, a0, e8,m1
; CHECK-NEXT:    vwcvtu.x.x.v v2, v16
; CHECK-NEXT:    vsetvli zero, a0, e16,m2
; CHECK-NEXT:    vwcvtu.x.x.v v4, v2
; CHECK-NEXT:    vsetvli zero, a0, e32,m4
; CHECK-NEXT:    vwcvtu.x.x.v v16, v4
; CHECK-NEXT:    ret
    %m.first = insertelement <vscale x 8 x i1> undef, i1 1, i32 0
    %m.splat = shufflevector <vscale x 8 x i1> %m.first, <vscale x 8 x i1> undef, <vscale x 8 x i32> zeroinitializer
    %x = call <vscale x 8 x i64> @llvm.vp.zext.nxv8i64.nxv8i8(<vscale x 8 x i8> %a, <vscale x 8 x i1> %m.splat, i32 %evl)
    ret <vscale x 8 x i64> %x
}

define <vscale x 8 x i64> @test_vp_zext_nxv8i64_nxv8i16(<vscale x 8 x i16> %a, i32 %evl) {
; CHECK-LABEL: test_vp_zext_nxv8i64_nxv8i16:
; CHECK:       # %bb.0:
; CHECK-NEXT:    vsetvli zero, a0, e16,m2
; CHECK-NEXT:    vwcvtu.x.x.v v4, v16
; CHECK-NEXT:    vsetvli zero, a0, e32,m4
; CHECK-NEXT:    vwcvtu.x.x.v v16, v4
; CHECK-NEXT:    ret
    %m.first = insertelement <vscale x 8 x i1> undef, i1 1, i32 0
    %m.splat = shufflevector <vscale x 8 x i1> %m.first, <vscale x 8 x i1> undef, <vscale x 8 x i32> zeroinitializer
    %x = call <vscale x 8 x i64> @llvm.vp.zext.nxv8i64.nxv8i16(<vscale x 8 x i16> %a, <vscale x 8 x i1> %m.splat, i32 %evl)
    ret <vscale x 8 x i64> %x
}

declare <vscale x 8 x i32> @llvm.vp.zext.nxv8i32.nxv8i8(<vscale x 8 x i8> %op, <vscale x 8 x i1> %mask, i32 %evl)
declare <vscale x 8 x i64> @llvm.vp.zext.nxv8i64.nxv8i8(<vscale x 8 x i8> %op, <vscale x 8 x i1> %mask, i32 %evl)
declare <vscale x 8 x i64> @llvm.vp.zext.nxv8i64.nxv8i16(<vscale x 8 x i16> %op, <vscale x 8 x i1> %mask, i32 %evl)
