; NOTE: Assertions have been autogenerated by utils/update_test_checks.py
; RUN: opt -mtriple riscv64 -mattr +m,+a,+f,+d,+experimental-v \
; RUN:    -prefer-predicate-over-epilogue=predicate-dont-vectorize \
; RUN:    -S -loop-vectorize -instcombine -simplifycfg < %s -o - \
; RUN:    | FileCheck --check-prefix=GATHER %s
; RUN: opt -mtriple riscv64 -mattr +m,+a,+f,+d,+experimental-v \
; RUN:    -prefer-predicate-over-epilogue=predicate-dont-vectorize \
; RUN:    -vectorizer-use-vp-strided-load-store \
; RUN:    -S -loop-vectorize -instcombine -simplifycfg < %s -o - \
; RUN:    | FileCheck --check-prefix=STRIDED %s

; Test from https://reviews.llvm.org/D107790
;
;struct foo {
;  int a, b, c, d;
;};
;
;void struct_gather(int * __restrict  A, struct foo * __restrict B) {
;  for (int i = 0; i < 1024; ++i)
;      A[i] += B[i].b;
;}

%struct.foo = type { i32, i32, i32, i32 }

define dso_local void @struct_gather(i32* noalias nocapture %a.arg, %struct.foo* noalias nocapture readonly %b.arg) {
; GATHER-LABEL: @struct_gather(
; GATHER-NEXT:  entry:
; GATHER-NEXT:    br label [[FOR_BODY:%.*]]
; GATHER:       for.cond.cleanup:
; GATHER-NEXT:    ret void
; GATHER:       for.body:
; GATHER-NEXT:    [[INDVARS_IV:%.*]] = phi i64 [ 0, [[ENTRY:%.*]] ], [ [[INDVARS_IV_NEXT:%.*]], [[FOR_BODY]] ]
; GATHER-NEXT:    [[B:%.*]] = getelementptr inbounds [[STRUCT_FOO:%.*]], %struct.foo* [[B_ARG:%.*]], i64 [[INDVARS_IV]], i32 1
; GATHER-NEXT:    [[TMP0:%.*]] = load i32, i32* [[B]], align 4
; GATHER-NEXT:    [[ARRAYIDX2:%.*]] = getelementptr inbounds i32, i32* [[A_ARG:%.*]], i64 [[INDVARS_IV]]
; GATHER-NEXT:    [[TMP1:%.*]] = load i32, i32* [[ARRAYIDX2]], align 4
; GATHER-NEXT:    [[ADD:%.*]] = add nsw i32 [[TMP1]], [[TMP0]]
; GATHER-NEXT:    store i32 [[ADD]], i32* [[ARRAYIDX2]], align 4
; GATHER-NEXT:    [[INDVARS_IV_NEXT]] = add nuw nsw i64 [[INDVARS_IV]], 1
; GATHER-NEXT:    [[EXITCOND_NOT:%.*]] = icmp eq i64 [[INDVARS_IV_NEXT]], 1024
; GATHER-NEXT:    br i1 [[EXITCOND_NOT]], label [[FOR_COND_CLEANUP:%.*]], label [[FOR_BODY]]
;
; STRIDED-LABEL: @struct_gather(
; STRIDED-NEXT:  entry:
; STRIDED-NEXT:    [[SCEVGEP:%.*]] = getelementptr [[STRUCT_FOO:%.*]], %struct.foo* [[B_ARG:%.*]], i64 0, i32 1
; STRIDED-NEXT:    br label [[VECTOR_BODY:%.*]]
; STRIDED:       vector.body:
; STRIDED-NEXT:    [[INDEX:%.*]] = phi i64 [ 0, [[ENTRY:%.*]] ], [ [[INDEX_NEXT:%.*]], [[VECTOR_BODY]] ]
; STRIDED-NEXT:    [[TMP0:%.*]] = sub i64 1024, [[INDEX]]
; STRIDED-NEXT:    [[TMP1:%.*]] = call i64 @llvm.epi.vsetvl(i64 [[TMP0]], i64 2, i64 0)
; STRIDED-NEXT:    [[TMP2:%.*]] = trunc i64 [[TMP1]] to i32
; STRIDED-NEXT:    [[TMP3:%.*]] = shl i64 [[INDEX]], 2
; STRIDED-NEXT:    [[TMP4:%.*]] = getelementptr i32, i32* [[SCEVGEP]], i64 [[TMP3]]
; STRIDED-NEXT:    [[VP_STRIDED_LOAD:%.*]] = call <vscale x 2 x i32> @llvm.vp.strided.load.nxv2i32.p0i32.i64(i32* [[TMP4]], i64 16, <vscale x 2 x i1> shufflevector (<vscale x 2 x i1> insertelement (<vscale x 2 x i1> undef, i1 true, i32 0), <vscale x 2 x i1> undef, <vscale x 2 x i32> zeroinitializer), i32 [[TMP2]])
; STRIDED-NEXT:    [[TMP5:%.*]] = getelementptr inbounds i32, i32* [[A_ARG:%.*]], i64 [[INDEX]]
; STRIDED-NEXT:    [[TMP6:%.*]] = bitcast i32* [[TMP5]] to <vscale x 2 x i32>*
; STRIDED-NEXT:    [[VP_OP_LOAD:%.*]] = call <vscale x 2 x i32> @llvm.vp.load.nxv2i32.p0nxv2i32(<vscale x 2 x i32>* [[TMP6]], i32 4, <vscale x 2 x i1> shufflevector (<vscale x 2 x i1> insertelement (<vscale x 2 x i1> undef, i1 true, i32 0), <vscale x 2 x i1> undef, <vscale x 2 x i32> zeroinitializer), i32 [[TMP2]])
; STRIDED-NEXT:    [[VP_OP:%.*]] = call <vscale x 2 x i32> @llvm.vp.add.nxv2i32(<vscale x 2 x i32> [[VP_OP_LOAD]], <vscale x 2 x i32> [[VP_STRIDED_LOAD]], <vscale x 2 x i1> shufflevector (<vscale x 2 x i1> insertelement (<vscale x 2 x i1> undef, i1 true, i32 0), <vscale x 2 x i1> undef, <vscale x 2 x i32> zeroinitializer), i32 [[TMP2]])
; STRIDED-NEXT:    [[TMP7:%.*]] = bitcast i32* [[TMP5]] to <vscale x 2 x i32>*
; STRIDED-NEXT:    call void @llvm.vp.store.nxv2i32.p0nxv2i32(<vscale x 2 x i32> [[VP_OP]], <vscale x 2 x i32>* [[TMP7]], i32 4, <vscale x 2 x i1> shufflevector (<vscale x 2 x i1> insertelement (<vscale x 2 x i1> undef, i1 true, i32 0), <vscale x 2 x i1> undef, <vscale x 2 x i32> zeroinitializer), i32 [[TMP2]])
; STRIDED-NEXT:    [[TMP8:%.*]] = and i64 [[TMP1]], 4294967295
; STRIDED-NEXT:    [[INDEX_NEXT]] = add i64 [[INDEX]], [[TMP8]]
; STRIDED-NEXT:    [[TMP9:%.*]] = icmp eq i64 [[INDEX_NEXT]], 1024
; STRIDED-NEXT:    br i1 [[TMP9]], label [[FOR_COND_CLEANUP:%.*]], label [[VECTOR_BODY]], [[LOOP0:!llvm.loop !.*]]
; STRIDED:       for.cond.cleanup:
; STRIDED-NEXT:    ret void
;
entry:
  br label %for.body

for.cond.cleanup:                                 ; preds = %for.body
  ret void

for.body:                                         ; preds = %entry, %for.body
  %indvars.iv = phi i64 [ 0, %entry ], [ %indvars.iv.next, %for.body ]
  %b = getelementptr inbounds %struct.foo, %struct.foo* %b.arg, i64 %indvars.iv, i32 1
  %0 = load i32, i32* %b, align 4
  %arrayidx2 = getelementptr inbounds i32, i32* %a.arg, i64 %indvars.iv
  %1 = load i32, i32* %arrayidx2, align 4
  %add = add nsw i32 %1, %0
  store i32 %add, i32* %arrayidx2, align 4
  %indvars.iv.next = add nuw nsw i64 %indvars.iv, 1
  %exitcond.not = icmp eq i64 %indvars.iv.next, 1024
  br i1 %exitcond.not, label %for.cond.cleanup, label %for.body
}
