; NOTE: Assertions have been autogenerated by utils/update_llc_test_checks.py
; RUN: llc -mtriple=riscv64 -mattr=+d,+f,+experimental-v -verify-machineinstrs < %s \
; RUN:   | FileCheck %s

define <vscale x 1 x i1> @test_vector_reverse_for_masks_nxv1i1(<vscale x 1 x i1> %src) {
; CHECK-LABEL: test_vector_reverse_for_masks_nxv1i1:
; CHECK:       # %bb.0:
; CHECK-NEXT:    vsetvli a0, zero, e64,m1
; CHECK-NEXT:    addi a0, a0, -1
; CHECK-NEXT:    vid.v v1
; CHECK-NEXT:    vrsub.vx v1, v1, a0
; CHECK-NEXT:    vmv.v.i v2, 0
; CHECK-NEXT:    vmerge.vim v2, v2, 1, v0
; CHECK-NEXT:    vrgather.vv v3, v2, v1
; CHECK-NEXT:    vmsne.vi v0, v3, 0
; CHECK-NEXT:    ret
  %dst = call <vscale x 1 x i1> @llvm.experimental.vector.reverse.nxv1i1(<vscale x 1 x i1> %src)
  ret <vscale x 1 x i1> %dst
}

define <vscale x 2 x i1> @test_vector_reverse_for_masks_nxv2i1(<vscale x 2 x i1> %src) {
; CHECK-LABEL: test_vector_reverse_for_masks_nxv2i1:
; CHECK:       # %bb.0:
; CHECK-NEXT:    vsetvli a0, zero, e32,m1
; CHECK-NEXT:    addi a0, a0, -1
; CHECK-NEXT:    vid.v v1
; CHECK-NEXT:    vrsub.vx v1, v1, a0
; CHECK-NEXT:    vmv.v.i v2, 0
; CHECK-NEXT:    vmerge.vim v2, v2, 1, v0
; CHECK-NEXT:    vrgather.vv v3, v2, v1
; CHECK-NEXT:    vmsne.vi v0, v3, 0
; CHECK-NEXT:    ret
  %dst = call <vscale x 2 x i1> @llvm.experimental.vector.reverse.nxv2i1(<vscale x 2 x i1> %src)
  ret <vscale x 2 x i1> %dst
}

define <vscale x 4 x i1> @test_vector_reverse_for_masks_nxv4i1(<vscale x 4 x i1> %src) {
; CHECK-LABEL: test_vector_reverse_for_masks_nxv4i1:
; CHECK:       # %bb.0:
; CHECK-NEXT:    vsetvli a0, zero, e16,m1
; CHECK-NEXT:    addi a0, a0, -1
; CHECK-NEXT:    vid.v v1
; CHECK-NEXT:    vrsub.vx v1, v1, a0
; CHECK-NEXT:    vmv.v.i v2, 0
; CHECK-NEXT:    vmerge.vim v2, v2, 1, v0
; CHECK-NEXT:    vrgather.vv v3, v2, v1
; CHECK-NEXT:    vmsne.vi v0, v3, 0
; CHECK-NEXT:    ret
  %dst = call <vscale x 4 x i1> @llvm.experimental.vector.reverse.nxv4i1(<vscale x 4 x i1> %src)
  ret <vscale x 4 x i1> %dst
}

define <vscale x 8 x i1> @test_vector_reverse_for_masks_nxv8i1(<vscale x 8 x i1> %src) {
; CHECK-LABEL: test_vector_reverse_for_masks_nxv8i1:
; CHECK:       # %bb.0:
; CHECK-NEXT:    vsetvli a0, zero, e8,m1
; CHECK-NEXT:    addi a0, a0, -1
; CHECK-NEXT:    vid.v v1
; CHECK-NEXT:    vrsub.vx v1, v1, a0
; CHECK-NEXT:    vmv.v.i v2, 0
; CHECK-NEXT:    vmerge.vim v2, v2, 1, v0
; CHECK-NEXT:    vrgather.vv v3, v2, v1
; CHECK-NEXT:    vmsne.vi v0, v3, 0
; CHECK-NEXT:    ret
  %dst = call <vscale x 8 x i1> @llvm.experimental.vector.reverse.nxv8i1(<vscale x 8 x i1> %src)
  ret <vscale x 8 x i1> %dst
}

define <vscale x 16 x i1> @test_vector_reverse_for_masks_nxv16i1(<vscale x 16 x i1> %src) {
; CHECK-LABEL: test_vector_reverse_for_masks_nxv16i1:
; CHECK:       # %bb.0:
; CHECK-NEXT:    vsetvli a0, zero, e8,m2
; CHECK-NEXT:    addi a0, a0, -1
; CHECK-NEXT:    vid.v v2
; CHECK-NEXT:    vrsub.vx v2, v2, a0
; CHECK-NEXT:    vmv.v.i v4, 0
; CHECK-NEXT:    vmerge.vim v4, v4, 1, v0
; CHECK-NEXT:    vrgather.vv v6, v4, v2
; CHECK-NEXT:    vmsne.vi v0, v6, 0
; CHECK-NEXT:    ret
  %dst = call <vscale x 16 x i1> @llvm.experimental.vector.reverse.nxv16i1(<vscale x 16 x i1> %src)
  ret <vscale x 16 x i1> %dst
}

define <vscale x 32 x i1> @test_vector_reverse_for_masks_nxv32i1(<vscale x 32 x i1> %src) {
; CHECK-LABEL: test_vector_reverse_for_masks_nxv32i1:
; CHECK:       # %bb.0:
; CHECK-NEXT:    vsetvli a0, zero, e8,m4
; CHECK-NEXT:    addi a0, a0, -1
; CHECK-NEXT:    vid.v v4
; CHECK-NEXT:    vrsub.vx v4, v4, a0
; CHECK-NEXT:    vmv.v.i v16, 0
; CHECK-NEXT:    vmerge.vim v16, v16, 1, v0
; CHECK-NEXT:    vrgather.vv v20, v16, v4
; CHECK-NEXT:    vmsne.vi v0, v20, 0
; CHECK-NEXT:    ret
  %dst = call <vscale x 32 x i1> @llvm.experimental.vector.reverse.nxv32i1(<vscale x 32 x i1> %src)
  ret <vscale x 32 x i1> %dst
}

define <vscale x 64 x i1> @test_vector_reverse_for_masks_nxv64i1(<vscale x 64 x i1> %src) {
; CHECK-LABEL: test_vector_reverse_for_masks_nxv64i1:
; CHECK:       # %bb.0:
; CHECK-NEXT:    vsetvli a0, zero, e8,m8
; CHECK-NEXT:    addi a0, a0, -1
; CHECK-NEXT:    vid.v v16
; CHECK-NEXT:    vrsub.vx v16, v16, a0
; CHECK-NEXT:    vmv.v.i v8, 0
; CHECK-NEXT:    vmerge.vim v8, v8, 1, v0
; CHECK-NEXT:    vrgather.vv v24, v8, v16
; CHECK-NEXT:    vmsne.vi v0, v24, 0
; CHECK-NEXT:    ret
  %dst = call <vscale x 64 x i1> @llvm.experimental.vector.reverse.nxv64i1(<vscale x 64 x i1> %src)
  ret <vscale x 64 x i1> %dst
}

declare <vscale x 1 x i1> @llvm.experimental.vector.reverse.nxv1i1(<vscale x 1 x i1>)
declare <vscale x 2 x i1> @llvm.experimental.vector.reverse.nxv2i1(<vscale x 2 x i1>)
declare <vscale x 4 x i1> @llvm.experimental.vector.reverse.nxv4i1(<vscale x 4 x i1>)
declare <vscale x 8 x i1> @llvm.experimental.vector.reverse.nxv8i1(<vscale x 8 x i1>)
declare <vscale x 16 x i1> @llvm.experimental.vector.reverse.nxv16i1(<vscale x 16 x i1>)
declare <vscale x 32 x i1> @llvm.experimental.vector.reverse.nxv32i1(<vscale x 32 x i1>)
declare <vscale x 64 x i1> @llvm.experimental.vector.reverse.nxv64i1(<vscale x 64 x i1>)
