; NOTE: Assertions have been autogenerated by utils/update_test_checks.py
; RUN: opt -mtriple riscv64 -mattr +m,+a,+f,+d,+experimental-v \
; RUN:    -prefer-predicate-over-epilogue=predicate-dont-vectorize -S -O2 -vector-register-width-factor=8 < %s  -o - | FileCheck %s
; RUN: opt -mtriple riscv64 -mattr +m,+a,+f,+d,+experimental-v \
; RUN:    -prefer-predicate-over-epilogue=predicate-dont-vectorize -S -O2 < %s  -o - | FileCheck %s --check-prefix=CHECK1
; ModuleID = './reduce-sum.c'
source_filename = "./reduce-sum.c"
target datalayout = "e-m:e-p:64:64-i64:64-i128:128-n64-S128-v128:128:128-v256:128:128-v512:128:128-v1024:128:128"
target triple = "riscv64-unknown-linux-gnu"

; Function Attrs: norecurse nounwind readonly
define dso_local signext i32 @vec_redsum(i32 signext %N, i32* noalias nocapture readonly %a) local_unnamed_addr {
; CHECK-LABEL: @vec_redsum(
; CHECK-NEXT:  entry:
; CHECK-NEXT:    [[CMP6:%.*]] = icmp sgt i32 [[N:%.*]], 0
; CHECK-NEXT:    br i1 [[CMP6]], label [[FOR_BODY_PREHEADER:%.*]], label [[FOR_COND_CLEANUP:%.*]]
; CHECK:       for.body.preheader:
; CHECK-NEXT:    [[WIDE_TRIP_COUNT:%.*]] = zext i32 [[N]] to i64
; CHECK-NEXT:    [[STEP_VEC:%.*]] = call <vscale x 16 x i32> @llvm.experimental.vector.stepvector.nxv16i32()
; CHECK-NEXT:    br label [[VECTOR_BODY:%.*]]
; CHECK:       vector.body:
; CHECK-NEXT:    [[INDEX:%.*]] = phi i64 [ 0, [[FOR_BODY_PREHEADER]] ], [ [[INDEX_NEXT:%.*]], [[VECTOR_BODY]] ]
; CHECK-NEXT:    [[VEC_PHI:%.*]] = phi <vscale x 16 x i32> [ insertelement (<vscale x 16 x i32> zeroinitializer, i32 0, i32 0), [[FOR_BODY_PREHEADER]] ], [ [[TMP5:%.*]], [[VECTOR_BODY]] ]
; CHECK-NEXT:    [[TMP0:%.*]] = getelementptr inbounds i32, i32* [[A:%.*]], i64 [[INDEX]]
; CHECK-NEXT:    [[TMP1:%.*]] = sub i64 [[WIDE_TRIP_COUNT]], [[INDEX]]
; CHECK-NEXT:    [[TMP2:%.*]] = call i64 @llvm.epi.vsetvl(i64 [[TMP1]], i64 2, i64 3)
; CHECK-NEXT:    [[TMP3:%.*]] = trunc i64 [[TMP2]] to i32
; CHECK-NEXT:    [[TMP4:%.*]] = bitcast i32* [[TMP0]] to <vscale x 16 x i32>*
; CHECK-NEXT:    [[VP_OP_LOAD:%.*]] = call <vscale x 16 x i32> @llvm.vp.load.nxv16i32.p0nxv16i32(<vscale x 16 x i32>* [[TMP4]], i32 4, <vscale x 16 x i1> shufflevector (<vscale x 16 x i1> insertelement (<vscale x 16 x i1> undef, i1 true, i32 0), <vscale x 16 x i1> undef, <vscale x 16 x i32> zeroinitializer), i32 [[TMP3]])
; CHECK-NEXT:    [[VP_OP:%.*]] = call <vscale x 16 x i32> @llvm.vp.add.nxv16i32(<vscale x 16 x i32> [[VP_OP_LOAD]], <vscale x 16 x i32> [[VEC_PHI]], <vscale x 16 x i1> shufflevector (<vscale x 16 x i1> insertelement (<vscale x 16 x i1> undef, i1 true, i32 0), <vscale x 16 x i1> undef, <vscale x 16 x i32> zeroinitializer), i32 [[TMP3]])
; CHECK-NEXT:    [[EVL_SPLATINSERT:%.*]] = insertelement <vscale x 16 x i32> undef, i32 [[TMP3]], i32 0
; CHECK-NEXT:    [[EVL_SPLAT:%.*]] = shufflevector <vscale x 16 x i32> [[EVL_SPLATINSERT]], <vscale x 16 x i32> undef, <vscale x 16 x i32> zeroinitializer
; CHECK-NEXT:    [[EVL_MASK:%.*]] = icmp ult <vscale x 16 x i32> [[STEP_VEC]], [[EVL_SPLAT]]
; CHECK-NEXT:    [[TMP5]] = select <vscale x 16 x i1> [[EVL_MASK]], <vscale x 16 x i32> [[VP_OP]], <vscale x 16 x i32> [[VEC_PHI]]
; CHECK-NEXT:    [[TMP6:%.*]] = and i64 [[TMP2]], 4294967295
; CHECK-NEXT:    [[INDEX_NEXT]] = add i64 [[INDEX]], [[TMP6]]
; CHECK-NEXT:    [[TMP7:%.*]] = icmp eq i64 [[INDEX_NEXT]], [[WIDE_TRIP_COUNT]]
; CHECK-NEXT:    br i1 [[TMP7]], label [[MIDDLE_BLOCK:%.*]], label [[VECTOR_BODY]], [[LOOP0:!llvm.loop !.*]]
; CHECK:       middle.block:
; CHECK-NEXT:    [[TMP8:%.*]] = call i32 @llvm.vector.reduce.add.nxv16i32(<vscale x 16 x i32> [[TMP5]])
; CHECK-NEXT:    br label [[FOR_COND_CLEANUP]]
; CHECK:       for.cond.cleanup:
; CHECK-NEXT:    [[S_0_LCSSA:%.*]] = phi i32 [ 0, [[ENTRY:%.*]] ], [ [[TMP8]], [[MIDDLE_BLOCK]] ]
; CHECK-NEXT:    ret i32 [[S_0_LCSSA]]
;
; CHECK1-LABEL: @vec_redsum(
; CHECK1-NEXT:  entry:
; CHECK1-NEXT:    [[CMP6:%.*]] = icmp sgt i32 [[N:%.*]], 0
; CHECK1-NEXT:    br i1 [[CMP6]], label [[FOR_BODY_PREHEADER:%.*]], label [[FOR_COND_CLEANUP:%.*]]
; CHECK1:       for.body.preheader:
; CHECK1-NEXT:    [[WIDE_TRIP_COUNT:%.*]] = zext i32 [[N]] to i64
; CHECK1-NEXT:    [[STEP_VEC:%.*]] = call <vscale x 2 x i32> @llvm.experimental.vector.stepvector.nxv2i32()
; CHECK1-NEXT:    br label [[VECTOR_BODY:%.*]]
; CHECK1:       vector.body:
; CHECK1-NEXT:    [[INDEX:%.*]] = phi i64 [ 0, [[FOR_BODY_PREHEADER]] ], [ [[INDEX_NEXT:%.*]], [[VECTOR_BODY]] ]
; CHECK1-NEXT:    [[VEC_PHI:%.*]] = phi <vscale x 2 x i32> [ insertelement (<vscale x 2 x i32> zeroinitializer, i32 0, i32 0), [[FOR_BODY_PREHEADER]] ], [ [[TMP5:%.*]], [[VECTOR_BODY]] ]
; CHECK1-NEXT:    [[TMP0:%.*]] = getelementptr inbounds i32, i32* [[A:%.*]], i64 [[INDEX]]
; CHECK1-NEXT:    [[TMP1:%.*]] = sub i64 [[WIDE_TRIP_COUNT]], [[INDEX]]
; CHECK1-NEXT:    [[TMP2:%.*]] = call i64 @llvm.epi.vsetvl(i64 [[TMP1]], i64 2, i64 0)
; CHECK1-NEXT:    [[TMP3:%.*]] = trunc i64 [[TMP2]] to i32
; CHECK1-NEXT:    [[TMP4:%.*]] = bitcast i32* [[TMP0]] to <vscale x 2 x i32>*
; CHECK1-NEXT:    [[VP_OP_LOAD:%.*]] = call <vscale x 2 x i32> @llvm.vp.load.nxv2i32.p0nxv2i32(<vscale x 2 x i32>* [[TMP4]], i32 4, <vscale x 2 x i1> shufflevector (<vscale x 2 x i1> insertelement (<vscale x 2 x i1> undef, i1 true, i32 0), <vscale x 2 x i1> undef, <vscale x 2 x i32> zeroinitializer), i32 [[TMP3]])
; CHECK1-NEXT:    [[VP_OP:%.*]] = call <vscale x 2 x i32> @llvm.vp.add.nxv2i32(<vscale x 2 x i32> [[VP_OP_LOAD]], <vscale x 2 x i32> [[VEC_PHI]], <vscale x 2 x i1> shufflevector (<vscale x 2 x i1> insertelement (<vscale x 2 x i1> undef, i1 true, i32 0), <vscale x 2 x i1> undef, <vscale x 2 x i32> zeroinitializer), i32 [[TMP3]])
; CHECK1-NEXT:    [[EVL_SPLATINSERT:%.*]] = insertelement <vscale x 2 x i32> undef, i32 [[TMP3]], i32 0
; CHECK1-NEXT:    [[EVL_SPLAT:%.*]] = shufflevector <vscale x 2 x i32> [[EVL_SPLATINSERT]], <vscale x 2 x i32> undef, <vscale x 2 x i32> zeroinitializer
; CHECK1-NEXT:    [[EVL_MASK:%.*]] = icmp ult <vscale x 2 x i32> [[STEP_VEC]], [[EVL_SPLAT]]
; CHECK1-NEXT:    [[TMP5]] = select <vscale x 2 x i1> [[EVL_MASK]], <vscale x 2 x i32> [[VP_OP]], <vscale x 2 x i32> [[VEC_PHI]]
; CHECK1-NEXT:    [[TMP6:%.*]] = and i64 [[TMP2]], 4294967295
; CHECK1-NEXT:    [[INDEX_NEXT]] = add i64 [[INDEX]], [[TMP6]]
; CHECK1-NEXT:    [[TMP7:%.*]] = icmp eq i64 [[INDEX_NEXT]], [[WIDE_TRIP_COUNT]]
; CHECK1-NEXT:    br i1 [[TMP7]], label [[MIDDLE_BLOCK:%.*]], label [[VECTOR_BODY]], [[LOOP0:!llvm.loop !.*]]
; CHECK1:       middle.block:
; CHECK1-NEXT:    [[TMP8:%.*]] = call i32 @llvm.vector.reduce.add.nxv2i32(<vscale x 2 x i32> [[TMP5]])
; CHECK1-NEXT:    br label [[FOR_COND_CLEANUP]]
; CHECK1:       for.cond.cleanup:
; CHECK1-NEXT:    [[S_0_LCSSA:%.*]] = phi i32 [ 0, [[ENTRY:%.*]] ], [ [[TMP8]], [[MIDDLE_BLOCK]] ]
; CHECK1-NEXT:    ret i32 [[S_0_LCSSA]]
;
entry:
  %cmp6 = icmp sgt i32 %N, 0
  br i1 %cmp6, label %for.body.preheader, label %for.cond.cleanup

for.body.preheader:                               ; preds = %entry
  %wide.trip.count = zext i32 %N to i64
  br label %for.body

for.cond.cleanup.loopexit:                        ; preds = %for.body
  %add.lcssa = phi i32 [ %add, %for.body ]
  br label %for.cond.cleanup

for.cond.cleanup:                                 ; preds = %for.cond.cleanup.loopexit, %entry
  %s.0.lcssa = phi i32 [ 0, %entry ], [ %add.lcssa, %for.cond.cleanup.loopexit ]
  ret i32 %s.0.lcssa

for.body:                                         ; preds = %for.body, %for.body.preheader
  %indvars.iv = phi i64 [ 0, %for.body.preheader ], [ %indvars.iv.next, %for.body ]
  %s.07 = phi i32 [ 0, %for.body.preheader ], [ %add, %for.body ]
  %arrayidx = getelementptr inbounds i32, i32* %a, i64 %indvars.iv
  %0 = load i32, i32* %arrayidx, align 4
  %add = add nsw i32 %0, %s.07
  %indvars.iv.next = add nuw nsw i64 %indvars.iv, 1
  %exitcond = icmp eq i64 %indvars.iv.next, %wide.trip.count
  br i1 %exitcond, label %for.cond.cleanup.loopexit, label %for.body
}
