; NOTE: Assertions have been autogenerated by utils/update_test_checks.py
; RUN: opt -mtriple riscv64 -mattr +m,+a,+f,+d,+experimental-v \
; RUN:    -prefer-predicate-over-epilogue=predicate-dont-vectorize -S -O2 -vector-register-width-factor=8 < %s -o - | FileCheck %s
; RUN: opt -mtriple riscv64 -mattr +m,+a,+f,+d,+experimental-v \
; RUN:    -prefer-predicate-over-epilogue=predicate-dont-vectorize -S -O2 < %s -o - | FileCheck %s --check-prefix=CHECK1
; ModuleID = './simple-add-float.c'
source_filename = "./simple-add-float.c"
target datalayout = "e-m:e-p:64:64-i64:64-i128:128-n64-S128-v128:128:128-v256:128:128-v512:128:128-v1024:128:128"
target triple = "riscv64-unknown-linux-gnu"

; Function Attrs: nofree norecurse nounwind
define dso_local void @simple_add(i32 signext %N, float* noalias nocapture %c, float* noalias nocapture readonly %a, float* noalias nocapture readonly %b) local_unnamed_addr {
; CHECK-LABEL: @simple_add(
; CHECK-NEXT:  entry:
; CHECK-NEXT:    [[CMP10:%.*]] = icmp sgt i32 [[N:%.*]], 1
; CHECK-NEXT:    br i1 [[CMP10]], label [[FOR_BODY_PREHEADER:%.*]], label [[FOR_END:%.*]]
; CHECK:       for.body.preheader:
; CHECK-NEXT:    [[WIDE_TRIP_COUNT:%.*]] = zext i32 [[N]] to i64
; CHECK-NEXT:    [[TMP0:%.*]] = add nsw i64 [[WIDE_TRIP_COUNT]], -1
; CHECK-NEXT:    br label [[VECTOR_BODY:%.*]]
; CHECK:       vector.body:
; CHECK-NEXT:    [[INDEX:%.*]] = phi i64 [ 0, [[FOR_BODY_PREHEADER]] ], [ [[INDEX_NEXT:%.*]], [[VECTOR_BODY]] ]
; CHECK-NEXT:    [[OFFSET_IDX:%.*]] = add i64 [[INDEX]], 1
; CHECK-NEXT:    [[TMP1:%.*]] = getelementptr inbounds float, float* [[A:%.*]], i64 [[OFFSET_IDX]]
; CHECK-NEXT:    [[TMP2:%.*]] = sub i64 [[TMP0]], [[INDEX]]
; CHECK-NEXT:    [[TMP3:%.*]] = call i64 @llvm.epi.vsetvl(i64 [[TMP2]], i64 2, i64 3)
; CHECK-NEXT:    [[TMP4:%.*]] = trunc i64 [[TMP3]] to i32
; CHECK-NEXT:    [[TMP5:%.*]] = bitcast float* [[TMP1]] to <vscale x 16 x float>*
; CHECK-NEXT:    [[VP_OP_LOAD:%.*]] = call <vscale x 16 x float> @llvm.vp.load.nxv16f32.p0nxv16f32(<vscale x 16 x float>* [[TMP5]], i32 4, <vscale x 16 x i1> shufflevector (<vscale x 16 x i1> insertelement (<vscale x 16 x i1> undef, i1 true, i32 0), <vscale x 16 x i1> undef, <vscale x 16 x i32> zeroinitializer), i32 [[TMP4]])
; CHECK-NEXT:    [[TMP6:%.*]] = getelementptr inbounds float, float* [[B:%.*]], i64 [[OFFSET_IDX]]
; CHECK-NEXT:    [[TMP7:%.*]] = bitcast float* [[TMP6]] to <vscale x 16 x float>*
; CHECK-NEXT:    [[VP_OP_LOAD11:%.*]] = call <vscale x 16 x float> @llvm.vp.load.nxv16f32.p0nxv16f32(<vscale x 16 x float>* [[TMP7]], i32 4, <vscale x 16 x i1> shufflevector (<vscale x 16 x i1> insertelement (<vscale x 16 x i1> undef, i1 true, i32 0), <vscale x 16 x i1> undef, <vscale x 16 x i32> zeroinitializer), i32 [[TMP4]])
; CHECK-NEXT:    [[VP_OP:%.*]] = call <vscale x 16 x float> @llvm.vp.fadd.nxv16f32(<vscale x 16 x float> [[VP_OP_LOAD]], <vscale x 16 x float> [[VP_OP_LOAD11]], metadata !"round.tonearest", metadata !"fpexcept.ignore", <vscale x 16 x i1> shufflevector (<vscale x 16 x i1> insertelement (<vscale x 16 x i1> undef, i1 true, i32 0), <vscale x 16 x i1> undef, <vscale x 16 x i32> zeroinitializer), i32 [[TMP4]])
; CHECK-NEXT:    [[TMP8:%.*]] = getelementptr inbounds float, float* [[C:%.*]], i64 [[OFFSET_IDX]]
; CHECK-NEXT:    [[TMP9:%.*]] = bitcast float* [[TMP8]] to <vscale x 16 x float>*
; CHECK-NEXT:    call void @llvm.vp.store.nxv16f32.p0nxv16f32(<vscale x 16 x float> [[VP_OP]], <vscale x 16 x float>* [[TMP9]], i32 4, <vscale x 16 x i1> shufflevector (<vscale x 16 x i1> insertelement (<vscale x 16 x i1> undef, i1 true, i32 0), <vscale x 16 x i1> undef, <vscale x 16 x i32> zeroinitializer), i32 [[TMP4]])
; CHECK-NEXT:    [[TMP10:%.*]] = and i64 [[TMP3]], 4294967295
; CHECK-NEXT:    [[INDEX_NEXT]] = add i64 [[INDEX]], [[TMP10]]
; CHECK-NEXT:    [[TMP11:%.*]] = icmp eq i64 [[INDEX_NEXT]], [[TMP0]]
; CHECK-NEXT:    br i1 [[TMP11]], label [[FOR_END]], label [[VECTOR_BODY]], [[LOOP0:!llvm.loop !.*]]
; CHECK:       for.end:
; CHECK-NEXT:    ret void
;
; CHECK1-LABEL: @simple_add(
; CHECK1-NEXT:  entry:
; CHECK1-NEXT:    [[CMP10:%.*]] = icmp sgt i32 [[N:%.*]], 1
; CHECK1-NEXT:    br i1 [[CMP10]], label [[FOR_BODY_PREHEADER:%.*]], label [[FOR_END:%.*]]
; CHECK1:       for.body.preheader:
; CHECK1-NEXT:    [[WIDE_TRIP_COUNT:%.*]] = zext i32 [[N]] to i64
; CHECK1-NEXT:    [[TMP0:%.*]] = add nsw i64 [[WIDE_TRIP_COUNT]], -1
; CHECK1-NEXT:    br label [[VECTOR_BODY:%.*]]
; CHECK1:       vector.body:
; CHECK1-NEXT:    [[INDEX:%.*]] = phi i64 [ 0, [[FOR_BODY_PREHEADER]] ], [ [[INDEX_NEXT:%.*]], [[VECTOR_BODY]] ]
; CHECK1-NEXT:    [[OFFSET_IDX:%.*]] = add i64 [[INDEX]], 1
; CHECK1-NEXT:    [[TMP1:%.*]] = getelementptr inbounds float, float* [[A:%.*]], i64 [[OFFSET_IDX]]
; CHECK1-NEXT:    [[TMP2:%.*]] = sub i64 [[TMP0]], [[INDEX]]
; CHECK1-NEXT:    [[TMP3:%.*]] = call i64 @llvm.epi.vsetvl(i64 [[TMP2]], i64 2, i64 0)
; CHECK1-NEXT:    [[TMP4:%.*]] = trunc i64 [[TMP3]] to i32
; CHECK1-NEXT:    [[TMP5:%.*]] = bitcast float* [[TMP1]] to <vscale x 2 x float>*
; CHECK1-NEXT:    [[VP_OP_LOAD:%.*]] = call <vscale x 2 x float> @llvm.vp.load.nxv2f32.p0nxv2f32(<vscale x 2 x float>* [[TMP5]], i32 4, <vscale x 2 x i1> shufflevector (<vscale x 2 x i1> insertelement (<vscale x 2 x i1> undef, i1 true, i32 0), <vscale x 2 x i1> undef, <vscale x 2 x i32> zeroinitializer), i32 [[TMP4]])
; CHECK1-NEXT:    [[TMP6:%.*]] = getelementptr inbounds float, float* [[B:%.*]], i64 [[OFFSET_IDX]]
; CHECK1-NEXT:    [[TMP7:%.*]] = bitcast float* [[TMP6]] to <vscale x 2 x float>*
; CHECK1-NEXT:    [[VP_OP_LOAD11:%.*]] = call <vscale x 2 x float> @llvm.vp.load.nxv2f32.p0nxv2f32(<vscale x 2 x float>* [[TMP7]], i32 4, <vscale x 2 x i1> shufflevector (<vscale x 2 x i1> insertelement (<vscale x 2 x i1> undef, i1 true, i32 0), <vscale x 2 x i1> undef, <vscale x 2 x i32> zeroinitializer), i32 [[TMP4]])
; CHECK1-NEXT:    [[VP_OP:%.*]] = call <vscale x 2 x float> @llvm.vp.fadd.nxv2f32(<vscale x 2 x float> [[VP_OP_LOAD]], <vscale x 2 x float> [[VP_OP_LOAD11]], metadata !"round.tonearest", metadata !"fpexcept.ignore", <vscale x 2 x i1> shufflevector (<vscale x 2 x i1> insertelement (<vscale x 2 x i1> undef, i1 true, i32 0), <vscale x 2 x i1> undef, <vscale x 2 x i32> zeroinitializer), i32 [[TMP4]])
; CHECK1-NEXT:    [[TMP8:%.*]] = getelementptr inbounds float, float* [[C:%.*]], i64 [[OFFSET_IDX]]
; CHECK1-NEXT:    [[TMP9:%.*]] = bitcast float* [[TMP8]] to <vscale x 2 x float>*
; CHECK1-NEXT:    call void @llvm.vp.store.nxv2f32.p0nxv2f32(<vscale x 2 x float> [[VP_OP]], <vscale x 2 x float>* [[TMP9]], i32 4, <vscale x 2 x i1> shufflevector (<vscale x 2 x i1> insertelement (<vscale x 2 x i1> undef, i1 true, i32 0), <vscale x 2 x i1> undef, <vscale x 2 x i32> zeroinitializer), i32 [[TMP4]])
; CHECK1-NEXT:    [[TMP10:%.*]] = and i64 [[TMP3]], 4294967295
; CHECK1-NEXT:    [[INDEX_NEXT]] = add i64 [[INDEX]], [[TMP10]]
; CHECK1-NEXT:    [[TMP11:%.*]] = icmp eq i64 [[INDEX_NEXT]], [[TMP0]]
; CHECK1-NEXT:    br i1 [[TMP11]], label [[FOR_END]], label [[VECTOR_BODY]], [[LOOP0:!llvm.loop !.*]]
; CHECK1:       for.end:
; CHECK1-NEXT:    ret void
;
entry:
  %cmp10 = icmp sgt i32 %N, 1
  br i1 %cmp10, label %for.body.preheader, label %for.end

for.body.preheader:                               ; preds = %entry
  %wide.trip.count = zext i32 %N to i64
  br label %for.body

for.body:                                         ; preds = %for.body, %for.body.preheader
  %indvars.iv = phi i64 [ 1, %for.body.preheader ], [ %indvars.iv.next, %for.body ]
  %arrayidx = getelementptr inbounds float, float* %a, i64 %indvars.iv
  %0 = load float, float* %arrayidx, align 4
  %arrayidx2 = getelementptr inbounds float, float* %b, i64 %indvars.iv
  %1 = load float, float* %arrayidx2, align 4
  %add = fadd float %0, %1
  %arrayidx4 = getelementptr inbounds float, float* %c, i64 %indvars.iv
  store float %add, float* %arrayidx4, align 4
  %indvars.iv.next = add nuw nsw i64 %indvars.iv, 1
  %exitcond = icmp eq i64 %indvars.iv.next, %wide.trip.count
  br i1 %exitcond, label %for.end.loopexit, label %for.body

for.end.loopexit:                                 ; preds = %for.body
  br label %for.end

for.end:                                          ; preds = %for.end.loopexit, %entry
  ret void
}
