; NOTE: Assertions have been autogenerated by utils/update_test_checks.py
; RUN: opt -mtriple riscv64 -mattr +m,+a,+f,+d,+experimental-v -S \
; RUN:    -loop-vectorize -vector-register-width-factor=8 < %s -o - | FileCheck %s
; RUN: opt -mtriple riscv64 -mattr +m,+a,+f,+d,+experimental-v -S \
; RUN:    -loop-vectorize < %s -o - | FileCheck %s --check-prefix=CHECK1
; ModuleID = 't2.i'
source_filename = "t2.i"
target datalayout = "e-m:e-p:64:64-i64:64-i128:128-n64-S128"
target triple = "riscv64-unknown-linux-gnu"

; Function Attrs: nounwind readnone
define dso_local signext i32 @main(i32 signext %argc, i8** nocapture readnone %argv) local_unnamed_addr #0 {
; CHECK-LABEL: @main(
; CHECK-NEXT:  entry:
; CHECK-NEXT:    [[A:%.*]] = alloca [1024 x double], align 8
; CHECK-NEXT:    [[B:%.*]] = alloca [1024 x double], align 8
; CHECK-NEXT:    [[TMP0:%.*]] = bitcast [1024 x double]* [[A]] to i8*
; CHECK-NEXT:    call void @llvm.lifetime.start.p0i8(i64 8192, i8* nonnull [[TMP0]]) [[ATTR4:#.*]]
; CHECK-NEXT:    [[TMP1:%.*]] = bitcast [1024 x double]* [[B]] to i8*
; CHECK-NEXT:    call void @llvm.lifetime.start.p0i8(i64 8192, i8* nonnull [[TMP1]]) [[ATTR4]]
; CHECK-NEXT:    [[TMP2:%.*]] = call i64 @llvm.vscale.i64()
; CHECK-NEXT:    [[STEP_VSCALE:%.*]] = mul i64 [[TMP2]], 8
; CHECK-NEXT:    [[MIN_ITERS_CHECK:%.*]] = icmp ult i64 1024, [[STEP_VSCALE]]
; CHECK-NEXT:    br i1 [[MIN_ITERS_CHECK]], label [[SCALAR_PH:%.*]], label [[VECTOR_PH:%.*]]
; CHECK:       vector.ph:
; CHECK-NEXT:    [[TMP3:%.*]] = call i64 @llvm.vscale.i64()
; CHECK-NEXT:    [[STEP_VSCALE1:%.*]] = mul i64 8, [[TMP3]]
; CHECK-NEXT:    [[N_MOD_VF:%.*]] = urem i64 1024, [[STEP_VSCALE1]]
; CHECK-NEXT:    [[N_VEC:%.*]] = sub i64 1024, [[N_MOD_VF]]
; CHECK-NEXT:    [[DOTSPLATINSERT:%.*]] = insertelement <vscale x 8 x i64> undef, i64 0, i32 0
; CHECK-NEXT:    [[DOTSPLAT:%.*]] = shufflevector <vscale x 8 x i64> [[DOTSPLATINSERT]], <vscale x 8 x i64> undef, <vscale x 8 x i32> zeroinitializer
; CHECK-NEXT:    [[TMP4:%.*]] = call <vscale x 8 x i64> @llvm.experimental.vector.stepvector.nxv8i64()
; CHECK-NEXT:    [[DOTSPLATINSERT2:%.*]] = insertelement <vscale x 8 x i64> undef, i64 0, i32 0
; CHECK-NEXT:    [[DOTSPLAT3:%.*]] = shufflevector <vscale x 8 x i64> [[DOTSPLATINSERT2]], <vscale x 8 x i64> undef, <vscale x 8 x i32> zeroinitializer
; CHECK-NEXT:    [[TMP5:%.*]] = add <vscale x 8 x i64> [[TMP4]], [[DOTSPLAT3]]
; CHECK-NEXT:    [[DOTSPLATINSERT4:%.*]] = insertelement <vscale x 8 x i64> undef, i64 1, i32 0
; CHECK-NEXT:    [[DOTSPLAT5:%.*]] = shufflevector <vscale x 8 x i64> [[DOTSPLATINSERT4]], <vscale x 8 x i64> undef, <vscale x 8 x i32> zeroinitializer
; CHECK-NEXT:    [[TMP6:%.*]] = mul <vscale x 8 x i64> [[TMP5]], [[DOTSPLAT5]]
; CHECK-NEXT:    [[INDUCTION:%.*]] = add <vscale x 8 x i64> [[DOTSPLAT]], [[TMP6]]
; CHECK-NEXT:    [[TMP7:%.*]] = call i64 @llvm.vscale.i64()
; CHECK-NEXT:    [[TMP8:%.*]] = mul i64 8, [[TMP7]]
; CHECK-NEXT:    [[DOTSPLATINSERT6:%.*]] = insertelement <vscale x 8 x i64> undef, i64 [[TMP8]], i32 0
; CHECK-NEXT:    [[DOTSPLAT7:%.*]] = shufflevector <vscale x 8 x i64> [[DOTSPLATINSERT6]], <vscale x 8 x i64> undef, <vscale x 8 x i32> zeroinitializer
; CHECK-NEXT:    [[DOTSPLATINSERT8:%.*]] = insertelement <vscale x 8 x i32> undef, i32 0, i32 0
; CHECK-NEXT:    [[DOTSPLAT9:%.*]] = shufflevector <vscale x 8 x i32> [[DOTSPLATINSERT8]], <vscale x 8 x i32> undef, <vscale x 8 x i32> zeroinitializer
; CHECK-NEXT:    [[TMP9:%.*]] = call <vscale x 8 x i32> @llvm.experimental.vector.stepvector.nxv8i32()
; CHECK-NEXT:    [[DOTSPLATINSERT10:%.*]] = insertelement <vscale x 8 x i32> undef, i32 0, i32 0
; CHECK-NEXT:    [[DOTSPLAT11:%.*]] = shufflevector <vscale x 8 x i32> [[DOTSPLATINSERT10]], <vscale x 8 x i32> undef, <vscale x 8 x i32> zeroinitializer
; CHECK-NEXT:    [[TMP10:%.*]] = add <vscale x 8 x i32> [[TMP9]], [[DOTSPLAT11]]
; CHECK-NEXT:    [[DOTSPLATINSERT12:%.*]] = insertelement <vscale x 8 x i32> undef, i32 1, i32 0
; CHECK-NEXT:    [[DOTSPLAT13:%.*]] = shufflevector <vscale x 8 x i32> [[DOTSPLATINSERT12]], <vscale x 8 x i32> undef, <vscale x 8 x i32> zeroinitializer
; CHECK-NEXT:    [[TMP11:%.*]] = mul <vscale x 8 x i32> [[TMP10]], [[DOTSPLAT13]]
; CHECK-NEXT:    [[INDUCTION14:%.*]] = add <vscale x 8 x i32> [[DOTSPLAT9]], [[TMP11]]
; CHECK-NEXT:    [[TMP12:%.*]] = call i32 @llvm.vscale.i32()
; CHECK-NEXT:    [[TMP13:%.*]] = mul i32 8, [[TMP12]]
; CHECK-NEXT:    [[DOTSPLATINSERT15:%.*]] = insertelement <vscale x 8 x i32> undef, i32 [[TMP13]], i32 0
; CHECK-NEXT:    [[DOTSPLAT16:%.*]] = shufflevector <vscale x 8 x i32> [[DOTSPLATINSERT15]], <vscale x 8 x i32> undef, <vscale x 8 x i32> zeroinitializer
; CHECK-NEXT:    [[DOTSPLATINSERT19:%.*]] = insertelement <vscale x 8 x i32> undef, i32 0, i32 0
; CHECK-NEXT:    [[DOTSPLAT20:%.*]] = shufflevector <vscale x 8 x i32> [[DOTSPLATINSERT19]], <vscale x 8 x i32> undef, <vscale x 8 x i32> zeroinitializer
; CHECK-NEXT:    [[TMP14:%.*]] = call <vscale x 8 x i32> @llvm.experimental.vector.stepvector.nxv8i32()
; CHECK-NEXT:    [[DOTSPLATINSERT21:%.*]] = insertelement <vscale x 8 x i32> undef, i32 0, i32 0
; CHECK-NEXT:    [[DOTSPLAT22:%.*]] = shufflevector <vscale x 8 x i32> [[DOTSPLATINSERT21]], <vscale x 8 x i32> undef, <vscale x 8 x i32> zeroinitializer
; CHECK-NEXT:    [[TMP15:%.*]] = add <vscale x 8 x i32> [[TMP14]], [[DOTSPLAT22]]
; CHECK-NEXT:    [[DOTSPLATINSERT23:%.*]] = insertelement <vscale x 8 x i32> undef, i32 1, i32 0
; CHECK-NEXT:    [[DOTSPLAT24:%.*]] = shufflevector <vscale x 8 x i32> [[DOTSPLATINSERT23]], <vscale x 8 x i32> undef, <vscale x 8 x i32> zeroinitializer
; CHECK-NEXT:    [[TMP16:%.*]] = mul <vscale x 8 x i32> [[TMP15]], [[DOTSPLAT24]]
; CHECK-NEXT:    [[INDUCTION25:%.*]] = add <vscale x 8 x i32> [[DOTSPLAT20]], [[TMP16]]
; CHECK-NEXT:    [[TMP17:%.*]] = call i32 @llvm.vscale.i32()
; CHECK-NEXT:    [[TMP18:%.*]] = mul i32 8, [[TMP17]]
; CHECK-NEXT:    [[DOTSPLATINSERT26:%.*]] = insertelement <vscale x 8 x i32> undef, i32 [[TMP18]], i32 0
; CHECK-NEXT:    [[DOTSPLAT27:%.*]] = shufflevector <vscale x 8 x i32> [[DOTSPLATINSERT26]], <vscale x 8 x i32> undef, <vscale x 8 x i32> zeroinitializer
; CHECK-NEXT:    [[BROADCAST_SPLATINSERT:%.*]] = insertelement <vscale x 8 x i32> undef, i32 1024, i32 0
; CHECK-NEXT:    [[BROADCAST_SPLAT:%.*]] = shufflevector <vscale x 8 x i32> [[BROADCAST_SPLATINSERT]], <vscale x 8 x i32> undef, <vscale x 8 x i32> zeroinitializer
; CHECK-NEXT:    br label [[VECTOR_BODY:%.*]]
; CHECK:       vector.body:
; CHECK-NEXT:    [[INDEX:%.*]] = phi i64 [ 0, [[VECTOR_PH]] ], [ [[INDEX_NEXT:%.*]], [[VECTOR_BODY]] ]
; CHECK-NEXT:    [[VEC_IND:%.*]] = phi <vscale x 8 x i64> [ [[INDUCTION]], [[VECTOR_PH]] ], [ [[VEC_IND_NEXT:%.*]], [[VECTOR_BODY]] ]
; CHECK-NEXT:    [[VEC_IND17:%.*]] = phi <vscale x 8 x i32> [ [[INDUCTION14]], [[VECTOR_PH]] ], [ [[VEC_IND_NEXT18:%.*]], [[VECTOR_BODY]] ]
; CHECK-NEXT:    [[VEC_IND28:%.*]] = phi <vscale x 8 x i32> [ [[INDUCTION25]], [[VECTOR_PH]] ], [ [[VEC_IND_NEXT29:%.*]], [[VECTOR_BODY]] ]
; CHECK-NEXT:    [[TMP19:%.*]] = sitofp <vscale x 8 x i32> [[VEC_IND17]] to <vscale x 8 x double>
; CHECK-NEXT:    [[TMP20:%.*]] = extractelement <vscale x 8 x i64> [[VEC_IND]], i32 0
; CHECK-NEXT:    [[TMP21:%.*]] = getelementptr inbounds [1024 x double], [1024 x double]* [[A]], i64 0, i64 [[TMP20]]
; CHECK-NEXT:    [[TMP22:%.*]] = getelementptr inbounds double, double* [[TMP21]], i32 0
; CHECK-NEXT:    [[TMP23:%.*]] = bitcast double* [[TMP22]] to <vscale x 8 x double>*
; CHECK-NEXT:    store <vscale x 8 x double> [[TMP19]], <vscale x 8 x double>* [[TMP23]], align 8, [[TBAA2:!tbaa !.*]]
; CHECK-NEXT:    [[TMP24:%.*]] = sub <vscale x 8 x i32> [[BROADCAST_SPLAT]], [[VEC_IND28]]
; CHECK-NEXT:    [[TMP25:%.*]] = sitofp <vscale x 8 x i32> [[TMP24]] to <vscale x 8 x double>
; CHECK-NEXT:    [[TMP26:%.*]] = getelementptr inbounds [1024 x double], [1024 x double]* [[B]], i64 0, i64 [[TMP20]]
; CHECK-NEXT:    [[TMP27:%.*]] = getelementptr inbounds double, double* [[TMP26]], i32 0
; CHECK-NEXT:    [[TMP28:%.*]] = bitcast double* [[TMP27]] to <vscale x 8 x double>*
; CHECK-NEXT:    store <vscale x 8 x double> [[TMP25]], <vscale x 8 x double>* [[TMP28]], align 8, [[TBAA2]]
; CHECK-NEXT:    [[TMP29:%.*]] = call i64 @llvm.vscale.i64()
; CHECK-NEXT:    [[INDEX_VSCALE:%.*]] = mul i64 [[TMP29]], 8
; CHECK-NEXT:    [[INDEX_NEXT]] = add i64 [[INDEX]], [[INDEX_VSCALE]]
; CHECK-NEXT:    [[VEC_IND_NEXT]] = add <vscale x 8 x i64> [[VEC_IND]], [[DOTSPLAT7]]
; CHECK-NEXT:    [[VEC_IND_NEXT18]] = add <vscale x 8 x i32> [[VEC_IND17]], [[DOTSPLAT16]]
; CHECK-NEXT:    [[VEC_IND_NEXT29]] = add <vscale x 8 x i32> [[VEC_IND28]], [[DOTSPLAT27]]
; CHECK-NEXT:    [[TMP30:%.*]] = icmp eq i64 [[INDEX_NEXT]], [[N_VEC]]
; CHECK-NEXT:    br i1 [[TMP30]], label [[MIDDLE_BLOCK:%.*]], label [[VECTOR_BODY]], [[LOOP6:!llvm.loop !.*]]
; CHECK:       middle.block:
; CHECK-NEXT:    [[CMP_N:%.*]] = icmp eq i64 1024, [[N_VEC]]
; CHECK-NEXT:    br i1 [[CMP_N]], label [[FOR_COND_CLEANUP:%.*]], label [[SCALAR_PH]]
; CHECK:       scalar.ph:
; CHECK-NEXT:    [[BC_RESUME_VAL:%.*]] = phi i64 [ [[N_VEC]], [[MIDDLE_BLOCK]] ], [ 0, [[ENTRY:%.*]] ]
; CHECK-NEXT:    br label [[FOR_BODY:%.*]]
; CHECK:       for.cond.cleanup:
; CHECK-NEXT:    [[IDXPROM4:%.*]] = sext i32 [[ARGC:%.*]] to i64
; CHECK-NEXT:    [[ARRAYIDX5:%.*]] = getelementptr inbounds [1024 x double], [1024 x double]* [[A]], i64 0, i64 [[IDXPROM4]]
; CHECK-NEXT:    [[TMP31:%.*]] = load double, double* [[ARRAYIDX5]], align 8, [[TBAA2]]
; CHECK-NEXT:    [[ARRAYIDX7:%.*]] = getelementptr inbounds [1024 x double], [1024 x double]* [[B]], i64 0, i64 [[IDXPROM4]]
; CHECK-NEXT:    [[TMP32:%.*]] = load double, double* [[ARRAYIDX7]], align 8, [[TBAA2]]
; CHECK-NEXT:    [[ADD:%.*]] = fadd double [[TMP31]], [[TMP32]]
; CHECK-NEXT:    [[CONV8:%.*]] = fptosi double [[ADD]] to i32
; CHECK-NEXT:    call void @llvm.lifetime.end.p0i8(i64 8192, i8* nonnull [[TMP1]]) [[ATTR4]]
; CHECK-NEXT:    call void @llvm.lifetime.end.p0i8(i64 8192, i8* nonnull [[TMP0]]) [[ATTR4]]
; CHECK-NEXT:    ret i32 [[CONV8]]
; CHECK:       for.body:
; CHECK-NEXT:    [[INDVARS_IV:%.*]] = phi i64 [ [[BC_RESUME_VAL]], [[SCALAR_PH]] ], [ [[INDVARS_IV_NEXT:%.*]], [[FOR_BODY]] ]
; CHECK-NEXT:    [[TMP33:%.*]] = trunc i64 [[INDVARS_IV]] to i32
; CHECK-NEXT:    [[CONV:%.*]] = sitofp i32 [[TMP33]] to double
; CHECK-NEXT:    [[ARRAYIDX:%.*]] = getelementptr inbounds [1024 x double], [1024 x double]* [[A]], i64 0, i64 [[INDVARS_IV]]
; CHECK-NEXT:    store double [[CONV]], double* [[ARRAYIDX]], align 8, [[TBAA2]]
; CHECK-NEXT:    [[TMP34:%.*]] = trunc i64 [[INDVARS_IV]] to i32
; CHECK-NEXT:    [[TMP35:%.*]] = sub i32 1024, [[TMP34]]
; CHECK-NEXT:    [[CONV1:%.*]] = sitofp i32 [[TMP35]] to double
; CHECK-NEXT:    [[ARRAYIDX3:%.*]] = getelementptr inbounds [1024 x double], [1024 x double]* [[B]], i64 0, i64 [[INDVARS_IV]]
; CHECK-NEXT:    store double [[CONV1]], double* [[ARRAYIDX3]], align 8, [[TBAA2]]
; CHECK-NEXT:    [[INDVARS_IV_NEXT]] = add nuw nsw i64 [[INDVARS_IV]], 1
; CHECK-NEXT:    [[EXITCOND:%.*]] = icmp eq i64 [[INDVARS_IV_NEXT]], 1024
; CHECK-NEXT:    br i1 [[EXITCOND]], label [[FOR_COND_CLEANUP]], label [[FOR_BODY]], [[LOOP8:!llvm.loop !.*]]
;
; CHECK1-LABEL: @main(
; CHECK1-NEXT:  entry:
; CHECK1-NEXT:    [[A:%.*]] = alloca [1024 x double], align 8
; CHECK1-NEXT:    [[B:%.*]] = alloca [1024 x double], align 8
; CHECK1-NEXT:    [[TMP0:%.*]] = bitcast [1024 x double]* [[A]] to i8*
; CHECK1-NEXT:    call void @llvm.lifetime.start.p0i8(i64 8192, i8* nonnull [[TMP0]]) [[ATTR4:#.*]]
; CHECK1-NEXT:    [[TMP1:%.*]] = bitcast [1024 x double]* [[B]] to i8*
; CHECK1-NEXT:    call void @llvm.lifetime.start.p0i8(i64 8192, i8* nonnull [[TMP1]]) [[ATTR4]]
; CHECK1-NEXT:    [[TMP2:%.*]] = call i64 @llvm.vscale.i64()
; CHECK1-NEXT:    [[STEP_VSCALE:%.*]] = mul i64 [[TMP2]], 1
; CHECK1-NEXT:    [[MIN_ITERS_CHECK:%.*]] = icmp ult i64 1024, [[STEP_VSCALE]]
; CHECK1-NEXT:    br i1 [[MIN_ITERS_CHECK]], label [[SCALAR_PH:%.*]], label [[VECTOR_PH:%.*]]
; CHECK1:       vector.ph:
; CHECK1-NEXT:    [[TMP3:%.*]] = call i64 @llvm.vscale.i64()
; CHECK1-NEXT:    [[STEP_VSCALE1:%.*]] = mul i64 1, [[TMP3]]
; CHECK1-NEXT:    [[N_MOD_VF:%.*]] = urem i64 1024, [[STEP_VSCALE1]]
; CHECK1-NEXT:    [[N_VEC:%.*]] = sub i64 1024, [[N_MOD_VF]]
; CHECK1-NEXT:    [[DOTSPLATINSERT:%.*]] = insertelement <vscale x 1 x i64> undef, i64 0, i32 0
; CHECK1-NEXT:    [[DOTSPLAT:%.*]] = shufflevector <vscale x 1 x i64> [[DOTSPLATINSERT]], <vscale x 1 x i64> undef, <vscale x 1 x i32> zeroinitializer
; CHECK1-NEXT:    [[TMP4:%.*]] = call <vscale x 1 x i64> @llvm.experimental.vector.stepvector.nxv1i64()
; CHECK1-NEXT:    [[DOTSPLATINSERT2:%.*]] = insertelement <vscale x 1 x i64> undef, i64 0, i32 0
; CHECK1-NEXT:    [[DOTSPLAT3:%.*]] = shufflevector <vscale x 1 x i64> [[DOTSPLATINSERT2]], <vscale x 1 x i64> undef, <vscale x 1 x i32> zeroinitializer
; CHECK1-NEXT:    [[TMP5:%.*]] = add <vscale x 1 x i64> [[TMP4]], [[DOTSPLAT3]]
; CHECK1-NEXT:    [[DOTSPLATINSERT4:%.*]] = insertelement <vscale x 1 x i64> undef, i64 1, i32 0
; CHECK1-NEXT:    [[DOTSPLAT5:%.*]] = shufflevector <vscale x 1 x i64> [[DOTSPLATINSERT4]], <vscale x 1 x i64> undef, <vscale x 1 x i32> zeroinitializer
; CHECK1-NEXT:    [[TMP6:%.*]] = mul <vscale x 1 x i64> [[TMP5]], [[DOTSPLAT5]]
; CHECK1-NEXT:    [[INDUCTION:%.*]] = add <vscale x 1 x i64> [[DOTSPLAT]], [[TMP6]]
; CHECK1-NEXT:    [[TMP7:%.*]] = call i64 @llvm.vscale.i64()
; CHECK1-NEXT:    [[TMP8:%.*]] = mul i64 1, [[TMP7]]
; CHECK1-NEXT:    [[DOTSPLATINSERT6:%.*]] = insertelement <vscale x 1 x i64> undef, i64 [[TMP8]], i32 0
; CHECK1-NEXT:    [[DOTSPLAT7:%.*]] = shufflevector <vscale x 1 x i64> [[DOTSPLATINSERT6]], <vscale x 1 x i64> undef, <vscale x 1 x i32> zeroinitializer
; CHECK1-NEXT:    [[DOTSPLATINSERT8:%.*]] = insertelement <vscale x 1 x i32> undef, i32 0, i32 0
; CHECK1-NEXT:    [[DOTSPLAT9:%.*]] = shufflevector <vscale x 1 x i32> [[DOTSPLATINSERT8]], <vscale x 1 x i32> undef, <vscale x 1 x i32> zeroinitializer
; CHECK1-NEXT:    [[TMP9:%.*]] = call <vscale x 1 x i32> @llvm.experimental.vector.stepvector.nxv1i32()
; CHECK1-NEXT:    [[DOTSPLATINSERT10:%.*]] = insertelement <vscale x 1 x i32> undef, i32 0, i32 0
; CHECK1-NEXT:    [[DOTSPLAT11:%.*]] = shufflevector <vscale x 1 x i32> [[DOTSPLATINSERT10]], <vscale x 1 x i32> undef, <vscale x 1 x i32> zeroinitializer
; CHECK1-NEXT:    [[TMP10:%.*]] = add <vscale x 1 x i32> [[TMP9]], [[DOTSPLAT11]]
; CHECK1-NEXT:    [[DOTSPLATINSERT12:%.*]] = insertelement <vscale x 1 x i32> undef, i32 1, i32 0
; CHECK1-NEXT:    [[DOTSPLAT13:%.*]] = shufflevector <vscale x 1 x i32> [[DOTSPLATINSERT12]], <vscale x 1 x i32> undef, <vscale x 1 x i32> zeroinitializer
; CHECK1-NEXT:    [[TMP11:%.*]] = mul <vscale x 1 x i32> [[TMP10]], [[DOTSPLAT13]]
; CHECK1-NEXT:    [[INDUCTION14:%.*]] = add <vscale x 1 x i32> [[DOTSPLAT9]], [[TMP11]]
; CHECK1-NEXT:    [[TMP12:%.*]] = call i32 @llvm.vscale.i32()
; CHECK1-NEXT:    [[TMP13:%.*]] = mul i32 1, [[TMP12]]
; CHECK1-NEXT:    [[DOTSPLATINSERT15:%.*]] = insertelement <vscale x 1 x i32> undef, i32 [[TMP13]], i32 0
; CHECK1-NEXT:    [[DOTSPLAT16:%.*]] = shufflevector <vscale x 1 x i32> [[DOTSPLATINSERT15]], <vscale x 1 x i32> undef, <vscale x 1 x i32> zeroinitializer
; CHECK1-NEXT:    [[DOTSPLATINSERT19:%.*]] = insertelement <vscale x 1 x i32> undef, i32 0, i32 0
; CHECK1-NEXT:    [[DOTSPLAT20:%.*]] = shufflevector <vscale x 1 x i32> [[DOTSPLATINSERT19]], <vscale x 1 x i32> undef, <vscale x 1 x i32> zeroinitializer
; CHECK1-NEXT:    [[TMP14:%.*]] = call <vscale x 1 x i32> @llvm.experimental.vector.stepvector.nxv1i32()
; CHECK1-NEXT:    [[DOTSPLATINSERT21:%.*]] = insertelement <vscale x 1 x i32> undef, i32 0, i32 0
; CHECK1-NEXT:    [[DOTSPLAT22:%.*]] = shufflevector <vscale x 1 x i32> [[DOTSPLATINSERT21]], <vscale x 1 x i32> undef, <vscale x 1 x i32> zeroinitializer
; CHECK1-NEXT:    [[TMP15:%.*]] = add <vscale x 1 x i32> [[TMP14]], [[DOTSPLAT22]]
; CHECK1-NEXT:    [[DOTSPLATINSERT23:%.*]] = insertelement <vscale x 1 x i32> undef, i32 1, i32 0
; CHECK1-NEXT:    [[DOTSPLAT24:%.*]] = shufflevector <vscale x 1 x i32> [[DOTSPLATINSERT23]], <vscale x 1 x i32> undef, <vscale x 1 x i32> zeroinitializer
; CHECK1-NEXT:    [[TMP16:%.*]] = mul <vscale x 1 x i32> [[TMP15]], [[DOTSPLAT24]]
; CHECK1-NEXT:    [[INDUCTION25:%.*]] = add <vscale x 1 x i32> [[DOTSPLAT20]], [[TMP16]]
; CHECK1-NEXT:    [[TMP17:%.*]] = call i32 @llvm.vscale.i32()
; CHECK1-NEXT:    [[TMP18:%.*]] = mul i32 1, [[TMP17]]
; CHECK1-NEXT:    [[DOTSPLATINSERT26:%.*]] = insertelement <vscale x 1 x i32> undef, i32 [[TMP18]], i32 0
; CHECK1-NEXT:    [[DOTSPLAT27:%.*]] = shufflevector <vscale x 1 x i32> [[DOTSPLATINSERT26]], <vscale x 1 x i32> undef, <vscale x 1 x i32> zeroinitializer
; CHECK1-NEXT:    [[BROADCAST_SPLATINSERT:%.*]] = insertelement <vscale x 1 x i32> undef, i32 1024, i32 0
; CHECK1-NEXT:    [[BROADCAST_SPLAT:%.*]] = shufflevector <vscale x 1 x i32> [[BROADCAST_SPLATINSERT]], <vscale x 1 x i32> undef, <vscale x 1 x i32> zeroinitializer
; CHECK1-NEXT:    br label [[VECTOR_BODY:%.*]]
; CHECK1:       vector.body:
; CHECK1-NEXT:    [[INDEX:%.*]] = phi i64 [ 0, [[VECTOR_PH]] ], [ [[INDEX_NEXT:%.*]], [[VECTOR_BODY]] ]
; CHECK1-NEXT:    [[VEC_IND:%.*]] = phi <vscale x 1 x i64> [ [[INDUCTION]], [[VECTOR_PH]] ], [ [[VEC_IND_NEXT:%.*]], [[VECTOR_BODY]] ]
; CHECK1-NEXT:    [[VEC_IND17:%.*]] = phi <vscale x 1 x i32> [ [[INDUCTION14]], [[VECTOR_PH]] ], [ [[VEC_IND_NEXT18:%.*]], [[VECTOR_BODY]] ]
; CHECK1-NEXT:    [[VEC_IND28:%.*]] = phi <vscale x 1 x i32> [ [[INDUCTION25]], [[VECTOR_PH]] ], [ [[VEC_IND_NEXT29:%.*]], [[VECTOR_BODY]] ]
; CHECK1-NEXT:    [[TMP19:%.*]] = sitofp <vscale x 1 x i32> [[VEC_IND17]] to <vscale x 1 x double>
; CHECK1-NEXT:    [[TMP20:%.*]] = extractelement <vscale x 1 x i64> [[VEC_IND]], i32 0
; CHECK1-NEXT:    [[TMP21:%.*]] = getelementptr inbounds [1024 x double], [1024 x double]* [[A]], i64 0, i64 [[TMP20]]
; CHECK1-NEXT:    [[TMP22:%.*]] = getelementptr inbounds double, double* [[TMP21]], i32 0
; CHECK1-NEXT:    [[TMP23:%.*]] = bitcast double* [[TMP22]] to <vscale x 1 x double>*
; CHECK1-NEXT:    store <vscale x 1 x double> [[TMP19]], <vscale x 1 x double>* [[TMP23]], align 8, [[TBAA2:!tbaa !.*]]
; CHECK1-NEXT:    [[TMP24:%.*]] = sub <vscale x 1 x i32> [[BROADCAST_SPLAT]], [[VEC_IND28]]
; CHECK1-NEXT:    [[TMP25:%.*]] = sitofp <vscale x 1 x i32> [[TMP24]] to <vscale x 1 x double>
; CHECK1-NEXT:    [[TMP26:%.*]] = getelementptr inbounds [1024 x double], [1024 x double]* [[B]], i64 0, i64 [[TMP20]]
; CHECK1-NEXT:    [[TMP27:%.*]] = getelementptr inbounds double, double* [[TMP26]], i32 0
; CHECK1-NEXT:    [[TMP28:%.*]] = bitcast double* [[TMP27]] to <vscale x 1 x double>*
; CHECK1-NEXT:    store <vscale x 1 x double> [[TMP25]], <vscale x 1 x double>* [[TMP28]], align 8, [[TBAA2]]
; CHECK1-NEXT:    [[TMP29:%.*]] = call i64 @llvm.vscale.i64()
; CHECK1-NEXT:    [[INDEX_VSCALE:%.*]] = mul i64 [[TMP29]], 1
; CHECK1-NEXT:    [[INDEX_NEXT]] = add i64 [[INDEX]], [[INDEX_VSCALE]]
; CHECK1-NEXT:    [[VEC_IND_NEXT]] = add <vscale x 1 x i64> [[VEC_IND]], [[DOTSPLAT7]]
; CHECK1-NEXT:    [[VEC_IND_NEXT18]] = add <vscale x 1 x i32> [[VEC_IND17]], [[DOTSPLAT16]]
; CHECK1-NEXT:    [[VEC_IND_NEXT29]] = add <vscale x 1 x i32> [[VEC_IND28]], [[DOTSPLAT27]]
; CHECK1-NEXT:    [[TMP30:%.*]] = icmp eq i64 [[INDEX_NEXT]], [[N_VEC]]
; CHECK1-NEXT:    br i1 [[TMP30]], label [[MIDDLE_BLOCK:%.*]], label [[VECTOR_BODY]], [[LOOP6:!llvm.loop !.*]]
; CHECK1:       middle.block:
; CHECK1-NEXT:    [[CMP_N:%.*]] = icmp eq i64 1024, [[N_VEC]]
; CHECK1-NEXT:    br i1 [[CMP_N]], label [[FOR_COND_CLEANUP:%.*]], label [[SCALAR_PH]]
; CHECK1:       scalar.ph:
; CHECK1-NEXT:    [[BC_RESUME_VAL:%.*]] = phi i64 [ [[N_VEC]], [[MIDDLE_BLOCK]] ], [ 0, [[ENTRY:%.*]] ]
; CHECK1-NEXT:    br label [[FOR_BODY:%.*]]
; CHECK1:       for.cond.cleanup:
; CHECK1-NEXT:    [[IDXPROM4:%.*]] = sext i32 [[ARGC:%.*]] to i64
; CHECK1-NEXT:    [[ARRAYIDX5:%.*]] = getelementptr inbounds [1024 x double], [1024 x double]* [[A]], i64 0, i64 [[IDXPROM4]]
; CHECK1-NEXT:    [[TMP31:%.*]] = load double, double* [[ARRAYIDX5]], align 8, [[TBAA2]]
; CHECK1-NEXT:    [[ARRAYIDX7:%.*]] = getelementptr inbounds [1024 x double], [1024 x double]* [[B]], i64 0, i64 [[IDXPROM4]]
; CHECK1-NEXT:    [[TMP32:%.*]] = load double, double* [[ARRAYIDX7]], align 8, [[TBAA2]]
; CHECK1-NEXT:    [[ADD:%.*]] = fadd double [[TMP31]], [[TMP32]]
; CHECK1-NEXT:    [[CONV8:%.*]] = fptosi double [[ADD]] to i32
; CHECK1-NEXT:    call void @llvm.lifetime.end.p0i8(i64 8192, i8* nonnull [[TMP1]]) [[ATTR4]]
; CHECK1-NEXT:    call void @llvm.lifetime.end.p0i8(i64 8192, i8* nonnull [[TMP0]]) [[ATTR4]]
; CHECK1-NEXT:    ret i32 [[CONV8]]
; CHECK1:       for.body:
; CHECK1-NEXT:    [[INDVARS_IV:%.*]] = phi i64 [ [[BC_RESUME_VAL]], [[SCALAR_PH]] ], [ [[INDVARS_IV_NEXT:%.*]], [[FOR_BODY]] ]
; CHECK1-NEXT:    [[TMP33:%.*]] = trunc i64 [[INDVARS_IV]] to i32
; CHECK1-NEXT:    [[CONV:%.*]] = sitofp i32 [[TMP33]] to double
; CHECK1-NEXT:    [[ARRAYIDX:%.*]] = getelementptr inbounds [1024 x double], [1024 x double]* [[A]], i64 0, i64 [[INDVARS_IV]]
; CHECK1-NEXT:    store double [[CONV]], double* [[ARRAYIDX]], align 8, [[TBAA2]]
; CHECK1-NEXT:    [[TMP34:%.*]] = trunc i64 [[INDVARS_IV]] to i32
; CHECK1-NEXT:    [[TMP35:%.*]] = sub i32 1024, [[TMP34]]
; CHECK1-NEXT:    [[CONV1:%.*]] = sitofp i32 [[TMP35]] to double
; CHECK1-NEXT:    [[ARRAYIDX3:%.*]] = getelementptr inbounds [1024 x double], [1024 x double]* [[B]], i64 0, i64 [[INDVARS_IV]]
; CHECK1-NEXT:    store double [[CONV1]], double* [[ARRAYIDX3]], align 8, [[TBAA2]]
; CHECK1-NEXT:    [[INDVARS_IV_NEXT]] = add nuw nsw i64 [[INDVARS_IV]], 1
; CHECK1-NEXT:    [[EXITCOND:%.*]] = icmp eq i64 [[INDVARS_IV_NEXT]], 1024
; CHECK1-NEXT:    br i1 [[EXITCOND]], label [[FOR_COND_CLEANUP]], label [[FOR_BODY]], [[LOOP8:!llvm.loop !.*]]
;
entry:
  %a = alloca [1024 x double], align 8
  %b = alloca [1024 x double], align 8
  %0 = bitcast [1024 x double]* %a to i8*
  call void @llvm.lifetime.start.p0i8(i64 8192, i8* nonnull %0) #2
  %1 = bitcast [1024 x double]* %b to i8*
  call void @llvm.lifetime.start.p0i8(i64 8192, i8* nonnull %1) #2
  br label %for.body

for.cond.cleanup:                                 ; preds = %for.body
  %idxprom4 = sext i32 %argc to i64
  %arrayidx5 = getelementptr inbounds [1024 x double], [1024 x double]* %a, i64 0, i64 %idxprom4
  %2 = load double, double* %arrayidx5, align 8, !tbaa !2
  %arrayidx7 = getelementptr inbounds [1024 x double], [1024 x double]* %b, i64 0, i64 %idxprom4
  %3 = load double, double* %arrayidx7, align 8, !tbaa !2
  %add = fadd double %2, %3
  %conv8 = fptosi double %add to i32
  call void @llvm.lifetime.end.p0i8(i64 8192, i8* nonnull %1) #2
  call void @llvm.lifetime.end.p0i8(i64 8192, i8* nonnull %0) #2
  ret i32 %conv8

for.body:                                         ; preds = %for.body, %entry
  %indvars.iv = phi i64 [ 0, %entry ], [ %indvars.iv.next, %for.body ]
  %4 = trunc i64 %indvars.iv to i32
  %conv = sitofp i32 %4 to double
  %arrayidx = getelementptr inbounds [1024 x double], [1024 x double]* %a, i64 0, i64 %indvars.iv
  store double %conv, double* %arrayidx, align 8, !tbaa !2
  %5 = trunc i64 %indvars.iv to i32
  %6 = sub i32 1024, %5
  %conv1 = sitofp i32 %6 to double
  %arrayidx3 = getelementptr inbounds [1024 x double], [1024 x double]* %b, i64 0, i64 %indvars.iv
  store double %conv1, double* %arrayidx3, align 8, !tbaa !2
  %indvars.iv.next = add nuw nsw i64 %indvars.iv, 1
  %exitcond = icmp eq i64 %indvars.iv.next, 1024
  br i1 %exitcond, label %for.cond.cleanup, label %for.body
}

; Function Attrs: argmemonly nounwind willreturn
declare void @llvm.lifetime.start.p0i8(i64 immarg, i8* nocapture) #1

; Function Attrs: argmemonly nounwind willreturn
declare void @llvm.lifetime.end.p0i8(i64 immarg, i8* nocapture) #1

attributes #0 = { nounwind readnone "correctly-rounded-divide-sqrt-fp-math"="false" "disable-tail-calls"="false" "frame-pointer"="none" "less-precise-fpmad"="false" "min-legal-vector-width"="0" "no-infs-fp-math"="false" "no-jump-tables"="false" "no-nans-fp-math"="false" "no-signed-zeros-fp-math"="false" "no-trapping-math"="false" "stack-protector-buffer-size"="8" "target-features"="+a,+c,+d,+experimental-v,+f,+m,-relax" "unsafe-fp-math"="false" "use-soft-float"="false" }
attributes #1 = { argmemonly nounwind willreturn }
attributes #2 = { nounwind }

!llvm.module.flags = !{!0}
!llvm.ident = !{!1}

!0 = !{i32 1, !"wchar_size", i32 4}
!1 = !{!"clang version 10.0.0 (git@repo.hca.bsc.es:EPI/System-Software/llvm-mono.git 823a818e0f44dc9b594f14a328ec52b247f3611a)"}
!2 = !{!3, !3, i64 0}
!3 = !{!"double", !4, i64 0}
!4 = !{!"omnipotent char", !5, i64 0}
!5 = !{!"Simple C/C++ TBAA"}
