; NOTE: Assertions have been autogenerated by utils/update_llc_test_checks.py
; RUN: llc -mtriple=riscv64 -mattr=+m,+f,+d,+c,+experimental-v < %s | \
; RUN:     FileCheck %s

declare <vscale x 1 x i64> @llvm.vp.zext.nxv1i64.nxv1i1(<vscale x 1 x i1> %op, <vscale x 1 x i1> %mask, i32 %evl)
declare <vscale x 2 x i32> @llvm.vp.zext.nxv2i32.nxv2i1(<vscale x 2 x i1> %op, <vscale x 2 x i1> %mask, i32 %evl)
declare <vscale x 4 x i16> @llvm.vp.zext.nxv4i16.nxv4i1(<vscale x 4 x i1> %op, <vscale x 4 x i1> %mask, i32 %evl)
declare <vscale x 8 x i8> @llvm.vp.zext.nxv8i8.nxv8i1(<vscale x 8 x i1> %op, <vscale x 8 x i1> %mask, i32 %evl)

define <vscale x 1 x i64> @test_vp_zext_nxv1i64_nxv1i1(<vscale x 1 x i1> %op, i32 %evl) {
; CHECK-LABEL: test_vp_zext_nxv1i64_nxv1i1:
; CHECK:       # %bb.0:
; CHECK-NEXT:    vsetvli zero, a0, e64,m1
; CHECK-NEXT:    vmv.v.i v1, 0
; CHECK-NEXT:    vmerge.vim v16, v1, 1, v0
; CHECK-NEXT:    ret
  %head = insertelement <vscale x 1 x i1> undef, i1 1, i32 0
  %allones = shufflevector <vscale x 1 x i1> %head, <vscale x 1 x i1> undef, <vscale x 1 x i32> zeroinitializer

  %x = call <vscale x 1 x i64> @llvm.vp.zext.nxv1i64.nxv1i1(<vscale x 1 x i1> %op, <vscale x 1 x i1> %allones, i32 %evl)
  ret <vscale x 1 x i64> %x
}

define <vscale x 1 x i64> @test_vp_zext_masked_nxv1i64_nxv1i1(<vscale x 1 x i1> %op, <vscale x 1 x i1> %mask, i32 %evl) {
; CHECK-LABEL: test_vp_zext_masked_nxv1i64_nxv1i1:
; CHECK:       # %bb.0:
; CHECK-NEXT:    vsetvli zero, a0, e64,m1
; CHECK-NEXT:    vmv.v.i v1, 0
; CHECK-NEXT:    vmerge.vim v16, v1, 1, v0
; CHECK-NEXT:    ret
  %x = call <vscale x 1 x i64> @llvm.vp.zext.nxv1i64.nxv1i1(<vscale x 1 x i1> %op, <vscale x 1 x i1> %mask, i32 %evl)
  ret <vscale x 1 x i64> %x
}

define <vscale x 2 x i32> @test_vp_zext_nxv2i32_nxv2i1(<vscale x 2 x i1> %op, i32 %evl) {
; CHECK-LABEL: test_vp_zext_nxv2i32_nxv2i1:
; CHECK:       # %bb.0:
; CHECK-NEXT:    vsetvli zero, a0, e32,m1
; CHECK-NEXT:    vmv.v.i v1, 0
; CHECK-NEXT:    vmerge.vim v16, v1, 1, v0
; CHECK-NEXT:    ret
  %head = insertelement <vscale x 2 x i1> undef, i1 1, i32 0
  %allones = shufflevector <vscale x 2 x i1> %head, <vscale x 2 x i1> undef, <vscale x 2 x i32> zeroinitializer

  %x = call <vscale x 2 x i32> @llvm.vp.zext.nxv2i32.nxv2i1(<vscale x 2 x i1> %op, <vscale x 2 x i1> %allones, i32 %evl)
  ret <vscale x 2 x i32> %x
}

define <vscale x 2 x i32> @test_vp_zext_masked_nxv2i32_nxv2i1(<vscale x 2 x i1> %op, <vscale x 2 x i1> %mask, i32 %evl) {
; CHECK-LABEL: test_vp_zext_masked_nxv2i32_nxv2i1:
; CHECK:       # %bb.0:
; CHECK-NEXT:    vsetvli zero, a0, e32,m1
; CHECK-NEXT:    vmv.v.i v1, 0
; CHECK-NEXT:    vmerge.vim v16, v1, 1, v0
; CHECK-NEXT:    ret
  %x = call <vscale x 2 x i32> @llvm.vp.zext.nxv2i32.nxv2i1(<vscale x 2 x i1> %op, <vscale x 2 x i1> %mask, i32 %evl)
  ret <vscale x 2 x i32> %x
}

define <vscale x 4 x i16> @test_vp_zext_nxv4i16_nxv4i1(<vscale x 4 x i1> %op, i32 %evl) {
; CHECK-LABEL: test_vp_zext_nxv4i16_nxv4i1:
; CHECK:       # %bb.0:
; CHECK-NEXT:    vsetvli zero, a0, e16,m1
; CHECK-NEXT:    vmv.v.i v1, 0
; CHECK-NEXT:    vmerge.vim v16, v1, 1, v0
; CHECK-NEXT:    ret
  %head = insertelement <vscale x 4 x i1> undef, i1 1, i32 0
  %allones = shufflevector <vscale x 4 x i1> %head, <vscale x 4 x i1> undef, <vscale x 4 x i32> zeroinitializer

  %x = call <vscale x 4 x i16> @llvm.vp.zext.nxv4i16.nxv4i1(<vscale x 4 x i1> %op, <vscale x 4 x i1> %allones, i32 %evl)
  ret <vscale x 4 x i16> %x
}

define <vscale x 4 x i16> @test_vp_zext_masked_nxv4i16_nxv4i1(<vscale x 4 x i1> %op, <vscale x 4 x i1> %mask, i32 %evl) {
; CHECK-LABEL: test_vp_zext_masked_nxv4i16_nxv4i1:
; CHECK:       # %bb.0:
; CHECK-NEXT:    vsetvli zero, a0, e16,m1
; CHECK-NEXT:    vmv.v.i v1, 0
; CHECK-NEXT:    vmerge.vim v16, v1, 1, v0
; CHECK-NEXT:    ret
  %x = call <vscale x 4 x i16> @llvm.vp.zext.nxv4i16.nxv4i1(<vscale x 4 x i1> %op, <vscale x 4 x i1> %mask, i32 %evl)
  ret <vscale x 4 x i16> %x
}

define <vscale x 8 x i8> @test_vp_zext_nxv8i8_nxv8i1(<vscale x 8 x i1> %op, i32 %evl) {
; CHECK-LABEL: test_vp_zext_nxv8i8_nxv8i1:
; CHECK:       # %bb.0:
; CHECK-NEXT:    vsetvli zero, a0, e8,m1
; CHECK-NEXT:    vmv.v.i v1, 0
; CHECK-NEXT:    vmerge.vim v16, v1, 1, v0
; CHECK-NEXT:    ret
  %head = insertelement <vscale x 8 x i1> undef, i1 1, i32 0
  %allones = shufflevector <vscale x 8 x i1> %head, <vscale x 8 x i1> undef, <vscale x 8 x i32> zeroinitializer

  %x = call <vscale x 8 x i8> @llvm.vp.zext.nxv8i8.nxv8i1(<vscale x 8 x i1> %op, <vscale x 8 x i1> %allones, i32 %evl)
  ret <vscale x 8 x i8> %x
}

define <vscale x 8 x i8> @test_vp_zext_masked_nxv8i8_nxv8i1(<vscale x 8 x i1> %op, <vscale x 8 x i1> %mask, i32 %evl) {
; CHECK-LABEL: test_vp_zext_masked_nxv8i8_nxv8i1:
; CHECK:       # %bb.0:
; CHECK-NEXT:    vsetvli zero, a0, e8,m1
; CHECK-NEXT:    vmv.v.i v1, 0
; CHECK-NEXT:    vmerge.vim v16, v1, 1, v0
; CHECK-NEXT:    ret
  %x = call <vscale x 8 x i8> @llvm.vp.zext.nxv8i8.nxv8i1(<vscale x 8 x i1> %op, <vscale x 8 x i1> %mask, i32 %evl)
  ret <vscale x 8 x i8> %x
}
