; NOTE: Assertions have been autogenerated by utils/update_test_checks.py
; RUN: opt -mtriple riscv64 -mattr +m,+a,+f,+d,+experimental-v \
; RUN:     -prefer-predicate-over-epilogue=predicate-dont-vectorize \
; RUN:     -S -loop-vectorize -instcombine -simplifycfg < %s -o - \
; RUN:    | FileCheck %s
; ModuleID = 'test.c'
source_filename = "test.c"
target datalayout = "e-m:e-p:64:64-i64:64-i128:128-n64-S128"
target triple = "riscv64-unknown-linux-gnu"

; Function Attrs: noinline nounwind optnone
define dso_local void @HPL_lmul(i32* %K, i32* %J, i32* %I) #0 {
; CHECK-LABEL: @HPL_lmul(
; CHECK-NEXT:  entry:
; CHECK-NEXT:    [[K_ADDR:%.*]] = alloca i32*, align 8
; CHECK-NEXT:    [[J_ADDR:%.*]] = alloca i32*, align 8
; CHECK-NEXT:    [[I_ADDR:%.*]] = alloca i32*, align 8
; CHECK-NEXT:    [[R:%.*]] = alloca i32, align 4
; CHECK-NEXT:    [[C:%.*]] = alloca i32, align 4
; CHECK-NEXT:    [[KK:%.*]] = alloca [4 x i32], align 4
; CHECK-NEXT:    [[JJ:%.*]] = alloca [4 x i32], align 4
; CHECK-NEXT:    [[RES:%.*]] = alloca [5 x i32], align 4
; CHECK-NEXT:    store i32* [[K:%.*]], i32** [[K_ADDR]], align 8
; CHECK-NEXT:    store i32* [[J:%.*]], i32** [[J_ADDR]], align 8
; CHECK-NEXT:    store i32* [[I:%.*]], i32** [[I_ADDR]], align 8
; CHECK-NEXT:    store i32 0, i32* [[C]], align 4
; CHECK-NEXT:    br label [[FOR_COND:%.*]]
; CHECK:       for.cond:
; CHECK-NEXT:    [[TMP0:%.*]] = load i32, i32* [[C]], align 4
; CHECK-NEXT:    [[CMP:%.*]] = icmp slt i32 [[TMP0]], 2
; CHECK-NEXT:    br i1 [[CMP]], label [[FOR_BODY:%.*]], label [[FOR_END:%.*]]
; CHECK:       for.body:
; CHECK-NEXT:    [[TMP1:%.*]] = load i32*, i32** [[K_ADDR]], align 8
; CHECK-NEXT:    [[TMP2:%.*]] = load i32, i32* [[C]], align 4
; CHECK-NEXT:    [[IDXPROM:%.*]] = sext i32 [[TMP2]] to i64
; CHECK-NEXT:    [[ARRAYIDX:%.*]] = getelementptr inbounds i32, i32* [[TMP1]], i64 [[IDXPROM]]
; CHECK-NEXT:    [[TMP3:%.*]] = load i32, i32* [[ARRAYIDX]], align 4
; CHECK-NEXT:    [[AND:%.*]] = and i32 [[TMP3]], 65535
; CHECK-NEXT:    [[TMP4:%.*]] = load i32, i32* [[C]], align 4
; CHECK-NEXT:    [[MUL:%.*]] = mul nsw i32 2, [[TMP4]]
; CHECK-NEXT:    [[IDXPROM1:%.*]] = sext i32 [[MUL]] to i64
; CHECK-NEXT:    [[ARRAYIDX2:%.*]] = getelementptr inbounds [4 x i32], [4 x i32]* [[KK]], i64 0, i64 [[IDXPROM1]]
; CHECK-NEXT:    store i32 [[AND]], i32* [[ARRAYIDX2]], align 4
; CHECK-NEXT:    [[TMP5:%.*]] = load i32*, i32** [[K_ADDR]], align 8
; CHECK-NEXT:    [[TMP6:%.*]] = load i32, i32* [[C]], align 4
; CHECK-NEXT:    [[IDXPROM3:%.*]] = sext i32 [[TMP6]] to i64
; CHECK-NEXT:    [[ARRAYIDX4:%.*]] = getelementptr inbounds i32, i32* [[TMP5]], i64 [[IDXPROM3]]
; CHECK-NEXT:    [[TMP7:%.*]] = load i32, i32* [[ARRAYIDX4]], align 4
; CHECK-NEXT:    [[SHR:%.*]] = lshr i32 [[TMP7]], 16
; CHECK-NEXT:    [[AND5:%.*]] = and i32 [[SHR]], 65535
; CHECK-NEXT:    [[TMP8:%.*]] = load i32, i32* [[C]], align 4
; CHECK-NEXT:    [[MUL6:%.*]] = mul nsw i32 2, [[TMP8]]
; CHECK-NEXT:    [[ADD:%.*]] = add nsw i32 [[MUL6]], 1
; CHECK-NEXT:    [[IDXPROM7:%.*]] = sext i32 [[ADD]] to i64
; CHECK-NEXT:    [[ARRAYIDX8:%.*]] = getelementptr inbounds [4 x i32], [4 x i32]* [[KK]], i64 0, i64 [[IDXPROM7]]
; CHECK-NEXT:    store i32 [[AND5]], i32* [[ARRAYIDX8]], align 4
; CHECK-NEXT:    [[TMP9:%.*]] = load i32*, i32** [[J_ADDR]], align 8
; CHECK-NEXT:    [[TMP10:%.*]] = load i32, i32* [[C]], align 4
; CHECK-NEXT:    [[IDXPROM9:%.*]] = sext i32 [[TMP10]] to i64
; CHECK-NEXT:    [[ARRAYIDX10:%.*]] = getelementptr inbounds i32, i32* [[TMP9]], i64 [[IDXPROM9]]
; CHECK-NEXT:    [[TMP11:%.*]] = load i32, i32* [[ARRAYIDX10]], align 4
; CHECK-NEXT:    [[AND11:%.*]] = and i32 [[TMP11]], 65535
; CHECK-NEXT:    [[TMP12:%.*]] = load i32, i32* [[C]], align 4
; CHECK-NEXT:    [[MUL12:%.*]] = mul nsw i32 2, [[TMP12]]
; CHECK-NEXT:    [[IDXPROM13:%.*]] = sext i32 [[MUL12]] to i64
; CHECK-NEXT:    [[ARRAYIDX14:%.*]] = getelementptr inbounds [4 x i32], [4 x i32]* [[JJ]], i64 0, i64 [[IDXPROM13]]
; CHECK-NEXT:    store i32 [[AND11]], i32* [[ARRAYIDX14]], align 4
; CHECK-NEXT:    [[TMP13:%.*]] = load i32*, i32** [[J_ADDR]], align 8
; CHECK-NEXT:    [[TMP14:%.*]] = load i32, i32* [[C]], align 4
; CHECK-NEXT:    [[IDXPROM15:%.*]] = sext i32 [[TMP14]] to i64
; CHECK-NEXT:    [[ARRAYIDX16:%.*]] = getelementptr inbounds i32, i32* [[TMP13]], i64 [[IDXPROM15]]
; CHECK-NEXT:    [[TMP15:%.*]] = load i32, i32* [[ARRAYIDX16]], align 4
; CHECK-NEXT:    [[SHR17:%.*]] = lshr i32 [[TMP15]], 16
; CHECK-NEXT:    [[AND18:%.*]] = and i32 [[SHR17]], 65535
; CHECK-NEXT:    [[TMP16:%.*]] = load i32, i32* [[C]], align 4
; CHECK-NEXT:    [[MUL19:%.*]] = mul nsw i32 2, [[TMP16]]
; CHECK-NEXT:    [[ADD20:%.*]] = add nsw i32 [[MUL19]], 1
; CHECK-NEXT:    [[IDXPROM21:%.*]] = sext i32 [[ADD20]] to i64
; CHECK-NEXT:    [[ARRAYIDX22:%.*]] = getelementptr inbounds [4 x i32], [4 x i32]* [[JJ]], i64 0, i64 [[IDXPROM21]]
; CHECK-NEXT:    store i32 [[AND18]], i32* [[ARRAYIDX22]], align 4
; CHECK-NEXT:    br label [[FOR_INC:%.*]]
; CHECK:       for.inc:
; CHECK-NEXT:    [[TMP17:%.*]] = load i32, i32* [[C]], align 4
; CHECK-NEXT:    [[INC:%.*]] = add nsw i32 [[TMP17]], 1
; CHECK-NEXT:    store i32 [[INC]], i32* [[C]], align 4
; CHECK-NEXT:    br label [[FOR_COND]], [[LOOP4:!llvm.loop !.*]]
; CHECK:       for.end:
; CHECK-NEXT:    [[ARRAYIDX23:%.*]] = getelementptr inbounds [5 x i32], [5 x i32]* [[RES]], i64 0, i64 0
; CHECK-NEXT:    store i32 0, i32* [[ARRAYIDX23]], align 4
; CHECK-NEXT:    store i32 0, i32* [[C]], align 4
; CHECK-NEXT:    br label [[FOR_COND24:%.*]]
; CHECK:       for.cond24:
; CHECK-NEXT:    [[TMP18:%.*]] = load i32, i32* [[C]], align 4
; CHECK-NEXT:    [[CMP25:%.*]] = icmp slt i32 [[TMP18]], 4
; CHECK-NEXT:    br i1 [[CMP25]], label [[FOR_BODY26:%.*]], label [[FOR_END65:%.*]]
; CHECK:       for.body26:
; CHECK-NEXT:    [[TMP19:%.*]] = load i32, i32* [[C]], align 4
; CHECK-NEXT:    [[IDXPROM27:%.*]] = sext i32 [[TMP19]] to i64
; CHECK-NEXT:    [[ARRAYIDX28:%.*]] = getelementptr inbounds [5 x i32], [5 x i32]* [[RES]], i64 0, i64 [[IDXPROM27]]
; CHECK-NEXT:    [[TMP20:%.*]] = load i32, i32* [[ARRAYIDX28]], align 4
; CHECK-NEXT:    [[SHR29:%.*]] = lshr i32 [[TMP20]], 16
; CHECK-NEXT:    [[AND30:%.*]] = and i32 [[SHR29]], 65535
; CHECK-NEXT:    [[TMP21:%.*]] = load i32, i32* [[C]], align 4
; CHECK-NEXT:    [[ADD31:%.*]] = add nsw i32 [[TMP21]], 1
; CHECK-NEXT:    [[IDXPROM32:%.*]] = sext i32 [[ADD31]] to i64
; CHECK-NEXT:    [[ARRAYIDX33:%.*]] = getelementptr inbounds [5 x i32], [5 x i32]* [[RES]], i64 0, i64 [[IDXPROM32]]
; CHECK-NEXT:    store i32 [[AND30]], i32* [[ARRAYIDX33]], align 4
; CHECK-NEXT:    [[TMP22:%.*]] = load i32, i32* [[C]], align 4
; CHECK-NEXT:    [[IDXPROM34:%.*]] = sext i32 [[TMP22]] to i64
; CHECK-NEXT:    [[ARRAYIDX35:%.*]] = getelementptr inbounds [5 x i32], [5 x i32]* [[RES]], i64 0, i64 [[IDXPROM34]]
; CHECK-NEXT:    [[TMP23:%.*]] = load i32, i32* [[ARRAYIDX35]], align 4
; CHECK-NEXT:    [[AND36:%.*]] = and i32 [[TMP23]], 65535
; CHECK-NEXT:    store i32 [[AND36]], i32* [[ARRAYIDX35]], align 4
; CHECK-NEXT:    store i32 0, i32* [[R]], align 4
; CHECK-NEXT:    br label [[FOR_COND37:%.*]]
; CHECK:       for.cond37:
; CHECK-NEXT:    [[TMP24:%.*]] = load i32, i32* [[R]], align 4
; CHECK-NEXT:    [[TMP25:%.*]] = load i32, i32* [[C]], align 4
; CHECK-NEXT:    [[ADD38:%.*]] = add nsw i32 [[TMP25]], 1
; CHECK-NEXT:    [[CMP39:%.*]] = icmp slt i32 [[TMP24]], [[ADD38]]
; CHECK-NEXT:    br i1 [[CMP39]], label [[FOR_BODY40:%.*]], label [[FOR_END62:%.*]]
; CHECK:       for.body40:
; CHECK-NEXT:    [[TMP26:%.*]] = load i32, i32* [[R]], align 4
; CHECK-NEXT:    [[IDXPROM41:%.*]] = sext i32 [[TMP26]] to i64
; CHECK-NEXT:    [[ARRAYIDX42:%.*]] = getelementptr inbounds [4 x i32], [4 x i32]* [[KK]], i64 0, i64 [[IDXPROM41]]
; CHECK-NEXT:    [[TMP27:%.*]] = load i32, i32* [[ARRAYIDX42]], align 4
; CHECK-NEXT:    [[TMP28:%.*]] = load i32, i32* [[C]], align 4
; CHECK-NEXT:    [[TMP29:%.*]] = load i32, i32* [[R]], align 4
; CHECK-NEXT:    [[SUB:%.*]] = sub nsw i32 [[TMP28]], [[TMP29]]
; CHECK-NEXT:    [[IDXPROM43:%.*]] = sext i32 [[SUB]] to i64
; CHECK-NEXT:    [[ARRAYIDX44:%.*]] = getelementptr inbounds [4 x i32], [4 x i32]* [[JJ]], i64 0, i64 [[IDXPROM43]]
; CHECK-NEXT:    [[TMP30:%.*]] = load i32, i32* [[ARRAYIDX44]], align 4
; CHECK-NEXT:    [[MUL45:%.*]] = mul i32 [[TMP27]], [[TMP30]]
; CHECK-NEXT:    [[TMP31:%.*]] = load i32, i32* [[C]], align 4
; CHECK-NEXT:    [[IDXPROM46:%.*]] = sext i32 [[TMP31]] to i64
; CHECK-NEXT:    [[ARRAYIDX47:%.*]] = getelementptr inbounds [5 x i32], [5 x i32]* [[RES]], i64 0, i64 [[IDXPROM46]]
; CHECK-NEXT:    [[TMP32:%.*]] = load i32, i32* [[ARRAYIDX47]], align 4
; CHECK-NEXT:    [[AND48:%.*]] = and i32 [[TMP32]], 65535
; CHECK-NEXT:    [[ADD49:%.*]] = add i32 [[MUL45]], [[AND48]]
; CHECK-NEXT:    [[TMP33:%.*]] = load i32, i32* [[C]], align 4
; CHECK-NEXT:    [[IDXPROM50:%.*]] = sext i32 [[TMP33]] to i64
; CHECK-NEXT:    [[ARRAYIDX51:%.*]] = getelementptr inbounds [5 x i32], [5 x i32]* [[RES]], i64 0, i64 [[IDXPROM50]]
; CHECK-NEXT:    store i32 [[ADD49]], i32* [[ARRAYIDX51]], align 4
; CHECK-NEXT:    [[TMP34:%.*]] = load i32, i32* [[C]], align 4
; CHECK-NEXT:    [[IDXPROM52:%.*]] = sext i32 [[TMP34]] to i64
; CHECK-NEXT:    [[ARRAYIDX53:%.*]] = getelementptr inbounds [5 x i32], [5 x i32]* [[RES]], i64 0, i64 [[IDXPROM52]]
; CHECK-NEXT:    [[TMP35:%.*]] = load i32, i32* [[ARRAYIDX53]], align 4
; CHECK-NEXT:    [[SHR54:%.*]] = lshr i32 [[TMP35]], 16
; CHECK-NEXT:    [[AND55:%.*]] = and i32 [[SHR54]], 65535
; CHECK-NEXT:    [[TMP36:%.*]] = load i32, i32* [[C]], align 4
; CHECK-NEXT:    [[ADD56:%.*]] = add nsw i32 [[TMP36]], 1
; CHECK-NEXT:    [[IDXPROM57:%.*]] = sext i32 [[ADD56]] to i64
; CHECK-NEXT:    [[ARRAYIDX58:%.*]] = getelementptr inbounds [5 x i32], [5 x i32]* [[RES]], i64 0, i64 [[IDXPROM57]]
; CHECK-NEXT:    [[TMP37:%.*]] = load i32, i32* [[ARRAYIDX58]], align 4
; CHECK-NEXT:    [[ADD59:%.*]] = add i32 [[TMP37]], [[AND55]]
; CHECK-NEXT:    store i32 [[ADD59]], i32* [[ARRAYIDX58]], align 4
; CHECK-NEXT:    br label [[FOR_INC60:%.*]]
; CHECK:       for.inc60:
; CHECK-NEXT:    [[TMP38:%.*]] = load i32, i32* [[R]], align 4
; CHECK-NEXT:    [[INC61:%.*]] = add nsw i32 [[TMP38]], 1
; CHECK-NEXT:    store i32 [[INC61]], i32* [[R]], align 4
; CHECK-NEXT:    br label [[FOR_COND37]], [[LOOP6:!llvm.loop !.*]]
; CHECK:       for.end62:
; CHECK-NEXT:    br label [[FOR_INC63:%.*]]
; CHECK:       for.inc63:
; CHECK-NEXT:    [[TMP39:%.*]] = load i32, i32* [[C]], align 4
; CHECK-NEXT:    [[INC64:%.*]] = add nsw i32 [[TMP39]], 1
; CHECK-NEXT:    store i32 [[INC64]], i32* [[C]], align 4
; CHECK-NEXT:    br label [[FOR_COND24]], [[LOOP7:!llvm.loop !.*]]
; CHECK:       for.end65:
; CHECK-NEXT:    store i32 0, i32* [[C]], align 4
; CHECK-NEXT:    br label [[FOR_COND66:%.*]]
; CHECK:       for.cond66:
; CHECK-NEXT:    [[TMP40:%.*]] = load i32, i32* [[C]], align 4
; CHECK-NEXT:    [[CMP67:%.*]] = icmp slt i32 [[TMP40]], 2
; CHECK-NEXT:    br i1 [[CMP67]], label [[FOR_BODY68:%.*]], label [[FOR_END82:%.*]]
; CHECK:       for.body68:
; CHECK-NEXT:    [[TMP41:%.*]] = load i32, i32* [[C]], align 4
; CHECK-NEXT:    [[MUL69:%.*]] = mul nsw i32 2, [[TMP41]]
; CHECK-NEXT:    [[ADD70:%.*]] = add nsw i32 [[MUL69]], 1
; CHECK-NEXT:    [[IDXPROM71:%.*]] = sext i32 [[ADD70]] to i64
; CHECK-NEXT:    [[ARRAYIDX72:%.*]] = getelementptr inbounds [5 x i32], [5 x i32]* [[RES]], i64 0, i64 [[IDXPROM71]]
; CHECK-NEXT:    [[TMP42:%.*]] = load i32, i32* [[ARRAYIDX72]], align 4
; CHECK-NEXT:    [[AND73:%.*]] = and i32 [[TMP42]], 65535
; CHECK-NEXT:    [[SHL:%.*]] = shl i32 [[AND73]], 16
; CHECK-NEXT:    [[TMP43:%.*]] = load i32, i32* [[C]], align 4
; CHECK-NEXT:    [[MUL74:%.*]] = mul nsw i32 2, [[TMP43]]
; CHECK-NEXT:    [[IDXPROM75:%.*]] = sext i32 [[MUL74]] to i64
; CHECK-NEXT:    [[ARRAYIDX76:%.*]] = getelementptr inbounds [5 x i32], [5 x i32]* [[RES]], i64 0, i64 [[IDXPROM75]]
; CHECK-NEXT:    [[TMP44:%.*]] = load i32, i32* [[ARRAYIDX76]], align 4
; CHECK-NEXT:    [[AND77:%.*]] = and i32 [[TMP44]], 65535
; CHECK-NEXT:    [[OR:%.*]] = or i32 [[SHL]], [[AND77]]
; CHECK-NEXT:    [[TMP45:%.*]] = load i32*, i32** [[I_ADDR]], align 8
; CHECK-NEXT:    [[TMP46:%.*]] = load i32, i32* [[C]], align 4
; CHECK-NEXT:    [[IDXPROM78:%.*]] = sext i32 [[TMP46]] to i64
; CHECK-NEXT:    [[ARRAYIDX79:%.*]] = getelementptr inbounds i32, i32* [[TMP45]], i64 [[IDXPROM78]]
; CHECK-NEXT:    store i32 [[OR]], i32* [[ARRAYIDX79]], align 4
; CHECK-NEXT:    br label [[FOR_INC80:%.*]]
; CHECK:       for.inc80:
; CHECK-NEXT:    [[TMP47:%.*]] = load i32, i32* [[C]], align 4
; CHECK-NEXT:    [[INC81:%.*]] = add nsw i32 [[TMP47]], 1
; CHECK-NEXT:    store i32 [[INC81]], i32* [[C]], align 4
; CHECK-NEXT:    br label [[FOR_COND66]], [[LOOP8:!llvm.loop !.*]]
; CHECK:       for.end82:
; CHECK-NEXT:    ret void
;
entry:
  %K.addr = alloca i32*, align 8
  %J.addr = alloca i32*, align 8
  %I.addr = alloca i32*, align 8
  %r = alloca i32, align 4
  %c = alloca i32, align 4
  %kk = alloca [4 x i32], align 4
  %jj = alloca [4 x i32], align 4
  %res = alloca [5 x i32], align 4
  store i32* %K, i32** %K.addr, align 8
  store i32* %J, i32** %J.addr, align 8
  store i32* %I, i32** %I.addr, align 8
  store i32 0, i32* %c, align 4
  br label %for.cond

for.cond:                                         ; preds = %for.inc, %entry
  %0 = load i32, i32* %c, align 4
  %cmp = icmp slt i32 %0, 2
  br i1 %cmp, label %for.body, label %for.end

for.body:                                         ; preds = %for.cond
  %1 = load i32*, i32** %K.addr, align 8
  %2 = load i32, i32* %c, align 4
  %idxprom = sext i32 %2 to i64
  %arrayidx = getelementptr inbounds i32, i32* %1, i64 %idxprom
  %3 = load i32, i32* %arrayidx, align 4
  %and = and i32 %3, 65535
  %4 = load i32, i32* %c, align 4
  %mul = mul nsw i32 2, %4
  %idxprom1 = sext i32 %mul to i64
  %arrayidx2 = getelementptr inbounds [4 x i32], [4 x i32]* %kk, i64 0, i64 %idxprom1
  store i32 %and, i32* %arrayidx2, align 4
  %5 = load i32*, i32** %K.addr, align 8
  %6 = load i32, i32* %c, align 4
  %idxprom3 = sext i32 %6 to i64
  %arrayidx4 = getelementptr inbounds i32, i32* %5, i64 %idxprom3
  %7 = load i32, i32* %arrayidx4, align 4
  %shr = lshr i32 %7, 16
  %and5 = and i32 %shr, 65535
  %8 = load i32, i32* %c, align 4
  %mul6 = mul nsw i32 2, %8
  %add = add nsw i32 %mul6, 1
  %idxprom7 = sext i32 %add to i64
  %arrayidx8 = getelementptr inbounds [4 x i32], [4 x i32]* %kk, i64 0, i64 %idxprom7
  store i32 %and5, i32* %arrayidx8, align 4
  %9 = load i32*, i32** %J.addr, align 8
  %10 = load i32, i32* %c, align 4
  %idxprom9 = sext i32 %10 to i64
  %arrayidx10 = getelementptr inbounds i32, i32* %9, i64 %idxprom9
  %11 = load i32, i32* %arrayidx10, align 4
  %and11 = and i32 %11, 65535
  %12 = load i32, i32* %c, align 4
  %mul12 = mul nsw i32 2, %12
  %idxprom13 = sext i32 %mul12 to i64
  %arrayidx14 = getelementptr inbounds [4 x i32], [4 x i32]* %jj, i64 0, i64 %idxprom13
  store i32 %and11, i32* %arrayidx14, align 4
  %13 = load i32*, i32** %J.addr, align 8
  %14 = load i32, i32* %c, align 4
  %idxprom15 = sext i32 %14 to i64
  %arrayidx16 = getelementptr inbounds i32, i32* %13, i64 %idxprom15
  %15 = load i32, i32* %arrayidx16, align 4
  %shr17 = lshr i32 %15, 16
  %and18 = and i32 %shr17, 65535
  %16 = load i32, i32* %c, align 4
  %mul19 = mul nsw i32 2, %16
  %add20 = add nsw i32 %mul19, 1
  %idxprom21 = sext i32 %add20 to i64
  %arrayidx22 = getelementptr inbounds [4 x i32], [4 x i32]* %jj, i64 0, i64 %idxprom21
  store i32 %and18, i32* %arrayidx22, align 4
  br label %for.inc

for.inc:                                          ; preds = %for.body
  %17 = load i32, i32* %c, align 4
  %inc = add nsw i32 %17, 1
  store i32 %inc, i32* %c, align 4
  br label %for.cond, !llvm.loop !4

for.end:                                          ; preds = %for.cond
  %arrayidx23 = getelementptr inbounds [5 x i32], [5 x i32]* %res, i64 0, i64 0
  store i32 0, i32* %arrayidx23, align 4
  store i32 0, i32* %c, align 4
  br label %for.cond24

for.cond24:                                       ; preds = %for.inc63, %for.end
  %18 = load i32, i32* %c, align 4
  %cmp25 = icmp slt i32 %18, 4
  br i1 %cmp25, label %for.body26, label %for.end65

for.body26:                                       ; preds = %for.cond24
  %19 = load i32, i32* %c, align 4
  %idxprom27 = sext i32 %19 to i64
  %arrayidx28 = getelementptr inbounds [5 x i32], [5 x i32]* %res, i64 0, i64 %idxprom27
  %20 = load i32, i32* %arrayidx28, align 4
  %shr29 = lshr i32 %20, 16
  %and30 = and i32 %shr29, 65535
  %21 = load i32, i32* %c, align 4
  %add31 = add nsw i32 %21, 1
  %idxprom32 = sext i32 %add31 to i64
  %arrayidx33 = getelementptr inbounds [5 x i32], [5 x i32]* %res, i64 0, i64 %idxprom32
  store i32 %and30, i32* %arrayidx33, align 4
  %22 = load i32, i32* %c, align 4
  %idxprom34 = sext i32 %22 to i64
  %arrayidx35 = getelementptr inbounds [5 x i32], [5 x i32]* %res, i64 0, i64 %idxprom34
  %23 = load i32, i32* %arrayidx35, align 4
  %and36 = and i32 %23, 65535
  store i32 %and36, i32* %arrayidx35, align 4
  store i32 0, i32* %r, align 4
  br label %for.cond37

for.cond37:                                       ; preds = %for.inc60, %for.body26
  %24 = load i32, i32* %r, align 4
  %25 = load i32, i32* %c, align 4
  %add38 = add nsw i32 %25, 1
  %cmp39 = icmp slt i32 %24, %add38
  br i1 %cmp39, label %for.body40, label %for.end62

for.body40:                                       ; preds = %for.cond37
  %26 = load i32, i32* %r, align 4
  %idxprom41 = sext i32 %26 to i64
  %arrayidx42 = getelementptr inbounds [4 x i32], [4 x i32]* %kk, i64 0, i64 %idxprom41
  %27 = load i32, i32* %arrayidx42, align 4
  %28 = load i32, i32* %c, align 4
  %29 = load i32, i32* %r, align 4
  %sub = sub nsw i32 %28, %29
  %idxprom43 = sext i32 %sub to i64
  %arrayidx44 = getelementptr inbounds [4 x i32], [4 x i32]* %jj, i64 0, i64 %idxprom43
  %30 = load i32, i32* %arrayidx44, align 4
  %mul45 = mul i32 %27, %30
  %31 = load i32, i32* %c, align 4
  %idxprom46 = sext i32 %31 to i64
  %arrayidx47 = getelementptr inbounds [5 x i32], [5 x i32]* %res, i64 0, i64 %idxprom46
  %32 = load i32, i32* %arrayidx47, align 4
  %and48 = and i32 %32, 65535
  %add49 = add i32 %mul45, %and48
  %33 = load i32, i32* %c, align 4
  %idxprom50 = sext i32 %33 to i64
  %arrayidx51 = getelementptr inbounds [5 x i32], [5 x i32]* %res, i64 0, i64 %idxprom50
  store i32 %add49, i32* %arrayidx51, align 4
  %34 = load i32, i32* %c, align 4
  %idxprom52 = sext i32 %34 to i64
  %arrayidx53 = getelementptr inbounds [5 x i32], [5 x i32]* %res, i64 0, i64 %idxprom52
  %35 = load i32, i32* %arrayidx53, align 4
  %shr54 = lshr i32 %35, 16
  %and55 = and i32 %shr54, 65535
  %36 = load i32, i32* %c, align 4
  %add56 = add nsw i32 %36, 1
  %idxprom57 = sext i32 %add56 to i64
  %arrayidx58 = getelementptr inbounds [5 x i32], [5 x i32]* %res, i64 0, i64 %idxprom57
  %37 = load i32, i32* %arrayidx58, align 4
  %add59 = add i32 %37, %and55
  store i32 %add59, i32* %arrayidx58, align 4
  br label %for.inc60

for.inc60:                                        ; preds = %for.body40
  %38 = load i32, i32* %r, align 4
  %inc61 = add nsw i32 %38, 1
  store i32 %inc61, i32* %r, align 4
  br label %for.cond37, !llvm.loop !6

for.end62:                                        ; preds = %for.cond37
  br label %for.inc63

for.inc63:                                        ; preds = %for.end62
  %39 = load i32, i32* %c, align 4
  %inc64 = add nsw i32 %39, 1
  store i32 %inc64, i32* %c, align 4
  br label %for.cond24, !llvm.loop !7

for.end65:                                        ; preds = %for.cond24
  store i32 0, i32* %c, align 4
  br label %for.cond66

for.cond66:                                       ; preds = %for.inc80, %for.end65
  %40 = load i32, i32* %c, align 4
  %cmp67 = icmp slt i32 %40, 2
  br i1 %cmp67, label %for.body68, label %for.end82

for.body68:                                       ; preds = %for.cond66
  %41 = load i32, i32* %c, align 4
  %mul69 = mul nsw i32 2, %41
  %add70 = add nsw i32 %mul69, 1
  %idxprom71 = sext i32 %add70 to i64
  %arrayidx72 = getelementptr inbounds [5 x i32], [5 x i32]* %res, i64 0, i64 %idxprom71
  %42 = load i32, i32* %arrayidx72, align 4
  %and73 = and i32 %42, 65535
  %shl = shl i32 %and73, 16
  %43 = load i32, i32* %c, align 4
  %mul74 = mul nsw i32 2, %43
  %idxprom75 = sext i32 %mul74 to i64
  %arrayidx76 = getelementptr inbounds [5 x i32], [5 x i32]* %res, i64 0, i64 %idxprom75
  %44 = load i32, i32* %arrayidx76, align 4
  %and77 = and i32 %44, 65535
  %or = or i32 %shl, %and77
  %45 = load i32*, i32** %I.addr, align 8
  %46 = load i32, i32* %c, align 4
  %idxprom78 = sext i32 %46 to i64
  %arrayidx79 = getelementptr inbounds i32, i32* %45, i64 %idxprom78
  store i32 %or, i32* %arrayidx79, align 4
  br label %for.inc80

for.inc80:                                        ; preds = %for.body68
  %47 = load i32, i32* %c, align 4
  %inc81 = add nsw i32 %47, 1
  store i32 %inc81, i32* %c, align 4
  br label %for.cond66, !llvm.loop !8

for.end82:                                        ; preds = %for.cond66
  ret void
}

attributes #0 = { noinline nounwind optnone "disable-tail-calls"="false" "frame-pointer"="all" "less-precise-fpmad"="false" "min-legal-vector-width"="0" "no-infs-fp-math"="false" "no-jump-tables"="false" "no-nans-fp-math"="false" "no-signed-zeros-fp-math"="false" "no-trapping-math"="true" "stack-protector-buffer-size"="8" "target-features"="+a,+c,+d,+f,+m,-relax,-save-restore" "unsafe-fp-math"="false" "use-soft-float"="false" }

!llvm.module.flags = !{!0, !1, !2}
!llvm.ident = !{!3}

!0 = !{i32 1, !"wchar_size", i32 4}
!1 = !{i32 1, !"target-abi", !"lp64d"}
!2 = !{i32 1, !"SmallDataLimit", i32 8}
!3 = !{!"clang version 12.0.0"}
!4 = distinct !{!4, !5}
!5 = !{!"llvm.loop.mustprogress"}
!6 = distinct !{!6, !5}
!7 = distinct !{!7, !5}
!8 = distinct !{!8, !5}
