; NOTE: Assertions have been autogenerated by utils/update_test_checks.py
; RUN: opt -mtriple riscv64 -mattr +m,+a,+f,+d,+experimental-v -riscv-disable-strided-accesses \
; RUN:    -prefer-predicate-over-epilogue=predicate-dont-vectorize -S -O2 < %s -o - | FileCheck %s --check-prefix=NO-STRIDE
; RUN: opt -mtriple riscv64 -mattr +m,+a,+f,+d,+experimental-v -vectorizer-use-vp-strided-load-store -enable-mem-access-versioning=0 \
; RUN:    -prefer-predicate-over-epilogue=predicate-dont-vectorize -S -O2 < %s -o - | FileCheck %s --check-prefix=STRIDED
; ModuleID = 't.c'
source_filename = "t.c"
target datalayout = "e-m:e-p:64:64-i64:64-i128:128-n64-S128-v128:128:128-v256:128:128-v512:128:128-v1024:128:128"
target triple = "riscv64-unknown-linux-gnu"

; Function Attrs: nofree norecurse nounwind
define dso_local double @test(double* nocapture readonly %va, double* nocapture %vb, i32 signext %N, i32 signext %groups, i32 signext %bstride, i32 signext %batches) local_unnamed_addr #0 {
; NO-STRIDE-LABEL: @test(
; NO-STRIDE-NEXT:  entry:
; NO-STRIDE-NEXT:    [[CMP402:%.*]] = icmp sgt i32 [[BATCHES:%.*]], 0
; NO-STRIDE-NEXT:    br i1 [[CMP402]], label [[FOR_BODY_LR_PH:%.*]], label [[FOR_COND_CLEANUP:%.*]]
; NO-STRIDE:       for.body.lr.ph:
; NO-STRIDE-NEXT:    [[SHL:%.*]] = shl i32 [[GROUPS:%.*]], 1
; NO-STRIDE-NEXT:    [[MUL19:%.*]] = shl i32 [[GROUPS]], 2
; NO-STRIDE-NEXT:    [[MUL33:%.*]] = mul i32 [[GROUPS]], 6
; NO-STRIDE-NEXT:    [[MUL47:%.*]] = shl i32 [[GROUPS]], 3
; NO-STRIDE-NEXT:    [[MUL61:%.*]] = mul i32 [[GROUPS]], 10
; NO-STRIDE-NEXT:    [[MUL75:%.*]] = mul i32 [[GROUPS]], 12
; NO-STRIDE-NEXT:    [[MUL89:%.*]] = mul i32 [[GROUPS]], 14
; NO-STRIDE-NEXT:    [[SHR:%.*]] = ashr i32 [[N:%.*]], 2
; NO-STRIDE-NEXT:    [[MUL150:%.*]] = shl nsw i32 [[SHR]], 1
; NO-STRIDE-NEXT:    [[MUL164:%.*]] = mul nsw i32 [[SHR]], 3
; NO-STRIDE-NEXT:    [[MUL178:%.*]] = and i32 [[N]], -4
; NO-STRIDE-NEXT:    [[MUL192:%.*]] = mul nsw i32 [[SHR]], 5
; NO-STRIDE-NEXT:    [[MUL206:%.*]] = mul nsw i32 [[SHR]], 6
; NO-STRIDE-NEXT:    [[MUL220:%.*]] = mul nsw i32 [[SHR]], 7
; NO-STRIDE-NEXT:    [[TMP0:%.*]] = sext i32 [[BSTRIDE:%.*]] to i64
; NO-STRIDE-NEXT:    [[TMP1:%.*]] = sext i32 [[SHL]] to i64
; NO-STRIDE-NEXT:    [[TMP2:%.*]] = sext i32 [[MUL19]] to i64
; NO-STRIDE-NEXT:    [[TMP3:%.*]] = sext i32 [[MUL33]] to i64
; NO-STRIDE-NEXT:    [[TMP4:%.*]] = sext i32 [[MUL47]] to i64
; NO-STRIDE-NEXT:    [[TMP5:%.*]] = sext i32 [[MUL61]] to i64
; NO-STRIDE-NEXT:    [[TMP6:%.*]] = sext i32 [[MUL75]] to i64
; NO-STRIDE-NEXT:    [[TMP7:%.*]] = sext i32 [[MUL89]] to i64
; NO-STRIDE-NEXT:    [[TMP8:%.*]] = sext i32 [[SHR]] to i64
; NO-STRIDE-NEXT:    [[TMP9:%.*]] = sext i32 [[MUL150]] to i64
; NO-STRIDE-NEXT:    [[TMP10:%.*]] = sext i32 [[MUL164]] to i64
; NO-STRIDE-NEXT:    [[TMP11:%.*]] = sext i32 [[MUL178]] to i64
; NO-STRIDE-NEXT:    [[TMP12:%.*]] = sext i32 [[MUL192]] to i64
; NO-STRIDE-NEXT:    [[TMP13:%.*]] = sext i32 [[MUL206]] to i64
; NO-STRIDE-NEXT:    [[TMP14:%.*]] = sext i32 [[MUL220]] to i64
; NO-STRIDE-NEXT:    [[WIDE_TRIP_COUNT:%.*]] = zext i32 [[BATCHES]] to i64
; NO-STRIDE-NEXT:    [[IDENT_CHECK_NOT:%.*]] = icmp eq i32 [[BSTRIDE]], 1
; NO-STRIDE-NEXT:    br i1 [[IDENT_CHECK_NOT]], label [[VECTOR_BODY:%.*]], label [[FOR_BODY:%.*]]
; NO-STRIDE:       vector.body:
; NO-STRIDE-NEXT:    [[INDEX:%.*]] = phi i64 [ [[INDEX_NEXT:%.*]], [[VECTOR_BODY]] ], [ 0, [[FOR_BODY_LR_PH]] ]
; NO-STRIDE-NEXT:    [[TMP15:%.*]] = mul nsw i64 [[INDEX]], [[TMP0]]
; NO-STRIDE-NEXT:    [[TMP16:%.*]] = getelementptr inbounds double, double* [[VA:%.*]], i64 [[TMP15]]
; NO-STRIDE-NEXT:    [[TMP17:%.*]] = sub i64 [[WIDE_TRIP_COUNT]], [[INDEX]]
; NO-STRIDE-NEXT:    [[TMP18:%.*]] = call i64 @llvm.epi.vsetvl(i64 [[TMP17]], i64 3, i64 0)
; NO-STRIDE-NEXT:    [[TMP19:%.*]] = trunc i64 [[TMP18]] to i32
; NO-STRIDE-NEXT:    [[TMP20:%.*]] = bitcast double* [[TMP16]] to <vscale x 1 x double>*
; NO-STRIDE-NEXT:    [[VP_OP_LOAD:%.*]] = call <vscale x 1 x double> @llvm.vp.load.nxv1f64.p0nxv1f64(<vscale x 1 x double>* [[TMP20]], i32 8, <vscale x 1 x i1> shufflevector (<vscale x 1 x i1> insertelement (<vscale x 1 x i1> undef, i1 true, i32 0), <vscale x 1 x i1> undef, <vscale x 1 x i32> zeroinitializer), i32 [[TMP19]]), [[TBAA4:!tbaa !.*]], !llvm.access.group !8
; NO-STRIDE-NEXT:    [[TMP21:%.*]] = add nsw i64 [[TMP15]], 1
; NO-STRIDE-NEXT:    [[TMP22:%.*]] = getelementptr inbounds double, double* [[VA]], i64 [[TMP21]]
; NO-STRIDE-NEXT:    [[TMP23:%.*]] = bitcast double* [[TMP22]] to <vscale x 1 x double>*
; NO-STRIDE-NEXT:    [[VP_OP_LOAD9:%.*]] = call <vscale x 1 x double> @llvm.vp.load.nxv1f64.p0nxv1f64(<vscale x 1 x double>* [[TMP23]], i32 8, <vscale x 1 x i1> shufflevector (<vscale x 1 x i1> insertelement (<vscale x 1 x i1> undef, i1 true, i32 0), <vscale x 1 x i1> undef, <vscale x 1 x i32> zeroinitializer), i32 [[TMP19]]), [[TBAA4]], !llvm.access.group !8
; NO-STRIDE-NEXT:    [[TMP24:%.*]] = add nsw i64 [[TMP15]], [[TMP1]]
; NO-STRIDE-NEXT:    [[TMP25:%.*]] = getelementptr inbounds double, double* [[VA]], i64 [[TMP24]]
; NO-STRIDE-NEXT:    [[TMP26:%.*]] = bitcast double* [[TMP25]] to <vscale x 1 x double>*
; NO-STRIDE-NEXT:    [[VP_OP_LOAD12:%.*]] = call <vscale x 1 x double> @llvm.vp.load.nxv1f64.p0nxv1f64(<vscale x 1 x double>* [[TMP26]], i32 8, <vscale x 1 x i1> shufflevector (<vscale x 1 x i1> insertelement (<vscale x 1 x i1> undef, i1 true, i32 0), <vscale x 1 x i1> undef, <vscale x 1 x i32> zeroinitializer), i32 [[TMP19]]), [[TBAA4]], !llvm.access.group !8
; NO-STRIDE-NEXT:    [[TMP27:%.*]] = add nsw i64 [[TMP21]], [[TMP1]]
; NO-STRIDE-NEXT:    [[TMP28:%.*]] = getelementptr inbounds double, double* [[VA]], i64 [[TMP27]]
; NO-STRIDE-NEXT:    [[TMP29:%.*]] = bitcast double* [[TMP28]] to <vscale x 1 x double>*
; NO-STRIDE-NEXT:    [[VP_OP_LOAD15:%.*]] = call <vscale x 1 x double> @llvm.vp.load.nxv1f64.p0nxv1f64(<vscale x 1 x double>* [[TMP29]], i32 8, <vscale x 1 x i1> shufflevector (<vscale x 1 x i1> insertelement (<vscale x 1 x i1> undef, i1 true, i32 0), <vscale x 1 x i1> undef, <vscale x 1 x i32> zeroinitializer), i32 [[TMP19]]), [[TBAA4]], !llvm.access.group !8
; NO-STRIDE-NEXT:    [[TMP30:%.*]] = add nsw i64 [[TMP15]], [[TMP2]]
; NO-STRIDE-NEXT:    [[TMP31:%.*]] = getelementptr inbounds double, double* [[VA]], i64 [[TMP30]]
; NO-STRIDE-NEXT:    [[TMP32:%.*]] = bitcast double* [[TMP31]] to <vscale x 1 x double>*
; NO-STRIDE-NEXT:    [[VP_OP_LOAD18:%.*]] = call <vscale x 1 x double> @llvm.vp.load.nxv1f64.p0nxv1f64(<vscale x 1 x double>* [[TMP32]], i32 8, <vscale x 1 x i1> shufflevector (<vscale x 1 x i1> insertelement (<vscale x 1 x i1> undef, i1 true, i32 0), <vscale x 1 x i1> undef, <vscale x 1 x i32> zeroinitializer), i32 [[TMP19]]), [[TBAA4]], !llvm.access.group !8
; NO-STRIDE-NEXT:    [[TMP33:%.*]] = add nsw i64 [[TMP21]], [[TMP2]]
; NO-STRIDE-NEXT:    [[TMP34:%.*]] = getelementptr inbounds double, double* [[VA]], i64 [[TMP33]]
; NO-STRIDE-NEXT:    [[TMP35:%.*]] = bitcast double* [[TMP34]] to <vscale x 1 x double>*
; NO-STRIDE-NEXT:    [[VP_OP_LOAD21:%.*]] = call <vscale x 1 x double> @llvm.vp.load.nxv1f64.p0nxv1f64(<vscale x 1 x double>* [[TMP35]], i32 8, <vscale x 1 x i1> shufflevector (<vscale x 1 x i1> insertelement (<vscale x 1 x i1> undef, i1 true, i32 0), <vscale x 1 x i1> undef, <vscale x 1 x i32> zeroinitializer), i32 [[TMP19]]), [[TBAA4]], !llvm.access.group !8
; NO-STRIDE-NEXT:    [[TMP36:%.*]] = add nsw i64 [[TMP15]], [[TMP3]]
; NO-STRIDE-NEXT:    [[TMP37:%.*]] = getelementptr inbounds double, double* [[VA]], i64 [[TMP36]]
; NO-STRIDE-NEXT:    [[TMP38:%.*]] = bitcast double* [[TMP37]] to <vscale x 1 x double>*
; NO-STRIDE-NEXT:    [[VP_OP_LOAD24:%.*]] = call <vscale x 1 x double> @llvm.vp.load.nxv1f64.p0nxv1f64(<vscale x 1 x double>* [[TMP38]], i32 8, <vscale x 1 x i1> shufflevector (<vscale x 1 x i1> insertelement (<vscale x 1 x i1> undef, i1 true, i32 0), <vscale x 1 x i1> undef, <vscale x 1 x i32> zeroinitializer), i32 [[TMP19]]), [[TBAA4]], !llvm.access.group !8
; NO-STRIDE-NEXT:    [[TMP39:%.*]] = add nsw i64 [[TMP21]], [[TMP3]]
; NO-STRIDE-NEXT:    [[TMP40:%.*]] = getelementptr inbounds double, double* [[VA]], i64 [[TMP39]]
; NO-STRIDE-NEXT:    [[TMP41:%.*]] = bitcast double* [[TMP40]] to <vscale x 1 x double>*
; NO-STRIDE-NEXT:    [[VP_OP_LOAD27:%.*]] = call <vscale x 1 x double> @llvm.vp.load.nxv1f64.p0nxv1f64(<vscale x 1 x double>* [[TMP41]], i32 8, <vscale x 1 x i1> shufflevector (<vscale x 1 x i1> insertelement (<vscale x 1 x i1> undef, i1 true, i32 0), <vscale x 1 x i1> undef, <vscale x 1 x i32> zeroinitializer), i32 [[TMP19]]), [[TBAA4]], !llvm.access.group !8
; NO-STRIDE-NEXT:    [[TMP42:%.*]] = add nsw i64 [[TMP15]], [[TMP4]]
; NO-STRIDE-NEXT:    [[TMP43:%.*]] = getelementptr inbounds double, double* [[VA]], i64 [[TMP42]]
; NO-STRIDE-NEXT:    [[TMP44:%.*]] = bitcast double* [[TMP43]] to <vscale x 1 x double>*
; NO-STRIDE-NEXT:    [[VP_OP_LOAD30:%.*]] = call <vscale x 1 x double> @llvm.vp.load.nxv1f64.p0nxv1f64(<vscale x 1 x double>* [[TMP44]], i32 8, <vscale x 1 x i1> shufflevector (<vscale x 1 x i1> insertelement (<vscale x 1 x i1> undef, i1 true, i32 0), <vscale x 1 x i1> undef, <vscale x 1 x i32> zeroinitializer), i32 [[TMP19]]), [[TBAA4]], !llvm.access.group !8
; NO-STRIDE-NEXT:    [[TMP45:%.*]] = add nsw i64 [[TMP21]], [[TMP4]]
; NO-STRIDE-NEXT:    [[TMP46:%.*]] = getelementptr inbounds double, double* [[VA]], i64 [[TMP45]]
; NO-STRIDE-NEXT:    [[TMP47:%.*]] = bitcast double* [[TMP46]] to <vscale x 1 x double>*
; NO-STRIDE-NEXT:    [[VP_OP_LOAD33:%.*]] = call <vscale x 1 x double> @llvm.vp.load.nxv1f64.p0nxv1f64(<vscale x 1 x double>* [[TMP47]], i32 8, <vscale x 1 x i1> shufflevector (<vscale x 1 x i1> insertelement (<vscale x 1 x i1> undef, i1 true, i32 0), <vscale x 1 x i1> undef, <vscale x 1 x i32> zeroinitializer), i32 [[TMP19]]), [[TBAA4]], !llvm.access.group !8
; NO-STRIDE-NEXT:    [[TMP48:%.*]] = add nsw i64 [[TMP15]], [[TMP5]]
; NO-STRIDE-NEXT:    [[TMP49:%.*]] = getelementptr inbounds double, double* [[VA]], i64 [[TMP48]]
; NO-STRIDE-NEXT:    [[TMP50:%.*]] = bitcast double* [[TMP49]] to <vscale x 1 x double>*
; NO-STRIDE-NEXT:    [[VP_OP_LOAD36:%.*]] = call <vscale x 1 x double> @llvm.vp.load.nxv1f64.p0nxv1f64(<vscale x 1 x double>* [[TMP50]], i32 8, <vscale x 1 x i1> shufflevector (<vscale x 1 x i1> insertelement (<vscale x 1 x i1> undef, i1 true, i32 0), <vscale x 1 x i1> undef, <vscale x 1 x i32> zeroinitializer), i32 [[TMP19]]), [[TBAA4]], !llvm.access.group !8
; NO-STRIDE-NEXT:    [[TMP51:%.*]] = add nsw i64 [[TMP21]], [[TMP5]]
; NO-STRIDE-NEXT:    [[TMP52:%.*]] = getelementptr inbounds double, double* [[VA]], i64 [[TMP51]]
; NO-STRIDE-NEXT:    [[TMP53:%.*]] = bitcast double* [[TMP52]] to <vscale x 1 x double>*
; NO-STRIDE-NEXT:    [[VP_OP_LOAD39:%.*]] = call <vscale x 1 x double> @llvm.vp.load.nxv1f64.p0nxv1f64(<vscale x 1 x double>* [[TMP53]], i32 8, <vscale x 1 x i1> shufflevector (<vscale x 1 x i1> insertelement (<vscale x 1 x i1> undef, i1 true, i32 0), <vscale x 1 x i1> undef, <vscale x 1 x i32> zeroinitializer), i32 [[TMP19]]), [[TBAA4]], !llvm.access.group !8
; NO-STRIDE-NEXT:    [[TMP54:%.*]] = add nsw i64 [[TMP15]], [[TMP6]]
; NO-STRIDE-NEXT:    [[TMP55:%.*]] = getelementptr inbounds double, double* [[VA]], i64 [[TMP54]]
; NO-STRIDE-NEXT:    [[TMP56:%.*]] = bitcast double* [[TMP55]] to <vscale x 1 x double>*
; NO-STRIDE-NEXT:    [[VP_OP_LOAD42:%.*]] = call <vscale x 1 x double> @llvm.vp.load.nxv1f64.p0nxv1f64(<vscale x 1 x double>* [[TMP56]], i32 8, <vscale x 1 x i1> shufflevector (<vscale x 1 x i1> insertelement (<vscale x 1 x i1> undef, i1 true, i32 0), <vscale x 1 x i1> undef, <vscale x 1 x i32> zeroinitializer), i32 [[TMP19]]), [[TBAA4]], !llvm.access.group !8
; NO-STRIDE-NEXT:    [[TMP57:%.*]] = add nsw i64 [[TMP21]], [[TMP6]]
; NO-STRIDE-NEXT:    [[TMP58:%.*]] = getelementptr inbounds double, double* [[VA]], i64 [[TMP57]]
; NO-STRIDE-NEXT:    [[TMP59:%.*]] = bitcast double* [[TMP58]] to <vscale x 1 x double>*
; NO-STRIDE-NEXT:    [[VP_OP_LOAD45:%.*]] = call <vscale x 1 x double> @llvm.vp.load.nxv1f64.p0nxv1f64(<vscale x 1 x double>* [[TMP59]], i32 8, <vscale x 1 x i1> shufflevector (<vscale x 1 x i1> insertelement (<vscale x 1 x i1> undef, i1 true, i32 0), <vscale x 1 x i1> undef, <vscale x 1 x i32> zeroinitializer), i32 [[TMP19]]), [[TBAA4]], !llvm.access.group !8
; NO-STRIDE-NEXT:    [[TMP60:%.*]] = add nsw i64 [[TMP15]], [[TMP7]]
; NO-STRIDE-NEXT:    [[TMP61:%.*]] = getelementptr inbounds double, double* [[VA]], i64 [[TMP60]]
; NO-STRIDE-NEXT:    [[TMP62:%.*]] = bitcast double* [[TMP61]] to <vscale x 1 x double>*
; NO-STRIDE-NEXT:    [[VP_OP_LOAD48:%.*]] = call <vscale x 1 x double> @llvm.vp.load.nxv1f64.p0nxv1f64(<vscale x 1 x double>* [[TMP62]], i32 8, <vscale x 1 x i1> shufflevector (<vscale x 1 x i1> insertelement (<vscale x 1 x i1> undef, i1 true, i32 0), <vscale x 1 x i1> undef, <vscale x 1 x i32> zeroinitializer), i32 [[TMP19]]), [[TBAA4]], !llvm.access.group !8
; NO-STRIDE-NEXT:    [[TMP63:%.*]] = add nsw i64 [[TMP21]], [[TMP7]]
; NO-STRIDE-NEXT:    [[TMP64:%.*]] = getelementptr inbounds double, double* [[VA]], i64 [[TMP63]]
; NO-STRIDE-NEXT:    [[TMP65:%.*]] = bitcast double* [[TMP64]] to <vscale x 1 x double>*
; NO-STRIDE-NEXT:    [[VP_OP_LOAD51:%.*]] = call <vscale x 1 x double> @llvm.vp.load.nxv1f64.p0nxv1f64(<vscale x 1 x double>* [[TMP65]], i32 8, <vscale x 1 x i1> shufflevector (<vscale x 1 x i1> insertelement (<vscale x 1 x i1> undef, i1 true, i32 0), <vscale x 1 x i1> undef, <vscale x 1 x i32> zeroinitializer), i32 [[TMP19]]), [[TBAA4]], !llvm.access.group !8
; NO-STRIDE-NEXT:    [[VP_OP:%.*]] = call <vscale x 1 x double> @llvm.vp.fadd.nxv1f64(<vscale x 1 x double> [[VP_OP_LOAD]], <vscale x 1 x double> [[VP_OP_LOAD12]], metadata !"round.tonearest", metadata !"fpexcept.ignore", <vscale x 1 x i1> shufflevector (<vscale x 1 x i1> insertelement (<vscale x 1 x i1> undef, i1 true, i32 0), <vscale x 1 x i1> undef, <vscale x 1 x i32> zeroinitializer), i32 [[TMP19]])
; NO-STRIDE-NEXT:    [[VP_OP56:%.*]] = call <vscale x 1 x double> @llvm.vp.fadd.nxv1f64(<vscale x 1 x double> [[VP_OP]], <vscale x 1 x double> [[VP_OP_LOAD18]], metadata !"round.tonearest", metadata !"fpexcept.ignore", <vscale x 1 x i1> shufflevector (<vscale x 1 x i1> insertelement (<vscale x 1 x i1> undef, i1 true, i32 0), <vscale x 1 x i1> undef, <vscale x 1 x i32> zeroinitializer), i32 [[TMP19]])
; NO-STRIDE-NEXT:    [[VP_OP59:%.*]] = call <vscale x 1 x double> @llvm.vp.fadd.nxv1f64(<vscale x 1 x double> [[VP_OP56]], <vscale x 1 x double> [[VP_OP_LOAD24]], metadata !"round.tonearest", metadata !"fpexcept.ignore", <vscale x 1 x i1> shufflevector (<vscale x 1 x i1> insertelement (<vscale x 1 x i1> undef, i1 true, i32 0), <vscale x 1 x i1> undef, <vscale x 1 x i32> zeroinitializer), i32 [[TMP19]])
; NO-STRIDE-NEXT:    [[VP_OP62:%.*]] = call <vscale x 1 x double> @llvm.vp.fadd.nxv1f64(<vscale x 1 x double> [[VP_OP59]], <vscale x 1 x double> [[VP_OP_LOAD30]], metadata !"round.tonearest", metadata !"fpexcept.ignore", <vscale x 1 x i1> shufflevector (<vscale x 1 x i1> insertelement (<vscale x 1 x i1> undef, i1 true, i32 0), <vscale x 1 x i1> undef, <vscale x 1 x i32> zeroinitializer), i32 [[TMP19]])
; NO-STRIDE-NEXT:    [[VP_OP65:%.*]] = call <vscale x 1 x double> @llvm.vp.fadd.nxv1f64(<vscale x 1 x double> [[VP_OP62]], <vscale x 1 x double> [[VP_OP_LOAD36]], metadata !"round.tonearest", metadata !"fpexcept.ignore", <vscale x 1 x i1> shufflevector (<vscale x 1 x i1> insertelement (<vscale x 1 x i1> undef, i1 true, i32 0), <vscale x 1 x i1> undef, <vscale x 1 x i32> zeroinitializer), i32 [[TMP19]])
; NO-STRIDE-NEXT:    [[VP_OP68:%.*]] = call <vscale x 1 x double> @llvm.vp.fadd.nxv1f64(<vscale x 1 x double> [[VP_OP65]], <vscale x 1 x double> [[VP_OP_LOAD42]], metadata !"round.tonearest", metadata !"fpexcept.ignore", <vscale x 1 x i1> shufflevector (<vscale x 1 x i1> insertelement (<vscale x 1 x i1> undef, i1 true, i32 0), <vscale x 1 x i1> undef, <vscale x 1 x i32> zeroinitializer), i32 [[TMP19]])
; NO-STRIDE-NEXT:    [[VP_OP71:%.*]] = call <vscale x 1 x double> @llvm.vp.fadd.nxv1f64(<vscale x 1 x double> [[VP_OP68]], <vscale x 1 x double> [[VP_OP_LOAD48]], metadata !"round.tonearest", metadata !"fpexcept.ignore", <vscale x 1 x i1> shufflevector (<vscale x 1 x i1> insertelement (<vscale x 1 x i1> undef, i1 true, i32 0), <vscale x 1 x i1> undef, <vscale x 1 x i32> zeroinitializer), i32 [[TMP19]])
; NO-STRIDE-NEXT:    [[VP_OP74:%.*]] = call <vscale x 1 x double> @llvm.vp.fadd.nxv1f64(<vscale x 1 x double> [[VP_OP_LOAD9]], <vscale x 1 x double> [[VP_OP_LOAD15]], metadata !"round.tonearest", metadata !"fpexcept.ignore", <vscale x 1 x i1> shufflevector (<vscale x 1 x i1> insertelement (<vscale x 1 x i1> undef, i1 true, i32 0), <vscale x 1 x i1> undef, <vscale x 1 x i32> zeroinitializer), i32 [[TMP19]])
; NO-STRIDE-NEXT:    [[VP_OP77:%.*]] = call <vscale x 1 x double> @llvm.vp.fadd.nxv1f64(<vscale x 1 x double> [[VP_OP74]], <vscale x 1 x double> [[VP_OP_LOAD21]], metadata !"round.tonearest", metadata !"fpexcept.ignore", <vscale x 1 x i1> shufflevector (<vscale x 1 x i1> insertelement (<vscale x 1 x i1> undef, i1 true, i32 0), <vscale x 1 x i1> undef, <vscale x 1 x i32> zeroinitializer), i32 [[TMP19]])
; NO-STRIDE-NEXT:    [[VP_OP80:%.*]] = call <vscale x 1 x double> @llvm.vp.fadd.nxv1f64(<vscale x 1 x double> [[VP_OP77]], <vscale x 1 x double> [[VP_OP_LOAD27]], metadata !"round.tonearest", metadata !"fpexcept.ignore", <vscale x 1 x i1> shufflevector (<vscale x 1 x i1> insertelement (<vscale x 1 x i1> undef, i1 true, i32 0), <vscale x 1 x i1> undef, <vscale x 1 x i32> zeroinitializer), i32 [[TMP19]])
; NO-STRIDE-NEXT:    [[VP_OP83:%.*]] = call <vscale x 1 x double> @llvm.vp.fadd.nxv1f64(<vscale x 1 x double> [[VP_OP80]], <vscale x 1 x double> [[VP_OP_LOAD33]], metadata !"round.tonearest", metadata !"fpexcept.ignore", <vscale x 1 x i1> shufflevector (<vscale x 1 x i1> insertelement (<vscale x 1 x i1> undef, i1 true, i32 0), <vscale x 1 x i1> undef, <vscale x 1 x i32> zeroinitializer), i32 [[TMP19]])
; NO-STRIDE-NEXT:    [[VP_OP86:%.*]] = call <vscale x 1 x double> @llvm.vp.fadd.nxv1f64(<vscale x 1 x double> [[VP_OP83]], <vscale x 1 x double> [[VP_OP_LOAD39]], metadata !"round.tonearest", metadata !"fpexcept.ignore", <vscale x 1 x i1> shufflevector (<vscale x 1 x i1> insertelement (<vscale x 1 x i1> undef, i1 true, i32 0), <vscale x 1 x i1> undef, <vscale x 1 x i32> zeroinitializer), i32 [[TMP19]])
; NO-STRIDE-NEXT:    [[VP_OP89:%.*]] = call <vscale x 1 x double> @llvm.vp.fadd.nxv1f64(<vscale x 1 x double> [[VP_OP86]], <vscale x 1 x double> [[VP_OP_LOAD45]], metadata !"round.tonearest", metadata !"fpexcept.ignore", <vscale x 1 x i1> shufflevector (<vscale x 1 x i1> insertelement (<vscale x 1 x i1> undef, i1 true, i32 0), <vscale x 1 x i1> undef, <vscale x 1 x i32> zeroinitializer), i32 [[TMP19]])
; NO-STRIDE-NEXT:    [[VP_OP92:%.*]] = call <vscale x 1 x double> @llvm.vp.fadd.nxv1f64(<vscale x 1 x double> [[VP_OP89]], <vscale x 1 x double> [[VP_OP_LOAD51]], metadata !"round.tonearest", metadata !"fpexcept.ignore", <vscale x 1 x i1> shufflevector (<vscale x 1 x i1> insertelement (<vscale x 1 x i1> undef, i1 true, i32 0), <vscale x 1 x i1> undef, <vscale x 1 x i32> zeroinitializer), i32 [[TMP19]])
; NO-STRIDE-NEXT:    [[VP_OP97:%.*]] = call <vscale x 1 x double> @llvm.vp.fmul.nxv1f64(<vscale x 1 x double> [[VP_OP71]], <vscale x 1 x double> shufflevector (<vscale x 1 x double> insertelement (<vscale x 1 x double> undef, double 2.000000e+00, i32 0), <vscale x 1 x double> undef, <vscale x 1 x i32> zeroinitializer), metadata !"round.tonearest", metadata !"fpexcept.ignore", <vscale x 1 x i1> shufflevector (<vscale x 1 x i1> insertelement (<vscale x 1 x i1> undef, i1 true, i32 0), <vscale x 1 x i1> undef, <vscale x 1 x i32> zeroinitializer), i32 [[TMP19]])
; NO-STRIDE-NEXT:    [[VP_OP100:%.*]] = call <vscale x 1 x double> @llvm.vp.fmul.nxv1f64(<vscale x 1 x double> [[VP_OP92]], <vscale x 1 x double> shufflevector (<vscale x 1 x double> insertelement (<vscale x 1 x double> undef, double 2.000000e+00, i32 0), <vscale x 1 x double> undef, <vscale x 1 x i32> zeroinitializer), metadata !"round.tonearest", metadata !"fpexcept.ignore", <vscale x 1 x i1> shufflevector (<vscale x 1 x i1> insertelement (<vscale x 1 x i1> undef, i1 true, i32 0), <vscale x 1 x i1> undef, <vscale x 1 x i32> zeroinitializer), i32 [[TMP19]])
; NO-STRIDE-NEXT:    [[TMP66:%.*]] = getelementptr inbounds double, double* [[VB:%.*]], i64 [[TMP15]]
; NO-STRIDE-NEXT:    [[TMP67:%.*]] = bitcast double* [[TMP66]] to <vscale x 1 x double>*
; NO-STRIDE-NEXT:    call void @llvm.vp.store.nxv1f64.p0nxv1f64(<vscale x 1 x double> [[VP_OP71]], <vscale x 1 x double>* [[TMP67]], i32 8, <vscale x 1 x i1> shufflevector (<vscale x 1 x i1> insertelement (<vscale x 1 x i1> undef, i1 true, i32 0), <vscale x 1 x i1> undef, <vscale x 1 x i32> zeroinitializer), i32 [[TMP19]]), [[TBAA4]], !llvm.access.group !8
; NO-STRIDE-NEXT:    [[TMP68:%.*]] = getelementptr inbounds double, double* [[VB]], i64 [[TMP21]]
; NO-STRIDE-NEXT:    [[TMP69:%.*]] = bitcast double* [[TMP68]] to <vscale x 1 x double>*
; NO-STRIDE-NEXT:    call void @llvm.vp.store.nxv1f64.p0nxv1f64(<vscale x 1 x double> [[VP_OP92]], <vscale x 1 x double>* [[TMP69]], i32 8, <vscale x 1 x i1> shufflevector (<vscale x 1 x i1> insertelement (<vscale x 1 x i1> undef, i1 true, i32 0), <vscale x 1 x i1> undef, <vscale x 1 x i32> zeroinitializer), i32 [[TMP19]]), [[TBAA4]], !llvm.access.group !8
; NO-STRIDE-NEXT:    [[TMP70:%.*]] = add nsw i64 [[TMP15]], [[TMP8]]
; NO-STRIDE-NEXT:    [[TMP71:%.*]] = getelementptr inbounds double, double* [[VB]], i64 [[TMP70]]
; NO-STRIDE-NEXT:    [[TMP72:%.*]] = bitcast double* [[TMP71]] to <vscale x 1 x double>*
; NO-STRIDE-NEXT:    call void @llvm.vp.store.nxv1f64.p0nxv1f64(<vscale x 1 x double> [[VP_OP97]], <vscale x 1 x double>* [[TMP72]], i32 8, <vscale x 1 x i1> shufflevector (<vscale x 1 x i1> insertelement (<vscale x 1 x i1> undef, i1 true, i32 0), <vscale x 1 x i1> undef, <vscale x 1 x i32> zeroinitializer), i32 [[TMP19]]), [[TBAA4]], !llvm.access.group !8
; NO-STRIDE-NEXT:    [[TMP73:%.*]] = add nsw i64 [[TMP21]], [[TMP8]]
; NO-STRIDE-NEXT:    [[TMP74:%.*]] = getelementptr inbounds double, double* [[VB]], i64 [[TMP73]]
; NO-STRIDE-NEXT:    [[TMP75:%.*]] = bitcast double* [[TMP74]] to <vscale x 1 x double>*
; NO-STRIDE-NEXT:    call void @llvm.vp.store.nxv1f64.p0nxv1f64(<vscale x 1 x double> [[VP_OP100]], <vscale x 1 x double>* [[TMP75]], i32 8, <vscale x 1 x i1> shufflevector (<vscale x 1 x i1> insertelement (<vscale x 1 x i1> undef, i1 true, i32 0), <vscale x 1 x i1> undef, <vscale x 1 x i32> zeroinitializer), i32 [[TMP19]]), [[TBAA4]], !llvm.access.group !8
; NO-STRIDE-NEXT:    [[TMP76:%.*]] = add nsw i64 [[TMP15]], [[TMP9]]
; NO-STRIDE-NEXT:    [[TMP77:%.*]] = getelementptr inbounds double, double* [[VB]], i64 [[TMP76]]
; NO-STRIDE-NEXT:    [[TMP78:%.*]] = bitcast double* [[TMP77]] to <vscale x 1 x double>*
; NO-STRIDE-NEXT:    call void @llvm.vp.store.nxv1f64.p0nxv1f64(<vscale x 1 x double> [[VP_OP97]], <vscale x 1 x double>* [[TMP78]], i32 8, <vscale x 1 x i1> shufflevector (<vscale x 1 x i1> insertelement (<vscale x 1 x i1> undef, i1 true, i32 0), <vscale x 1 x i1> undef, <vscale x 1 x i32> zeroinitializer), i32 [[TMP19]]), [[TBAA4]], !llvm.access.group !8
; NO-STRIDE-NEXT:    [[TMP79:%.*]] = add nsw i64 [[TMP21]], [[TMP9]]
; NO-STRIDE-NEXT:    [[TMP80:%.*]] = getelementptr inbounds double, double* [[VB]], i64 [[TMP79]]
; NO-STRIDE-NEXT:    [[TMP81:%.*]] = bitcast double* [[TMP80]] to <vscale x 1 x double>*
; NO-STRIDE-NEXT:    call void @llvm.vp.store.nxv1f64.p0nxv1f64(<vscale x 1 x double> [[VP_OP100]], <vscale x 1 x double>* [[TMP81]], i32 8, <vscale x 1 x i1> shufflevector (<vscale x 1 x i1> insertelement (<vscale x 1 x i1> undef, i1 true, i32 0), <vscale x 1 x i1> undef, <vscale x 1 x i32> zeroinitializer), i32 [[TMP19]]), [[TBAA4]], !llvm.access.group !8
; NO-STRIDE-NEXT:    [[TMP82:%.*]] = add nsw i64 [[TMP15]], [[TMP10]]
; NO-STRIDE-NEXT:    [[TMP83:%.*]] = getelementptr inbounds double, double* [[VB]], i64 [[TMP82]]
; NO-STRIDE-NEXT:    [[TMP84:%.*]] = bitcast double* [[TMP83]] to <vscale x 1 x double>*
; NO-STRIDE-NEXT:    call void @llvm.vp.store.nxv1f64.p0nxv1f64(<vscale x 1 x double> [[VP_OP97]], <vscale x 1 x double>* [[TMP84]], i32 8, <vscale x 1 x i1> shufflevector (<vscale x 1 x i1> insertelement (<vscale x 1 x i1> undef, i1 true, i32 0), <vscale x 1 x i1> undef, <vscale x 1 x i32> zeroinitializer), i32 [[TMP19]]), [[TBAA4]], !llvm.access.group !8
; NO-STRIDE-NEXT:    [[TMP85:%.*]] = add nsw i64 [[TMP21]], [[TMP10]]
; NO-STRIDE-NEXT:    [[TMP86:%.*]] = getelementptr inbounds double, double* [[VB]], i64 [[TMP85]]
; NO-STRIDE-NEXT:    [[TMP87:%.*]] = bitcast double* [[TMP86]] to <vscale x 1 x double>*
; NO-STRIDE-NEXT:    call void @llvm.vp.store.nxv1f64.p0nxv1f64(<vscale x 1 x double> [[VP_OP100]], <vscale x 1 x double>* [[TMP87]], i32 8, <vscale x 1 x i1> shufflevector (<vscale x 1 x i1> insertelement (<vscale x 1 x i1> undef, i1 true, i32 0), <vscale x 1 x i1> undef, <vscale x 1 x i32> zeroinitializer), i32 [[TMP19]]), [[TBAA4]], !llvm.access.group !8
; NO-STRIDE-NEXT:    [[TMP88:%.*]] = add nsw i64 [[TMP15]], [[TMP11]]
; NO-STRIDE-NEXT:    [[TMP89:%.*]] = getelementptr inbounds double, double* [[VB]], i64 [[TMP88]]
; NO-STRIDE-NEXT:    [[TMP90:%.*]] = bitcast double* [[TMP89]] to <vscale x 1 x double>*
; NO-STRIDE-NEXT:    call void @llvm.vp.store.nxv1f64.p0nxv1f64(<vscale x 1 x double> [[VP_OP97]], <vscale x 1 x double>* [[TMP90]], i32 8, <vscale x 1 x i1> shufflevector (<vscale x 1 x i1> insertelement (<vscale x 1 x i1> undef, i1 true, i32 0), <vscale x 1 x i1> undef, <vscale x 1 x i32> zeroinitializer), i32 [[TMP19]]), [[TBAA4]], !llvm.access.group !8
; NO-STRIDE-NEXT:    [[TMP91:%.*]] = add nsw i64 [[TMP21]], [[TMP11]]
; NO-STRIDE-NEXT:    [[TMP92:%.*]] = getelementptr inbounds double, double* [[VB]], i64 [[TMP91]]
; NO-STRIDE-NEXT:    [[TMP93:%.*]] = bitcast double* [[TMP92]] to <vscale x 1 x double>*
; NO-STRIDE-NEXT:    call void @llvm.vp.store.nxv1f64.p0nxv1f64(<vscale x 1 x double> [[VP_OP100]], <vscale x 1 x double>* [[TMP93]], i32 8, <vscale x 1 x i1> shufflevector (<vscale x 1 x i1> insertelement (<vscale x 1 x i1> undef, i1 true, i32 0), <vscale x 1 x i1> undef, <vscale x 1 x i32> zeroinitializer), i32 [[TMP19]]), [[TBAA4]], !llvm.access.group !8
; NO-STRIDE-NEXT:    [[TMP94:%.*]] = add nsw i64 [[TMP15]], [[TMP12]]
; NO-STRIDE-NEXT:    [[TMP95:%.*]] = getelementptr inbounds double, double* [[VB]], i64 [[TMP94]]
; NO-STRIDE-NEXT:    [[TMP96:%.*]] = bitcast double* [[TMP95]] to <vscale x 1 x double>*
; NO-STRIDE-NEXT:    call void @llvm.vp.store.nxv1f64.p0nxv1f64(<vscale x 1 x double> [[VP_OP97]], <vscale x 1 x double>* [[TMP96]], i32 8, <vscale x 1 x i1> shufflevector (<vscale x 1 x i1> insertelement (<vscale x 1 x i1> undef, i1 true, i32 0), <vscale x 1 x i1> undef, <vscale x 1 x i32> zeroinitializer), i32 [[TMP19]]), [[TBAA4]], !llvm.access.group !8
; NO-STRIDE-NEXT:    [[TMP97:%.*]] = add nsw i64 [[TMP21]], [[TMP12]]
; NO-STRIDE-NEXT:    [[TMP98:%.*]] = getelementptr inbounds double, double* [[VB]], i64 [[TMP97]]
; NO-STRIDE-NEXT:    [[TMP99:%.*]] = bitcast double* [[TMP98]] to <vscale x 1 x double>*
; NO-STRIDE-NEXT:    call void @llvm.vp.store.nxv1f64.p0nxv1f64(<vscale x 1 x double> [[VP_OP100]], <vscale x 1 x double>* [[TMP99]], i32 8, <vscale x 1 x i1> shufflevector (<vscale x 1 x i1> insertelement (<vscale x 1 x i1> undef, i1 true, i32 0), <vscale x 1 x i1> undef, <vscale x 1 x i32> zeroinitializer), i32 [[TMP19]]), [[TBAA4]], !llvm.access.group !8
; NO-STRIDE-NEXT:    [[TMP100:%.*]] = add nsw i64 [[TMP15]], [[TMP13]]
; NO-STRIDE-NEXT:    [[TMP101:%.*]] = getelementptr inbounds double, double* [[VB]], i64 [[TMP100]]
; NO-STRIDE-NEXT:    [[TMP102:%.*]] = bitcast double* [[TMP101]] to <vscale x 1 x double>*
; NO-STRIDE-NEXT:    call void @llvm.vp.store.nxv1f64.p0nxv1f64(<vscale x 1 x double> [[VP_OP97]], <vscale x 1 x double>* [[TMP102]], i32 8, <vscale x 1 x i1> shufflevector (<vscale x 1 x i1> insertelement (<vscale x 1 x i1> undef, i1 true, i32 0), <vscale x 1 x i1> undef, <vscale x 1 x i32> zeroinitializer), i32 [[TMP19]]), [[TBAA4]], !llvm.access.group !8
; NO-STRIDE-NEXT:    [[TMP103:%.*]] = add nsw i64 [[TMP21]], [[TMP13]]
; NO-STRIDE-NEXT:    [[TMP104:%.*]] = getelementptr inbounds double, double* [[VB]], i64 [[TMP103]]
; NO-STRIDE-NEXT:    [[TMP105:%.*]] = bitcast double* [[TMP104]] to <vscale x 1 x double>*
; NO-STRIDE-NEXT:    call void @llvm.vp.store.nxv1f64.p0nxv1f64(<vscale x 1 x double> [[VP_OP100]], <vscale x 1 x double>* [[TMP105]], i32 8, <vscale x 1 x i1> shufflevector (<vscale x 1 x i1> insertelement (<vscale x 1 x i1> undef, i1 true, i32 0), <vscale x 1 x i1> undef, <vscale x 1 x i32> zeroinitializer), i32 [[TMP19]]), [[TBAA4]], !llvm.access.group !8
; NO-STRIDE-NEXT:    [[TMP106:%.*]] = add nsw i64 [[TMP15]], [[TMP14]]
; NO-STRIDE-NEXT:    [[TMP107:%.*]] = getelementptr inbounds double, double* [[VB]], i64 [[TMP106]]
; NO-STRIDE-NEXT:    [[TMP108:%.*]] = bitcast double* [[TMP107]] to <vscale x 1 x double>*
; NO-STRIDE-NEXT:    call void @llvm.vp.store.nxv1f64.p0nxv1f64(<vscale x 1 x double> [[VP_OP97]], <vscale x 1 x double>* [[TMP108]], i32 8, <vscale x 1 x i1> shufflevector (<vscale x 1 x i1> insertelement (<vscale x 1 x i1> undef, i1 true, i32 0), <vscale x 1 x i1> undef, <vscale x 1 x i32> zeroinitializer), i32 [[TMP19]]), [[TBAA4]], !llvm.access.group !8
; NO-STRIDE-NEXT:    [[TMP109:%.*]] = add nsw i64 [[TMP21]], [[TMP14]]
; NO-STRIDE-NEXT:    [[TMP110:%.*]] = getelementptr inbounds double, double* [[VB]], i64 [[TMP109]]
; NO-STRIDE-NEXT:    [[TMP111:%.*]] = bitcast double* [[TMP110]] to <vscale x 1 x double>*
; NO-STRIDE-NEXT:    call void @llvm.vp.store.nxv1f64.p0nxv1f64(<vscale x 1 x double> [[VP_OP100]], <vscale x 1 x double>* [[TMP111]], i32 8, <vscale x 1 x i1> shufflevector (<vscale x 1 x i1> insertelement (<vscale x 1 x i1> undef, i1 true, i32 0), <vscale x 1 x i1> undef, <vscale x 1 x i32> zeroinitializer), i32 [[TMP19]]), [[TBAA4]], !llvm.access.group !8
; NO-STRIDE-NEXT:    [[TMP112:%.*]] = and i64 [[TMP18]], 4294967295
; NO-STRIDE-NEXT:    [[INDEX_NEXT]] = add i64 [[INDEX]], [[TMP112]]
; NO-STRIDE-NEXT:    [[TMP113:%.*]] = icmp eq i64 [[INDEX_NEXT]], [[WIDE_TRIP_COUNT]]
; NO-STRIDE-NEXT:    br i1 [[TMP113]], label [[FOR_COND_CLEANUP]], label [[VECTOR_BODY]], [[LOOP9:!llvm.loop !.*]]
; NO-STRIDE:       for.cond.cleanup:
; NO-STRIDE-NEXT:    [[TMP114:%.*]] = load double, double* [[VB]], align 8, [[TBAA4]]
; NO-STRIDE-NEXT:    ret double [[TMP114]]
; NO-STRIDE:       for.body:
; NO-STRIDE-NEXT:    [[INDVARS_IV:%.*]] = phi i64 [ [[INDVARS_IV_NEXT:%.*]], [[FOR_BODY]] ], [ 0, [[FOR_BODY_LR_PH]] ]
; NO-STRIDE-NEXT:    [[TMP115:%.*]] = mul nsw i64 [[INDVARS_IV]], [[TMP0]]
; NO-STRIDE-NEXT:    [[ARRAYIDX:%.*]] = getelementptr inbounds double, double* [[VA]], i64 [[TMP115]]
; NO-STRIDE-NEXT:    [[TMP116:%.*]] = load double, double* [[ARRAYIDX]], align 8, [[TBAA4]], !llvm.access.group !8
; NO-STRIDE-NEXT:    [[TMP117:%.*]] = add nsw i64 [[TMP115]], 1
; NO-STRIDE-NEXT:    [[ARRAYIDX4:%.*]] = getelementptr inbounds double, double* [[VA]], i64 [[TMP117]]
; NO-STRIDE-NEXT:    [[TMP118:%.*]] = load double, double* [[ARRAYIDX4]], align 8, [[TBAA4]], !llvm.access.group !8
; NO-STRIDE-NEXT:    [[TMP119:%.*]] = add nsw i64 [[TMP115]], [[TMP1]]
; NO-STRIDE-NEXT:    [[ARRAYIDX9:%.*]] = getelementptr inbounds double, double* [[VA]], i64 [[TMP119]]
; NO-STRIDE-NEXT:    [[TMP120:%.*]] = load double, double* [[ARRAYIDX9]], align 8, [[TBAA4]], !llvm.access.group !8
; NO-STRIDE-NEXT:    [[TMP121:%.*]] = add nsw i64 [[TMP117]], [[TMP1]]
; NO-STRIDE-NEXT:    [[ARRAYIDX15:%.*]] = getelementptr inbounds double, double* [[VA]], i64 [[TMP121]]
; NO-STRIDE-NEXT:    [[TMP122:%.*]] = load double, double* [[ARRAYIDX15]], align 8, [[TBAA4]], !llvm.access.group !8
; NO-STRIDE-NEXT:    [[TMP123:%.*]] = add nsw i64 [[TMP115]], [[TMP2]]
; NO-STRIDE-NEXT:    [[ARRAYIDX22:%.*]] = getelementptr inbounds double, double* [[VA]], i64 [[TMP123]]
; NO-STRIDE-NEXT:    [[TMP124:%.*]] = load double, double* [[ARRAYIDX22]], align 8, [[TBAA4]], !llvm.access.group !8
; NO-STRIDE-NEXT:    [[TMP125:%.*]] = add nsw i64 [[TMP117]], [[TMP2]]
; NO-STRIDE-NEXT:    [[ARRAYIDX29:%.*]] = getelementptr inbounds double, double* [[VA]], i64 [[TMP125]]
; NO-STRIDE-NEXT:    [[TMP126:%.*]] = load double, double* [[ARRAYIDX29]], align 8, [[TBAA4]], !llvm.access.group !8
; NO-STRIDE-NEXT:    [[TMP127:%.*]] = add nsw i64 [[TMP115]], [[TMP3]]
; NO-STRIDE-NEXT:    [[ARRAYIDX36:%.*]] = getelementptr inbounds double, double* [[VA]], i64 [[TMP127]]
; NO-STRIDE-NEXT:    [[TMP128:%.*]] = load double, double* [[ARRAYIDX36]], align 8, [[TBAA4]], !llvm.access.group !8
; NO-STRIDE-NEXT:    [[TMP129:%.*]] = add nsw i64 [[TMP117]], [[TMP3]]
; NO-STRIDE-NEXT:    [[ARRAYIDX43:%.*]] = getelementptr inbounds double, double* [[VA]], i64 [[TMP129]]
; NO-STRIDE-NEXT:    [[TMP130:%.*]] = load double, double* [[ARRAYIDX43]], align 8, [[TBAA4]], !llvm.access.group !8
; NO-STRIDE-NEXT:    [[TMP131:%.*]] = add nsw i64 [[TMP115]], [[TMP4]]
; NO-STRIDE-NEXT:    [[ARRAYIDX50:%.*]] = getelementptr inbounds double, double* [[VA]], i64 [[TMP131]]
; NO-STRIDE-NEXT:    [[TMP132:%.*]] = load double, double* [[ARRAYIDX50]], align 8, [[TBAA4]], !llvm.access.group !8
; NO-STRIDE-NEXT:    [[TMP133:%.*]] = add nsw i64 [[TMP117]], [[TMP4]]
; NO-STRIDE-NEXT:    [[ARRAYIDX57:%.*]] = getelementptr inbounds double, double* [[VA]], i64 [[TMP133]]
; NO-STRIDE-NEXT:    [[TMP134:%.*]] = load double, double* [[ARRAYIDX57]], align 8, [[TBAA4]], !llvm.access.group !8
; NO-STRIDE-NEXT:    [[TMP135:%.*]] = add nsw i64 [[TMP115]], [[TMP5]]
; NO-STRIDE-NEXT:    [[ARRAYIDX64:%.*]] = getelementptr inbounds double, double* [[VA]], i64 [[TMP135]]
; NO-STRIDE-NEXT:    [[TMP136:%.*]] = load double, double* [[ARRAYIDX64]], align 8, [[TBAA4]], !llvm.access.group !8
; NO-STRIDE-NEXT:    [[TMP137:%.*]] = add nsw i64 [[TMP117]], [[TMP5]]
; NO-STRIDE-NEXT:    [[ARRAYIDX71:%.*]] = getelementptr inbounds double, double* [[VA]], i64 [[TMP137]]
; NO-STRIDE-NEXT:    [[TMP138:%.*]] = load double, double* [[ARRAYIDX71]], align 8, [[TBAA4]], !llvm.access.group !8
; NO-STRIDE-NEXT:    [[TMP139:%.*]] = add nsw i64 [[TMP115]], [[TMP6]]
; NO-STRIDE-NEXT:    [[ARRAYIDX78:%.*]] = getelementptr inbounds double, double* [[VA]], i64 [[TMP139]]
; NO-STRIDE-NEXT:    [[TMP140:%.*]] = load double, double* [[ARRAYIDX78]], align 8, [[TBAA4]], !llvm.access.group !8
; NO-STRIDE-NEXT:    [[TMP141:%.*]] = add nsw i64 [[TMP117]], [[TMP6]]
; NO-STRIDE-NEXT:    [[ARRAYIDX85:%.*]] = getelementptr inbounds double, double* [[VA]], i64 [[TMP141]]
; NO-STRIDE-NEXT:    [[TMP142:%.*]] = load double, double* [[ARRAYIDX85]], align 8, [[TBAA4]], !llvm.access.group !8
; NO-STRIDE-NEXT:    [[TMP143:%.*]] = add nsw i64 [[TMP115]], [[TMP7]]
; NO-STRIDE-NEXT:    [[ARRAYIDX92:%.*]] = getelementptr inbounds double, double* [[VA]], i64 [[TMP143]]
; NO-STRIDE-NEXT:    [[TMP144:%.*]] = load double, double* [[ARRAYIDX92]], align 8, [[TBAA4]], !llvm.access.group !8
; NO-STRIDE-NEXT:    [[TMP145:%.*]] = add nsw i64 [[TMP117]], [[TMP7]]
; NO-STRIDE-NEXT:    [[ARRAYIDX99:%.*]] = getelementptr inbounds double, double* [[VA]], i64 [[TMP145]]
; NO-STRIDE-NEXT:    [[TMP146:%.*]] = load double, double* [[ARRAYIDX99]], align 8, [[TBAA4]], !llvm.access.group !8
; NO-STRIDE-NEXT:    [[ADD100:%.*]] = fadd double [[TMP116]], [[TMP120]]
; NO-STRIDE-NEXT:    [[ADD101:%.*]] = fadd double [[ADD100]], [[TMP124]]
; NO-STRIDE-NEXT:    [[ADD102:%.*]] = fadd double [[ADD101]], [[TMP128]]
; NO-STRIDE-NEXT:    [[ADD103:%.*]] = fadd double [[ADD102]], [[TMP132]]
; NO-STRIDE-NEXT:    [[ADD104:%.*]] = fadd double [[ADD103]], [[TMP136]]
; NO-STRIDE-NEXT:    [[ADD105:%.*]] = fadd double [[ADD104]], [[TMP140]]
; NO-STRIDE-NEXT:    [[ADD106:%.*]] = fadd double [[ADD105]], [[TMP144]]
; NO-STRIDE-NEXT:    [[ADD107:%.*]] = fadd double [[TMP118]], [[TMP122]]
; NO-STRIDE-NEXT:    [[ADD108:%.*]] = fadd double [[ADD107]], [[TMP126]]
; NO-STRIDE-NEXT:    [[ADD109:%.*]] = fadd double [[ADD108]], [[TMP130]]
; NO-STRIDE-NEXT:    [[ADD110:%.*]] = fadd double [[ADD109]], [[TMP134]]
; NO-STRIDE-NEXT:    [[ADD111:%.*]] = fadd double [[ADD110]], [[TMP138]]
; NO-STRIDE-NEXT:    [[ADD112:%.*]] = fadd double [[ADD111]], [[TMP142]]
; NO-STRIDE-NEXT:    [[ADD113:%.*]] = fadd double [[ADD112]], [[TMP146]]
; NO-STRIDE-NEXT:    [[MUL114:%.*]] = fmul double [[ADD106]], 2.000000e+00
; NO-STRIDE-NEXT:    [[MUL115:%.*]] = fmul double [[ADD113]], 2.000000e+00
; NO-STRIDE-NEXT:    [[ARRAYIDX131:%.*]] = getelementptr inbounds double, double* [[VB]], i64 [[TMP115]]
; NO-STRIDE-NEXT:    store double [[ADD106]], double* [[ARRAYIDX131]], align 8, [[TBAA4]], !llvm.access.group !8
; NO-STRIDE-NEXT:    [[ARRAYIDX135:%.*]] = getelementptr inbounds double, double* [[VB]], i64 [[TMP117]]
; NO-STRIDE-NEXT:    store double [[ADD113]], double* [[ARRAYIDX135]], align 8, [[TBAA4]], !llvm.access.group !8
; NO-STRIDE-NEXT:    [[TMP147:%.*]] = add nsw i64 [[TMP115]], [[TMP8]]
; NO-STRIDE-NEXT:    [[ARRAYIDX140:%.*]] = getelementptr inbounds double, double* [[VB]], i64 [[TMP147]]
; NO-STRIDE-NEXT:    store double [[MUL114]], double* [[ARRAYIDX140]], align 8, [[TBAA4]], !llvm.access.group !8
; NO-STRIDE-NEXT:    [[TMP148:%.*]] = add nsw i64 [[TMP117]], [[TMP8]]
; NO-STRIDE-NEXT:    [[ARRAYIDX146:%.*]] = getelementptr inbounds double, double* [[VB]], i64 [[TMP148]]
; NO-STRIDE-NEXT:    store double [[MUL115]], double* [[ARRAYIDX146]], align 8, [[TBAA4]], !llvm.access.group !8
; NO-STRIDE-NEXT:    [[TMP149:%.*]] = add nsw i64 [[TMP115]], [[TMP9]]
; NO-STRIDE-NEXT:    [[ARRAYIDX153:%.*]] = getelementptr inbounds double, double* [[VB]], i64 [[TMP149]]
; NO-STRIDE-NEXT:    store double [[MUL114]], double* [[ARRAYIDX153]], align 8, [[TBAA4]], !llvm.access.group !8
; NO-STRIDE-NEXT:    [[TMP150:%.*]] = add nsw i64 [[TMP117]], [[TMP9]]
; NO-STRIDE-NEXT:    [[ARRAYIDX160:%.*]] = getelementptr inbounds double, double* [[VB]], i64 [[TMP150]]
; NO-STRIDE-NEXT:    store double [[MUL115]], double* [[ARRAYIDX160]], align 8, [[TBAA4]], !llvm.access.group !8
; NO-STRIDE-NEXT:    [[TMP151:%.*]] = add nsw i64 [[TMP115]], [[TMP10]]
; NO-STRIDE-NEXT:    [[ARRAYIDX167:%.*]] = getelementptr inbounds double, double* [[VB]], i64 [[TMP151]]
; NO-STRIDE-NEXT:    store double [[MUL114]], double* [[ARRAYIDX167]], align 8, [[TBAA4]], !llvm.access.group !8
; NO-STRIDE-NEXT:    [[TMP152:%.*]] = add nsw i64 [[TMP117]], [[TMP10]]
; NO-STRIDE-NEXT:    [[ARRAYIDX174:%.*]] = getelementptr inbounds double, double* [[VB]], i64 [[TMP152]]
; NO-STRIDE-NEXT:    store double [[MUL115]], double* [[ARRAYIDX174]], align 8, [[TBAA4]], !llvm.access.group !8
; NO-STRIDE-NEXT:    [[TMP153:%.*]] = add nsw i64 [[TMP115]], [[TMP11]]
; NO-STRIDE-NEXT:    [[ARRAYIDX181:%.*]] = getelementptr inbounds double, double* [[VB]], i64 [[TMP153]]
; NO-STRIDE-NEXT:    store double [[MUL114]], double* [[ARRAYIDX181]], align 8, [[TBAA4]], !llvm.access.group !8
; NO-STRIDE-NEXT:    [[TMP154:%.*]] = add nsw i64 [[TMP117]], [[TMP11]]
; NO-STRIDE-NEXT:    [[ARRAYIDX188:%.*]] = getelementptr inbounds double, double* [[VB]], i64 [[TMP154]]
; NO-STRIDE-NEXT:    store double [[MUL115]], double* [[ARRAYIDX188]], align 8, [[TBAA4]], !llvm.access.group !8
; NO-STRIDE-NEXT:    [[TMP155:%.*]] = add nsw i64 [[TMP115]], [[TMP12]]
; NO-STRIDE-NEXT:    [[ARRAYIDX195:%.*]] = getelementptr inbounds double, double* [[VB]], i64 [[TMP155]]
; NO-STRIDE-NEXT:    store double [[MUL114]], double* [[ARRAYIDX195]], align 8, [[TBAA4]], !llvm.access.group !8
; NO-STRIDE-NEXT:    [[TMP156:%.*]] = add nsw i64 [[TMP117]], [[TMP12]]
; NO-STRIDE-NEXT:    [[ARRAYIDX202:%.*]] = getelementptr inbounds double, double* [[VB]], i64 [[TMP156]]
; NO-STRIDE-NEXT:    store double [[MUL115]], double* [[ARRAYIDX202]], align 8, [[TBAA4]], !llvm.access.group !8
; NO-STRIDE-NEXT:    [[TMP157:%.*]] = add nsw i64 [[TMP115]], [[TMP13]]
; NO-STRIDE-NEXT:    [[ARRAYIDX209:%.*]] = getelementptr inbounds double, double* [[VB]], i64 [[TMP157]]
; NO-STRIDE-NEXT:    store double [[MUL114]], double* [[ARRAYIDX209]], align 8, [[TBAA4]], !llvm.access.group !8
; NO-STRIDE-NEXT:    [[TMP158:%.*]] = add nsw i64 [[TMP117]], [[TMP13]]
; NO-STRIDE-NEXT:    [[ARRAYIDX216:%.*]] = getelementptr inbounds double, double* [[VB]], i64 [[TMP158]]
; NO-STRIDE-NEXT:    store double [[MUL115]], double* [[ARRAYIDX216]], align 8, [[TBAA4]], !llvm.access.group !8
; NO-STRIDE-NEXT:    [[TMP159:%.*]] = add nsw i64 [[TMP115]], [[TMP14]]
; NO-STRIDE-NEXT:    [[ARRAYIDX223:%.*]] = getelementptr inbounds double, double* [[VB]], i64 [[TMP159]]
; NO-STRIDE-NEXT:    store double [[MUL114]], double* [[ARRAYIDX223]], align 8, [[TBAA4]], !llvm.access.group !8
; NO-STRIDE-NEXT:    [[TMP160:%.*]] = add nsw i64 [[TMP117]], [[TMP14]]
; NO-STRIDE-NEXT:    [[ARRAYIDX230:%.*]] = getelementptr inbounds double, double* [[VB]], i64 [[TMP160]]
; NO-STRIDE-NEXT:    store double [[MUL115]], double* [[ARRAYIDX230]], align 8, [[TBAA4]], !llvm.access.group !8
; NO-STRIDE-NEXT:    [[INDVARS_IV_NEXT]] = add nuw nsw i64 [[INDVARS_IV]], 1
; NO-STRIDE-NEXT:    [[EXITCOND_NOT:%.*]] = icmp eq i64 [[INDVARS_IV_NEXT]], [[WIDE_TRIP_COUNT]]
; NO-STRIDE-NEXT:    br i1 [[EXITCOND_NOT]], label [[FOR_COND_CLEANUP]], label [[FOR_BODY]], [[LOOP13:!llvm.loop !.*]]
;
; STRIDED-LABEL: @test(
; STRIDED-NEXT:  entry:
; STRIDED-NEXT:    [[CMP402:%.*]] = icmp sgt i32 [[BATCHES:%.*]], 0
; STRIDED-NEXT:    br i1 [[CMP402]], label [[FOR_BODY_LR_PH:%.*]], label [[FOR_COND_CLEANUP:%.*]]
; STRIDED:       for.body.lr.ph:
; STRIDED-NEXT:    [[SHL:%.*]] = shl i32 [[GROUPS:%.*]], 1
; STRIDED-NEXT:    [[MUL19:%.*]] = shl i32 [[GROUPS]], 2
; STRIDED-NEXT:    [[MUL33:%.*]] = mul i32 [[GROUPS]], 6
; STRIDED-NEXT:    [[MUL47:%.*]] = shl i32 [[GROUPS]], 3
; STRIDED-NEXT:    [[MUL61:%.*]] = mul i32 [[GROUPS]], 10
; STRIDED-NEXT:    [[MUL75:%.*]] = mul i32 [[GROUPS]], 12
; STRIDED-NEXT:    [[MUL89:%.*]] = mul i32 [[GROUPS]], 14
; STRIDED-NEXT:    [[SHR:%.*]] = ashr i32 [[N:%.*]], 2
; STRIDED-NEXT:    [[MUL150:%.*]] = shl nsw i32 [[SHR]], 1
; STRIDED-NEXT:    [[MUL164:%.*]] = mul nsw i32 [[SHR]], 3
; STRIDED-NEXT:    [[MUL178:%.*]] = and i32 [[N]], -4
; STRIDED-NEXT:    [[MUL192:%.*]] = mul nsw i32 [[SHR]], 5
; STRIDED-NEXT:    [[MUL206:%.*]] = mul nsw i32 [[SHR]], 6
; STRIDED-NEXT:    [[MUL220:%.*]] = mul nsw i32 [[SHR]], 7
; STRIDED-NEXT:    [[TMP0:%.*]] = sext i32 [[BSTRIDE:%.*]] to i64
; STRIDED-NEXT:    [[TMP1:%.*]] = sext i32 [[SHL]] to i64
; STRIDED-NEXT:    [[TMP2:%.*]] = sext i32 [[MUL19]] to i64
; STRIDED-NEXT:    [[TMP3:%.*]] = sext i32 [[MUL33]] to i64
; STRIDED-NEXT:    [[TMP4:%.*]] = sext i32 [[MUL47]] to i64
; STRIDED-NEXT:    [[TMP5:%.*]] = sext i32 [[MUL61]] to i64
; STRIDED-NEXT:    [[TMP6:%.*]] = sext i32 [[MUL75]] to i64
; STRIDED-NEXT:    [[TMP7:%.*]] = sext i32 [[MUL89]] to i64
; STRIDED-NEXT:    [[TMP8:%.*]] = sext i32 [[SHR]] to i64
; STRIDED-NEXT:    [[TMP9:%.*]] = sext i32 [[MUL150]] to i64
; STRIDED-NEXT:    [[TMP10:%.*]] = sext i32 [[MUL164]] to i64
; STRIDED-NEXT:    [[TMP11:%.*]] = sext i32 [[MUL178]] to i64
; STRIDED-NEXT:    [[TMP12:%.*]] = sext i32 [[MUL192]] to i64
; STRIDED-NEXT:    [[TMP13:%.*]] = sext i32 [[MUL206]] to i64
; STRIDED-NEXT:    [[TMP14:%.*]] = sext i32 [[MUL220]] to i64
; STRIDED-NEXT:    [[WIDE_TRIP_COUNT:%.*]] = zext i32 [[BATCHES]] to i64
; STRIDED-NEXT:    [[TMP15:%.*]] = shl nsw i64 [[TMP0]], 3
; STRIDED-NEXT:    [[SCEVGEP:%.*]] = getelementptr double, double* [[VA:%.*]], i64 1
; STRIDED-NEXT:    [[TMP16:%.*]] = shl nsw i64 [[TMP0]], 3
; STRIDED-NEXT:    [[SCEVGEP26:%.*]] = getelementptr double, double* [[VA]], i64 [[TMP1]]
; STRIDED-NEXT:    [[TMP17:%.*]] = shl nsw i64 [[TMP0]], 3
; STRIDED-NEXT:    [[TMP18:%.*]] = or i64 [[TMP1]], 1
; STRIDED-NEXT:    [[SCEVGEP33:%.*]] = getelementptr double, double* [[VA]], i64 [[TMP18]]
; STRIDED-NEXT:    [[TMP19:%.*]] = shl nsw i64 [[TMP0]], 3
; STRIDED-NEXT:    [[SCEVGEP42:%.*]] = getelementptr double, double* [[VA]], i64 [[TMP2]]
; STRIDED-NEXT:    [[TMP20:%.*]] = shl nsw i64 [[TMP0]], 3
; STRIDED-NEXT:    [[TMP21:%.*]] = or i64 [[TMP2]], 1
; STRIDED-NEXT:    [[SCEVGEP49:%.*]] = getelementptr double, double* [[VA]], i64 [[TMP21]]
; STRIDED-NEXT:    [[TMP22:%.*]] = shl nsw i64 [[TMP0]], 3
; STRIDED-NEXT:    [[SCEVGEP58:%.*]] = getelementptr double, double* [[VA]], i64 [[TMP3]]
; STRIDED-NEXT:    [[TMP23:%.*]] = shl nsw i64 [[TMP0]], 3
; STRIDED-NEXT:    [[TMP24:%.*]] = or i64 [[TMP3]], 1
; STRIDED-NEXT:    [[SCEVGEP65:%.*]] = getelementptr double, double* [[VA]], i64 [[TMP24]]
; STRIDED-NEXT:    [[TMP25:%.*]] = shl nsw i64 [[TMP0]], 3
; STRIDED-NEXT:    [[SCEVGEP74:%.*]] = getelementptr double, double* [[VA]], i64 [[TMP4]]
; STRIDED-NEXT:    [[TMP26:%.*]] = shl nsw i64 [[TMP0]], 3
; STRIDED-NEXT:    [[TMP27:%.*]] = or i64 [[TMP4]], 1
; STRIDED-NEXT:    [[SCEVGEP81:%.*]] = getelementptr double, double* [[VA]], i64 [[TMP27]]
; STRIDED-NEXT:    [[TMP28:%.*]] = shl nsw i64 [[TMP0]], 3
; STRIDED-NEXT:    [[SCEVGEP90:%.*]] = getelementptr double, double* [[VA]], i64 [[TMP5]]
; STRIDED-NEXT:    [[TMP29:%.*]] = shl nsw i64 [[TMP0]], 3
; STRIDED-NEXT:    [[TMP30:%.*]] = or i64 [[TMP5]], 1
; STRIDED-NEXT:    [[SCEVGEP97:%.*]] = getelementptr double, double* [[VA]], i64 [[TMP30]]
; STRIDED-NEXT:    [[TMP31:%.*]] = shl nsw i64 [[TMP0]], 3
; STRIDED-NEXT:    [[SCEVGEP106:%.*]] = getelementptr double, double* [[VA]], i64 [[TMP6]]
; STRIDED-NEXT:    [[TMP32:%.*]] = shl nsw i64 [[TMP0]], 3
; STRIDED-NEXT:    [[TMP33:%.*]] = or i64 [[TMP6]], 1
; STRIDED-NEXT:    [[SCEVGEP113:%.*]] = getelementptr double, double* [[VA]], i64 [[TMP33]]
; STRIDED-NEXT:    [[TMP34:%.*]] = shl nsw i64 [[TMP0]], 3
; STRIDED-NEXT:    [[SCEVGEP122:%.*]] = getelementptr double, double* [[VA]], i64 [[TMP7]]
; STRIDED-NEXT:    [[TMP35:%.*]] = shl nsw i64 [[TMP0]], 3
; STRIDED-NEXT:    [[TMP36:%.*]] = or i64 [[TMP7]], 1
; STRIDED-NEXT:    [[SCEVGEP129:%.*]] = getelementptr double, double* [[VA]], i64 [[TMP36]]
; STRIDED-NEXT:    [[TMP37:%.*]] = shl nsw i64 [[TMP0]], 3
; STRIDED-NEXT:    [[TMP38:%.*]] = shl nsw i64 [[TMP0]], 3
; STRIDED-NEXT:    [[SCEVGEP185:%.*]] = getelementptr double, double* [[VB:%.*]], i64 1
; STRIDED-NEXT:    [[TMP39:%.*]] = shl nsw i64 [[TMP0]], 3
; STRIDED-NEXT:    [[SCEVGEP193:%.*]] = getelementptr double, double* [[VB]], i64 [[TMP8]]
; STRIDED-NEXT:    [[TMP40:%.*]] = shl nsw i64 [[TMP0]], 3
; STRIDED-NEXT:    [[TMP41:%.*]] = add nsw i64 [[TMP8]], 1
; STRIDED-NEXT:    [[SCEVGEP199:%.*]] = getelementptr double, double* [[VB]], i64 [[TMP41]]
; STRIDED-NEXT:    [[TMP42:%.*]] = shl nsw i64 [[TMP0]], 3
; STRIDED-NEXT:    [[SCEVGEP207:%.*]] = getelementptr double, double* [[VB]], i64 [[TMP9]]
; STRIDED-NEXT:    [[TMP43:%.*]] = shl nsw i64 [[TMP0]], 3
; STRIDED-NEXT:    [[TMP44:%.*]] = or i64 [[TMP9]], 1
; STRIDED-NEXT:    [[SCEVGEP213:%.*]] = getelementptr double, double* [[VB]], i64 [[TMP44]]
; STRIDED-NEXT:    [[TMP45:%.*]] = shl nsw i64 [[TMP0]], 3
; STRIDED-NEXT:    [[SCEVGEP221:%.*]] = getelementptr double, double* [[VB]], i64 [[TMP10]]
; STRIDED-NEXT:    [[TMP46:%.*]] = shl nsw i64 [[TMP0]], 3
; STRIDED-NEXT:    [[TMP47:%.*]] = add nsw i64 [[TMP10]], 1
; STRIDED-NEXT:    [[SCEVGEP227:%.*]] = getelementptr double, double* [[VB]], i64 [[TMP47]]
; STRIDED-NEXT:    [[TMP48:%.*]] = shl nsw i64 [[TMP0]], 3
; STRIDED-NEXT:    [[SCEVGEP235:%.*]] = getelementptr double, double* [[VB]], i64 [[TMP11]]
; STRIDED-NEXT:    [[TMP49:%.*]] = shl nsw i64 [[TMP0]], 3
; STRIDED-NEXT:    [[TMP50:%.*]] = or i64 [[TMP11]], 1
; STRIDED-NEXT:    [[SCEVGEP241:%.*]] = getelementptr double, double* [[VB]], i64 [[TMP50]]
; STRIDED-NEXT:    [[TMP51:%.*]] = shl nsw i64 [[TMP0]], 3
; STRIDED-NEXT:    [[SCEVGEP249:%.*]] = getelementptr double, double* [[VB]], i64 [[TMP12]]
; STRIDED-NEXT:    [[TMP52:%.*]] = shl nsw i64 [[TMP0]], 3
; STRIDED-NEXT:    [[TMP53:%.*]] = add nsw i64 [[TMP12]], 1
; STRIDED-NEXT:    [[SCEVGEP255:%.*]] = getelementptr double, double* [[VB]], i64 [[TMP53]]
; STRIDED-NEXT:    [[TMP54:%.*]] = shl nsw i64 [[TMP0]], 3
; STRIDED-NEXT:    [[SCEVGEP263:%.*]] = getelementptr double, double* [[VB]], i64 [[TMP13]]
; STRIDED-NEXT:    [[TMP55:%.*]] = shl nsw i64 [[TMP0]], 3
; STRIDED-NEXT:    [[TMP56:%.*]] = or i64 [[TMP13]], 1
; STRIDED-NEXT:    [[SCEVGEP269:%.*]] = getelementptr double, double* [[VB]], i64 [[TMP56]]
; STRIDED-NEXT:    [[TMP57:%.*]] = shl nsw i64 [[TMP0]], 3
; STRIDED-NEXT:    [[SCEVGEP277:%.*]] = getelementptr double, double* [[VB]], i64 [[TMP14]]
; STRIDED-NEXT:    [[TMP58:%.*]] = shl nsw i64 [[TMP0]], 3
; STRIDED-NEXT:    [[TMP59:%.*]] = add nsw i64 [[TMP14]], 1
; STRIDED-NEXT:    [[SCEVGEP283:%.*]] = getelementptr double, double* [[VB]], i64 [[TMP59]]
; STRIDED-NEXT:    [[TMP60:%.*]] = shl nsw i64 [[TMP0]], 3
; STRIDED-NEXT:    [[TMP61:%.*]] = bitcast double* [[VA]] to i8*
; STRIDED-NEXT:    [[TMP62:%.*]] = bitcast double* [[SCEVGEP]] to i8*
; STRIDED-NEXT:    [[TMP63:%.*]] = bitcast double* [[SCEVGEP26]] to i8*
; STRIDED-NEXT:    [[TMP64:%.*]] = bitcast double* [[SCEVGEP33]] to i8*
; STRIDED-NEXT:    [[TMP65:%.*]] = bitcast double* [[SCEVGEP42]] to i8*
; STRIDED-NEXT:    [[TMP66:%.*]] = bitcast double* [[SCEVGEP49]] to i8*
; STRIDED-NEXT:    [[TMP67:%.*]] = bitcast double* [[SCEVGEP58]] to i8*
; STRIDED-NEXT:    [[TMP68:%.*]] = bitcast double* [[SCEVGEP65]] to i8*
; STRIDED-NEXT:    [[TMP69:%.*]] = bitcast double* [[SCEVGEP74]] to i8*
; STRIDED-NEXT:    [[TMP70:%.*]] = bitcast double* [[SCEVGEP81]] to i8*
; STRIDED-NEXT:    [[TMP71:%.*]] = bitcast double* [[SCEVGEP90]] to i8*
; STRIDED-NEXT:    [[TMP72:%.*]] = bitcast double* [[SCEVGEP97]] to i8*
; STRIDED-NEXT:    [[TMP73:%.*]] = bitcast double* [[SCEVGEP106]] to i8*
; STRIDED-NEXT:    [[TMP74:%.*]] = bitcast double* [[SCEVGEP113]] to i8*
; STRIDED-NEXT:    [[TMP75:%.*]] = bitcast double* [[SCEVGEP122]] to i8*
; STRIDED-NEXT:    [[TMP76:%.*]] = bitcast double* [[SCEVGEP129]] to i8*
; STRIDED-NEXT:    [[TMP77:%.*]] = bitcast double* [[VB]] to i8*
; STRIDED-NEXT:    [[TMP78:%.*]] = bitcast double* [[SCEVGEP185]] to i8*
; STRIDED-NEXT:    [[TMP79:%.*]] = bitcast double* [[SCEVGEP193]] to i8*
; STRIDED-NEXT:    [[TMP80:%.*]] = bitcast double* [[SCEVGEP199]] to i8*
; STRIDED-NEXT:    [[TMP81:%.*]] = bitcast double* [[SCEVGEP207]] to i8*
; STRIDED-NEXT:    [[TMP82:%.*]] = bitcast double* [[SCEVGEP213]] to i8*
; STRIDED-NEXT:    [[TMP83:%.*]] = bitcast double* [[SCEVGEP221]] to i8*
; STRIDED-NEXT:    [[TMP84:%.*]] = bitcast double* [[SCEVGEP227]] to i8*
; STRIDED-NEXT:    [[TMP85:%.*]] = bitcast double* [[SCEVGEP235]] to i8*
; STRIDED-NEXT:    [[TMP86:%.*]] = bitcast double* [[SCEVGEP241]] to i8*
; STRIDED-NEXT:    [[TMP87:%.*]] = bitcast double* [[SCEVGEP249]] to i8*
; STRIDED-NEXT:    [[TMP88:%.*]] = bitcast double* [[SCEVGEP255]] to i8*
; STRIDED-NEXT:    [[TMP89:%.*]] = bitcast double* [[SCEVGEP263]] to i8*
; STRIDED-NEXT:    [[TMP90:%.*]] = bitcast double* [[SCEVGEP269]] to i8*
; STRIDED-NEXT:    [[TMP91:%.*]] = bitcast double* [[SCEVGEP277]] to i8*
; STRIDED-NEXT:    [[TMP92:%.*]] = bitcast double* [[SCEVGEP283]] to i8*
; STRIDED-NEXT:    br label [[VECTOR_BODY:%.*]]
; STRIDED:       vector.body:
; STRIDED-NEXT:    [[INDEX:%.*]] = phi i64 [ 0, [[FOR_BODY_LR_PH]] ], [ [[INDEX_NEXT:%.*]], [[VECTOR_BODY]] ]
; STRIDED-NEXT:    [[TMP93:%.*]] = sub i64 [[WIDE_TRIP_COUNT]], [[INDEX]]
; STRIDED-NEXT:    [[TMP94:%.*]] = call i64 @llvm.epi.vsetvl(i64 [[TMP93]], i64 3, i64 0)
; STRIDED-NEXT:    [[TMP95:%.*]] = trunc i64 [[TMP94]] to i32
; STRIDED-NEXT:    [[TMP96:%.*]] = mul i64 [[INDEX]], [[TMP15]]
; STRIDED-NEXT:    [[TMP97:%.*]] = getelementptr i8, i8* [[TMP61]], i64 [[TMP96]]
; STRIDED-NEXT:    [[TMP98:%.*]] = bitcast i8* [[TMP97]] to double*
; STRIDED-NEXT:    [[VP_STRIDED_LOAD:%.*]] = call <vscale x 1 x double> @llvm.vp.strided.load.nxv1f64.p0f64.i64(double* [[TMP98]], i64 [[TMP15]], <vscale x 1 x i1> shufflevector (<vscale x 1 x i1> insertelement (<vscale x 1 x i1> undef, i1 true, i32 0), <vscale x 1 x i1> undef, <vscale x 1 x i32> zeroinitializer), i32 [[TMP95]])
; STRIDED-NEXT:    [[TMP99:%.*]] = mul i64 [[INDEX]], [[TMP16]]
; STRIDED-NEXT:    [[TMP100:%.*]] = getelementptr i8, i8* [[TMP62]], i64 [[TMP99]]
; STRIDED-NEXT:    [[TMP101:%.*]] = bitcast i8* [[TMP100]] to double*
; STRIDED-NEXT:    [[VP_STRIDED_LOAD18:%.*]] = call <vscale x 1 x double> @llvm.vp.strided.load.nxv1f64.p0f64.i64(double* [[TMP101]], i64 [[TMP16]], <vscale x 1 x i1> shufflevector (<vscale x 1 x i1> insertelement (<vscale x 1 x i1> undef, i1 true, i32 0), <vscale x 1 x i1> undef, <vscale x 1 x i32> zeroinitializer), i32 [[TMP95]])
; STRIDED-NEXT:    [[TMP102:%.*]] = mul i64 [[INDEX]], [[TMP17]]
; STRIDED-NEXT:    [[TMP103:%.*]] = getelementptr i8, i8* [[TMP63]], i64 [[TMP102]]
; STRIDED-NEXT:    [[TMP104:%.*]] = bitcast i8* [[TMP103]] to double*
; STRIDED-NEXT:    [[VP_STRIDED_LOAD27:%.*]] = call <vscale x 1 x double> @llvm.vp.strided.load.nxv1f64.p0f64.i64(double* [[TMP104]], i64 [[TMP17]], <vscale x 1 x i1> shufflevector (<vscale x 1 x i1> insertelement (<vscale x 1 x i1> undef, i1 true, i32 0), <vscale x 1 x i1> undef, <vscale x 1 x i32> zeroinitializer), i32 [[TMP95]])
; STRIDED-NEXT:    [[TMP105:%.*]] = mul i64 [[INDEX]], [[TMP19]]
; STRIDED-NEXT:    [[TMP106:%.*]] = getelementptr i8, i8* [[TMP64]], i64 [[TMP105]]
; STRIDED-NEXT:    [[TMP107:%.*]] = bitcast i8* [[TMP106]] to double*
; STRIDED-NEXT:    [[VP_STRIDED_LOAD34:%.*]] = call <vscale x 1 x double> @llvm.vp.strided.load.nxv1f64.p0f64.i64(double* [[TMP107]], i64 [[TMP19]], <vscale x 1 x i1> shufflevector (<vscale x 1 x i1> insertelement (<vscale x 1 x i1> undef, i1 true, i32 0), <vscale x 1 x i1> undef, <vscale x 1 x i32> zeroinitializer), i32 [[TMP95]])
; STRIDED-NEXT:    [[TMP108:%.*]] = mul i64 [[INDEX]], [[TMP20]]
; STRIDED-NEXT:    [[TMP109:%.*]] = getelementptr i8, i8* [[TMP65]], i64 [[TMP108]]
; STRIDED-NEXT:    [[TMP110:%.*]] = bitcast i8* [[TMP109]] to double*
; STRIDED-NEXT:    [[VP_STRIDED_LOAD43:%.*]] = call <vscale x 1 x double> @llvm.vp.strided.load.nxv1f64.p0f64.i64(double* [[TMP110]], i64 [[TMP20]], <vscale x 1 x i1> shufflevector (<vscale x 1 x i1> insertelement (<vscale x 1 x i1> undef, i1 true, i32 0), <vscale x 1 x i1> undef, <vscale x 1 x i32> zeroinitializer), i32 [[TMP95]])
; STRIDED-NEXT:    [[TMP111:%.*]] = mul i64 [[INDEX]], [[TMP22]]
; STRIDED-NEXT:    [[TMP112:%.*]] = getelementptr i8, i8* [[TMP66]], i64 [[TMP111]]
; STRIDED-NEXT:    [[TMP113:%.*]] = bitcast i8* [[TMP112]] to double*
; STRIDED-NEXT:    [[VP_STRIDED_LOAD50:%.*]] = call <vscale x 1 x double> @llvm.vp.strided.load.nxv1f64.p0f64.i64(double* [[TMP113]], i64 [[TMP22]], <vscale x 1 x i1> shufflevector (<vscale x 1 x i1> insertelement (<vscale x 1 x i1> undef, i1 true, i32 0), <vscale x 1 x i1> undef, <vscale x 1 x i32> zeroinitializer), i32 [[TMP95]])
; STRIDED-NEXT:    [[TMP114:%.*]] = mul i64 [[INDEX]], [[TMP23]]
; STRIDED-NEXT:    [[TMP115:%.*]] = getelementptr i8, i8* [[TMP67]], i64 [[TMP114]]
; STRIDED-NEXT:    [[TMP116:%.*]] = bitcast i8* [[TMP115]] to double*
; STRIDED-NEXT:    [[VP_STRIDED_LOAD59:%.*]] = call <vscale x 1 x double> @llvm.vp.strided.load.nxv1f64.p0f64.i64(double* [[TMP116]], i64 [[TMP23]], <vscale x 1 x i1> shufflevector (<vscale x 1 x i1> insertelement (<vscale x 1 x i1> undef, i1 true, i32 0), <vscale x 1 x i1> undef, <vscale x 1 x i32> zeroinitializer), i32 [[TMP95]])
; STRIDED-NEXT:    [[TMP117:%.*]] = mul i64 [[INDEX]], [[TMP25]]
; STRIDED-NEXT:    [[TMP118:%.*]] = getelementptr i8, i8* [[TMP68]], i64 [[TMP117]]
; STRIDED-NEXT:    [[TMP119:%.*]] = bitcast i8* [[TMP118]] to double*
; STRIDED-NEXT:    [[VP_STRIDED_LOAD66:%.*]] = call <vscale x 1 x double> @llvm.vp.strided.load.nxv1f64.p0f64.i64(double* [[TMP119]], i64 [[TMP25]], <vscale x 1 x i1> shufflevector (<vscale x 1 x i1> insertelement (<vscale x 1 x i1> undef, i1 true, i32 0), <vscale x 1 x i1> undef, <vscale x 1 x i32> zeroinitializer), i32 [[TMP95]])
; STRIDED-NEXT:    [[TMP120:%.*]] = mul i64 [[INDEX]], [[TMP26]]
; STRIDED-NEXT:    [[TMP121:%.*]] = getelementptr i8, i8* [[TMP69]], i64 [[TMP120]]
; STRIDED-NEXT:    [[TMP122:%.*]] = bitcast i8* [[TMP121]] to double*
; STRIDED-NEXT:    [[VP_STRIDED_LOAD75:%.*]] = call <vscale x 1 x double> @llvm.vp.strided.load.nxv1f64.p0f64.i64(double* [[TMP122]], i64 [[TMP26]], <vscale x 1 x i1> shufflevector (<vscale x 1 x i1> insertelement (<vscale x 1 x i1> undef, i1 true, i32 0), <vscale x 1 x i1> undef, <vscale x 1 x i32> zeroinitializer), i32 [[TMP95]])
; STRIDED-NEXT:    [[TMP123:%.*]] = mul i64 [[INDEX]], [[TMP28]]
; STRIDED-NEXT:    [[TMP124:%.*]] = getelementptr i8, i8* [[TMP70]], i64 [[TMP123]]
; STRIDED-NEXT:    [[TMP125:%.*]] = bitcast i8* [[TMP124]] to double*
; STRIDED-NEXT:    [[VP_STRIDED_LOAD82:%.*]] = call <vscale x 1 x double> @llvm.vp.strided.load.nxv1f64.p0f64.i64(double* [[TMP125]], i64 [[TMP28]], <vscale x 1 x i1> shufflevector (<vscale x 1 x i1> insertelement (<vscale x 1 x i1> undef, i1 true, i32 0), <vscale x 1 x i1> undef, <vscale x 1 x i32> zeroinitializer), i32 [[TMP95]])
; STRIDED-NEXT:    [[TMP126:%.*]] = mul i64 [[INDEX]], [[TMP29]]
; STRIDED-NEXT:    [[TMP127:%.*]] = getelementptr i8, i8* [[TMP71]], i64 [[TMP126]]
; STRIDED-NEXT:    [[TMP128:%.*]] = bitcast i8* [[TMP127]] to double*
; STRIDED-NEXT:    [[VP_STRIDED_LOAD91:%.*]] = call <vscale x 1 x double> @llvm.vp.strided.load.nxv1f64.p0f64.i64(double* [[TMP128]], i64 [[TMP29]], <vscale x 1 x i1> shufflevector (<vscale x 1 x i1> insertelement (<vscale x 1 x i1> undef, i1 true, i32 0), <vscale x 1 x i1> undef, <vscale x 1 x i32> zeroinitializer), i32 [[TMP95]])
; STRIDED-NEXT:    [[TMP129:%.*]] = mul i64 [[INDEX]], [[TMP31]]
; STRIDED-NEXT:    [[TMP130:%.*]] = getelementptr i8, i8* [[TMP72]], i64 [[TMP129]]
; STRIDED-NEXT:    [[TMP131:%.*]] = bitcast i8* [[TMP130]] to double*
; STRIDED-NEXT:    [[VP_STRIDED_LOAD98:%.*]] = call <vscale x 1 x double> @llvm.vp.strided.load.nxv1f64.p0f64.i64(double* [[TMP131]], i64 [[TMP31]], <vscale x 1 x i1> shufflevector (<vscale x 1 x i1> insertelement (<vscale x 1 x i1> undef, i1 true, i32 0), <vscale x 1 x i1> undef, <vscale x 1 x i32> zeroinitializer), i32 [[TMP95]])
; STRIDED-NEXT:    [[TMP132:%.*]] = mul i64 [[INDEX]], [[TMP32]]
; STRIDED-NEXT:    [[TMP133:%.*]] = getelementptr i8, i8* [[TMP73]], i64 [[TMP132]]
; STRIDED-NEXT:    [[TMP134:%.*]] = bitcast i8* [[TMP133]] to double*
; STRIDED-NEXT:    [[VP_STRIDED_LOAD107:%.*]] = call <vscale x 1 x double> @llvm.vp.strided.load.nxv1f64.p0f64.i64(double* [[TMP134]], i64 [[TMP32]], <vscale x 1 x i1> shufflevector (<vscale x 1 x i1> insertelement (<vscale x 1 x i1> undef, i1 true, i32 0), <vscale x 1 x i1> undef, <vscale x 1 x i32> zeroinitializer), i32 [[TMP95]])
; STRIDED-NEXT:    [[TMP135:%.*]] = mul i64 [[INDEX]], [[TMP34]]
; STRIDED-NEXT:    [[TMP136:%.*]] = getelementptr i8, i8* [[TMP74]], i64 [[TMP135]]
; STRIDED-NEXT:    [[TMP137:%.*]] = bitcast i8* [[TMP136]] to double*
; STRIDED-NEXT:    [[VP_STRIDED_LOAD114:%.*]] = call <vscale x 1 x double> @llvm.vp.strided.load.nxv1f64.p0f64.i64(double* [[TMP137]], i64 [[TMP34]], <vscale x 1 x i1> shufflevector (<vscale x 1 x i1> insertelement (<vscale x 1 x i1> undef, i1 true, i32 0), <vscale x 1 x i1> undef, <vscale x 1 x i32> zeroinitializer), i32 [[TMP95]])
; STRIDED-NEXT:    [[TMP138:%.*]] = mul i64 [[INDEX]], [[TMP35]]
; STRIDED-NEXT:    [[TMP139:%.*]] = getelementptr i8, i8* [[TMP75]], i64 [[TMP138]]
; STRIDED-NEXT:    [[TMP140:%.*]] = bitcast i8* [[TMP139]] to double*
; STRIDED-NEXT:    [[VP_STRIDED_LOAD123:%.*]] = call <vscale x 1 x double> @llvm.vp.strided.load.nxv1f64.p0f64.i64(double* [[TMP140]], i64 [[TMP35]], <vscale x 1 x i1> shufflevector (<vscale x 1 x i1> insertelement (<vscale x 1 x i1> undef, i1 true, i32 0), <vscale x 1 x i1> undef, <vscale x 1 x i32> zeroinitializer), i32 [[TMP95]])
; STRIDED-NEXT:    [[TMP141:%.*]] = mul i64 [[INDEX]], [[TMP37]]
; STRIDED-NEXT:    [[TMP142:%.*]] = getelementptr i8, i8* [[TMP76]], i64 [[TMP141]]
; STRIDED-NEXT:    [[TMP143:%.*]] = bitcast i8* [[TMP142]] to double*
; STRIDED-NEXT:    [[VP_STRIDED_LOAD130:%.*]] = call <vscale x 1 x double> @llvm.vp.strided.load.nxv1f64.p0f64.i64(double* [[TMP143]], i64 [[TMP37]], <vscale x 1 x i1> shufflevector (<vscale x 1 x i1> insertelement (<vscale x 1 x i1> undef, i1 true, i32 0), <vscale x 1 x i1> undef, <vscale x 1 x i32> zeroinitializer), i32 [[TMP95]])
; STRIDED-NEXT:    [[VP_OP133:%.*]] = call <vscale x 1 x double> @llvm.vp.fadd.nxv1f64(<vscale x 1 x double> [[VP_STRIDED_LOAD]], <vscale x 1 x double> [[VP_STRIDED_LOAD27]], metadata !"round.tonearest", metadata !"fpexcept.ignore", <vscale x 1 x i1> shufflevector (<vscale x 1 x i1> insertelement (<vscale x 1 x i1> undef, i1 true, i32 0), <vscale x 1 x i1> undef, <vscale x 1 x i32> zeroinitializer), i32 [[TMP95]])
; STRIDED-NEXT:    [[VP_OP136:%.*]] = call <vscale x 1 x double> @llvm.vp.fadd.nxv1f64(<vscale x 1 x double> [[VP_OP133]], <vscale x 1 x double> [[VP_STRIDED_LOAD43]], metadata !"round.tonearest", metadata !"fpexcept.ignore", <vscale x 1 x i1> shufflevector (<vscale x 1 x i1> insertelement (<vscale x 1 x i1> undef, i1 true, i32 0), <vscale x 1 x i1> undef, <vscale x 1 x i32> zeroinitializer), i32 [[TMP95]])
; STRIDED-NEXT:    [[VP_OP139:%.*]] = call <vscale x 1 x double> @llvm.vp.fadd.nxv1f64(<vscale x 1 x double> [[VP_OP136]], <vscale x 1 x double> [[VP_STRIDED_LOAD59]], metadata !"round.tonearest", metadata !"fpexcept.ignore", <vscale x 1 x i1> shufflevector (<vscale x 1 x i1> insertelement (<vscale x 1 x i1> undef, i1 true, i32 0), <vscale x 1 x i1> undef, <vscale x 1 x i32> zeroinitializer), i32 [[TMP95]])
; STRIDED-NEXT:    [[VP_OP142:%.*]] = call <vscale x 1 x double> @llvm.vp.fadd.nxv1f64(<vscale x 1 x double> [[VP_OP139]], <vscale x 1 x double> [[VP_STRIDED_LOAD75]], metadata !"round.tonearest", metadata !"fpexcept.ignore", <vscale x 1 x i1> shufflevector (<vscale x 1 x i1> insertelement (<vscale x 1 x i1> undef, i1 true, i32 0), <vscale x 1 x i1> undef, <vscale x 1 x i32> zeroinitializer), i32 [[TMP95]])
; STRIDED-NEXT:    [[VP_OP145:%.*]] = call <vscale x 1 x double> @llvm.vp.fadd.nxv1f64(<vscale x 1 x double> [[VP_OP142]], <vscale x 1 x double> [[VP_STRIDED_LOAD91]], metadata !"round.tonearest", metadata !"fpexcept.ignore", <vscale x 1 x i1> shufflevector (<vscale x 1 x i1> insertelement (<vscale x 1 x i1> undef, i1 true, i32 0), <vscale x 1 x i1> undef, <vscale x 1 x i32> zeroinitializer), i32 [[TMP95]])
; STRIDED-NEXT:    [[VP_OP148:%.*]] = call <vscale x 1 x double> @llvm.vp.fadd.nxv1f64(<vscale x 1 x double> [[VP_OP145]], <vscale x 1 x double> [[VP_STRIDED_LOAD107]], metadata !"round.tonearest", metadata !"fpexcept.ignore", <vscale x 1 x i1> shufflevector (<vscale x 1 x i1> insertelement (<vscale x 1 x i1> undef, i1 true, i32 0), <vscale x 1 x i1> undef, <vscale x 1 x i32> zeroinitializer), i32 [[TMP95]])
; STRIDED-NEXT:    [[VP_OP151:%.*]] = call <vscale x 1 x double> @llvm.vp.fadd.nxv1f64(<vscale x 1 x double> [[VP_OP148]], <vscale x 1 x double> [[VP_STRIDED_LOAD123]], metadata !"round.tonearest", metadata !"fpexcept.ignore", <vscale x 1 x i1> shufflevector (<vscale x 1 x i1> insertelement (<vscale x 1 x i1> undef, i1 true, i32 0), <vscale x 1 x i1> undef, <vscale x 1 x i32> zeroinitializer), i32 [[TMP95]])
; STRIDED-NEXT:    [[VP_OP154:%.*]] = call <vscale x 1 x double> @llvm.vp.fadd.nxv1f64(<vscale x 1 x double> [[VP_STRIDED_LOAD18]], <vscale x 1 x double> [[VP_STRIDED_LOAD34]], metadata !"round.tonearest", metadata !"fpexcept.ignore", <vscale x 1 x i1> shufflevector (<vscale x 1 x i1> insertelement (<vscale x 1 x i1> undef, i1 true, i32 0), <vscale x 1 x i1> undef, <vscale x 1 x i32> zeroinitializer), i32 [[TMP95]])
; STRIDED-NEXT:    [[VP_OP157:%.*]] = call <vscale x 1 x double> @llvm.vp.fadd.nxv1f64(<vscale x 1 x double> [[VP_OP154]], <vscale x 1 x double> [[VP_STRIDED_LOAD50]], metadata !"round.tonearest", metadata !"fpexcept.ignore", <vscale x 1 x i1> shufflevector (<vscale x 1 x i1> insertelement (<vscale x 1 x i1> undef, i1 true, i32 0), <vscale x 1 x i1> undef, <vscale x 1 x i32> zeroinitializer), i32 [[TMP95]])
; STRIDED-NEXT:    [[VP_OP160:%.*]] = call <vscale x 1 x double> @llvm.vp.fadd.nxv1f64(<vscale x 1 x double> [[VP_OP157]], <vscale x 1 x double> [[VP_STRIDED_LOAD66]], metadata !"round.tonearest", metadata !"fpexcept.ignore", <vscale x 1 x i1> shufflevector (<vscale x 1 x i1> insertelement (<vscale x 1 x i1> undef, i1 true, i32 0), <vscale x 1 x i1> undef, <vscale x 1 x i32> zeroinitializer), i32 [[TMP95]])
; STRIDED-NEXT:    [[VP_OP163:%.*]] = call <vscale x 1 x double> @llvm.vp.fadd.nxv1f64(<vscale x 1 x double> [[VP_OP160]], <vscale x 1 x double> [[VP_STRIDED_LOAD82]], metadata !"round.tonearest", metadata !"fpexcept.ignore", <vscale x 1 x i1> shufflevector (<vscale x 1 x i1> insertelement (<vscale x 1 x i1> undef, i1 true, i32 0), <vscale x 1 x i1> undef, <vscale x 1 x i32> zeroinitializer), i32 [[TMP95]])
; STRIDED-NEXT:    [[VP_OP166:%.*]] = call <vscale x 1 x double> @llvm.vp.fadd.nxv1f64(<vscale x 1 x double> [[VP_OP163]], <vscale x 1 x double> [[VP_STRIDED_LOAD98]], metadata !"round.tonearest", metadata !"fpexcept.ignore", <vscale x 1 x i1> shufflevector (<vscale x 1 x i1> insertelement (<vscale x 1 x i1> undef, i1 true, i32 0), <vscale x 1 x i1> undef, <vscale x 1 x i32> zeroinitializer), i32 [[TMP95]])
; STRIDED-NEXT:    [[VP_OP169:%.*]] = call <vscale x 1 x double> @llvm.vp.fadd.nxv1f64(<vscale x 1 x double> [[VP_OP166]], <vscale x 1 x double> [[VP_STRIDED_LOAD114]], metadata !"round.tonearest", metadata !"fpexcept.ignore", <vscale x 1 x i1> shufflevector (<vscale x 1 x i1> insertelement (<vscale x 1 x i1> undef, i1 true, i32 0), <vscale x 1 x i1> undef, <vscale x 1 x i32> zeroinitializer), i32 [[TMP95]])
; STRIDED-NEXT:    [[VP_OP172:%.*]] = call <vscale x 1 x double> @llvm.vp.fadd.nxv1f64(<vscale x 1 x double> [[VP_OP169]], <vscale x 1 x double> [[VP_STRIDED_LOAD130]], metadata !"round.tonearest", metadata !"fpexcept.ignore", <vscale x 1 x i1> shufflevector (<vscale x 1 x i1> insertelement (<vscale x 1 x i1> undef, i1 true, i32 0), <vscale x 1 x i1> undef, <vscale x 1 x i32> zeroinitializer), i32 [[TMP95]])
; STRIDED-NEXT:    [[VP_OP177:%.*]] = call <vscale x 1 x double> @llvm.vp.fmul.nxv1f64(<vscale x 1 x double> [[VP_OP151]], <vscale x 1 x double> shufflevector (<vscale x 1 x double> insertelement (<vscale x 1 x double> undef, double 2.000000e+00, i32 0), <vscale x 1 x double> undef, <vscale x 1 x i32> zeroinitializer), metadata !"round.tonearest", metadata !"fpexcept.ignore", <vscale x 1 x i1> shufflevector (<vscale x 1 x i1> insertelement (<vscale x 1 x i1> undef, i1 true, i32 0), <vscale x 1 x i1> undef, <vscale x 1 x i32> zeroinitializer), i32 [[TMP95]])
; STRIDED-NEXT:    [[VP_OP180:%.*]] = call <vscale x 1 x double> @llvm.vp.fmul.nxv1f64(<vscale x 1 x double> [[VP_OP172]], <vscale x 1 x double> shufflevector (<vscale x 1 x double> insertelement (<vscale x 1 x double> undef, double 2.000000e+00, i32 0), <vscale x 1 x double> undef, <vscale x 1 x i32> zeroinitializer), metadata !"round.tonearest", metadata !"fpexcept.ignore", <vscale x 1 x i1> shufflevector (<vscale x 1 x i1> insertelement (<vscale x 1 x i1> undef, i1 true, i32 0), <vscale x 1 x i1> undef, <vscale x 1 x i32> zeroinitializer), i32 [[TMP95]])
; STRIDED-NEXT:    [[TMP144:%.*]] = mul i64 [[INDEX]], [[TMP38]]
; STRIDED-NEXT:    [[TMP145:%.*]] = getelementptr i8, i8* [[TMP77]], i64 [[TMP144]]
; STRIDED-NEXT:    [[TMP146:%.*]] = bitcast i8* [[TMP145]] to double*
; STRIDED-NEXT:    call void @llvm.vp.strided.store.nxv1f64.p0f64.i64(<vscale x 1 x double> [[VP_OP151]], double* [[TMP146]], i64 [[TMP38]], <vscale x 1 x i1> shufflevector (<vscale x 1 x i1> insertelement (<vscale x 1 x i1> undef, i1 true, i32 0), <vscale x 1 x i1> undef, <vscale x 1 x i32> zeroinitializer), i32 [[TMP95]]), [[TBAA4:!tbaa !.*]], !llvm.access.group !8
; STRIDED-NEXT:    [[TMP147:%.*]] = mul i64 [[INDEX]], [[TMP39]]
; STRIDED-NEXT:    [[TMP148:%.*]] = getelementptr i8, i8* [[TMP78]], i64 [[TMP147]]
; STRIDED-NEXT:    [[TMP149:%.*]] = bitcast i8* [[TMP148]] to double*
; STRIDED-NEXT:    call void @llvm.vp.strided.store.nxv1f64.p0f64.i64(<vscale x 1 x double> [[VP_OP172]], double* [[TMP149]], i64 [[TMP39]], <vscale x 1 x i1> shufflevector (<vscale x 1 x i1> insertelement (<vscale x 1 x i1> undef, i1 true, i32 0), <vscale x 1 x i1> undef, <vscale x 1 x i32> zeroinitializer), i32 [[TMP95]]), [[TBAA4]], !llvm.access.group !8
; STRIDED-NEXT:    [[TMP150:%.*]] = mul i64 [[INDEX]], [[TMP40]]
; STRIDED-NEXT:    [[TMP151:%.*]] = getelementptr i8, i8* [[TMP79]], i64 [[TMP150]]
; STRIDED-NEXT:    [[TMP152:%.*]] = bitcast i8* [[TMP151]] to double*
; STRIDED-NEXT:    call void @llvm.vp.strided.store.nxv1f64.p0f64.i64(<vscale x 1 x double> [[VP_OP177]], double* [[TMP152]], i64 [[TMP40]], <vscale x 1 x i1> shufflevector (<vscale x 1 x i1> insertelement (<vscale x 1 x i1> undef, i1 true, i32 0), <vscale x 1 x i1> undef, <vscale x 1 x i32> zeroinitializer), i32 [[TMP95]]), [[TBAA4]], !llvm.access.group !8
; STRIDED-NEXT:    [[TMP153:%.*]] = mul i64 [[INDEX]], [[TMP42]]
; STRIDED-NEXT:    [[TMP154:%.*]] = getelementptr i8, i8* [[TMP80]], i64 [[TMP153]]
; STRIDED-NEXT:    [[TMP155:%.*]] = bitcast i8* [[TMP154]] to double*
; STRIDED-NEXT:    call void @llvm.vp.strided.store.nxv1f64.p0f64.i64(<vscale x 1 x double> [[VP_OP180]], double* [[TMP155]], i64 [[TMP42]], <vscale x 1 x i1> shufflevector (<vscale x 1 x i1> insertelement (<vscale x 1 x i1> undef, i1 true, i32 0), <vscale x 1 x i1> undef, <vscale x 1 x i32> zeroinitializer), i32 [[TMP95]]), [[TBAA4]], !llvm.access.group !8
; STRIDED-NEXT:    [[TMP156:%.*]] = mul i64 [[INDEX]], [[TMP43]]
; STRIDED-NEXT:    [[TMP157:%.*]] = getelementptr i8, i8* [[TMP81]], i64 [[TMP156]]
; STRIDED-NEXT:    [[TMP158:%.*]] = bitcast i8* [[TMP157]] to double*
; STRIDED-NEXT:    call void @llvm.vp.strided.store.nxv1f64.p0f64.i64(<vscale x 1 x double> [[VP_OP177]], double* [[TMP158]], i64 [[TMP43]], <vscale x 1 x i1> shufflevector (<vscale x 1 x i1> insertelement (<vscale x 1 x i1> undef, i1 true, i32 0), <vscale x 1 x i1> undef, <vscale x 1 x i32> zeroinitializer), i32 [[TMP95]]), [[TBAA4]], !llvm.access.group !8
; STRIDED-NEXT:    [[TMP159:%.*]] = mul i64 [[INDEX]], [[TMP45]]
; STRIDED-NEXT:    [[TMP160:%.*]] = getelementptr i8, i8* [[TMP82]], i64 [[TMP159]]
; STRIDED-NEXT:    [[TMP161:%.*]] = bitcast i8* [[TMP160]] to double*
; STRIDED-NEXT:    call void @llvm.vp.strided.store.nxv1f64.p0f64.i64(<vscale x 1 x double> [[VP_OP180]], double* [[TMP161]], i64 [[TMP45]], <vscale x 1 x i1> shufflevector (<vscale x 1 x i1> insertelement (<vscale x 1 x i1> undef, i1 true, i32 0), <vscale x 1 x i1> undef, <vscale x 1 x i32> zeroinitializer), i32 [[TMP95]]), [[TBAA4]], !llvm.access.group !8
; STRIDED-NEXT:    [[TMP162:%.*]] = mul i64 [[INDEX]], [[TMP46]]
; STRIDED-NEXT:    [[TMP163:%.*]] = getelementptr i8, i8* [[TMP83]], i64 [[TMP162]]
; STRIDED-NEXT:    [[TMP164:%.*]] = bitcast i8* [[TMP163]] to double*
; STRIDED-NEXT:    call void @llvm.vp.strided.store.nxv1f64.p0f64.i64(<vscale x 1 x double> [[VP_OP177]], double* [[TMP164]], i64 [[TMP46]], <vscale x 1 x i1> shufflevector (<vscale x 1 x i1> insertelement (<vscale x 1 x i1> undef, i1 true, i32 0), <vscale x 1 x i1> undef, <vscale x 1 x i32> zeroinitializer), i32 [[TMP95]]), [[TBAA4]], !llvm.access.group !8
; STRIDED-NEXT:    [[TMP165:%.*]] = mul i64 [[INDEX]], [[TMP48]]
; STRIDED-NEXT:    [[TMP166:%.*]] = getelementptr i8, i8* [[TMP84]], i64 [[TMP165]]
; STRIDED-NEXT:    [[TMP167:%.*]] = bitcast i8* [[TMP166]] to double*
; STRIDED-NEXT:    call void @llvm.vp.strided.store.nxv1f64.p0f64.i64(<vscale x 1 x double> [[VP_OP180]], double* [[TMP167]], i64 [[TMP48]], <vscale x 1 x i1> shufflevector (<vscale x 1 x i1> insertelement (<vscale x 1 x i1> undef, i1 true, i32 0), <vscale x 1 x i1> undef, <vscale x 1 x i32> zeroinitializer), i32 [[TMP95]]), [[TBAA4]], !llvm.access.group !8
; STRIDED-NEXT:    [[TMP168:%.*]] = mul i64 [[INDEX]], [[TMP49]]
; STRIDED-NEXT:    [[TMP169:%.*]] = getelementptr i8, i8* [[TMP85]], i64 [[TMP168]]
; STRIDED-NEXT:    [[TMP170:%.*]] = bitcast i8* [[TMP169]] to double*
; STRIDED-NEXT:    call void @llvm.vp.strided.store.nxv1f64.p0f64.i64(<vscale x 1 x double> [[VP_OP177]], double* [[TMP170]], i64 [[TMP49]], <vscale x 1 x i1> shufflevector (<vscale x 1 x i1> insertelement (<vscale x 1 x i1> undef, i1 true, i32 0), <vscale x 1 x i1> undef, <vscale x 1 x i32> zeroinitializer), i32 [[TMP95]]), [[TBAA4]], !llvm.access.group !8
; STRIDED-NEXT:    [[TMP171:%.*]] = mul i64 [[INDEX]], [[TMP51]]
; STRIDED-NEXT:    [[TMP172:%.*]] = getelementptr i8, i8* [[TMP86]], i64 [[TMP171]]
; STRIDED-NEXT:    [[TMP173:%.*]] = bitcast i8* [[TMP172]] to double*
; STRIDED-NEXT:    call void @llvm.vp.strided.store.nxv1f64.p0f64.i64(<vscale x 1 x double> [[VP_OP180]], double* [[TMP173]], i64 [[TMP51]], <vscale x 1 x i1> shufflevector (<vscale x 1 x i1> insertelement (<vscale x 1 x i1> undef, i1 true, i32 0), <vscale x 1 x i1> undef, <vscale x 1 x i32> zeroinitializer), i32 [[TMP95]]), [[TBAA4]], !llvm.access.group !8
; STRIDED-NEXT:    [[TMP174:%.*]] = mul i64 [[INDEX]], [[TMP52]]
; STRIDED-NEXT:    [[TMP175:%.*]] = getelementptr i8, i8* [[TMP87]], i64 [[TMP174]]
; STRIDED-NEXT:    [[TMP176:%.*]] = bitcast i8* [[TMP175]] to double*
; STRIDED-NEXT:    call void @llvm.vp.strided.store.nxv1f64.p0f64.i64(<vscale x 1 x double> [[VP_OP177]], double* [[TMP176]], i64 [[TMP52]], <vscale x 1 x i1> shufflevector (<vscale x 1 x i1> insertelement (<vscale x 1 x i1> undef, i1 true, i32 0), <vscale x 1 x i1> undef, <vscale x 1 x i32> zeroinitializer), i32 [[TMP95]]), [[TBAA4]], !llvm.access.group !8
; STRIDED-NEXT:    [[TMP177:%.*]] = mul i64 [[INDEX]], [[TMP54]]
; STRIDED-NEXT:    [[TMP178:%.*]] = getelementptr i8, i8* [[TMP88]], i64 [[TMP177]]
; STRIDED-NEXT:    [[TMP179:%.*]] = bitcast i8* [[TMP178]] to double*
; STRIDED-NEXT:    call void @llvm.vp.strided.store.nxv1f64.p0f64.i64(<vscale x 1 x double> [[VP_OP180]], double* [[TMP179]], i64 [[TMP54]], <vscale x 1 x i1> shufflevector (<vscale x 1 x i1> insertelement (<vscale x 1 x i1> undef, i1 true, i32 0), <vscale x 1 x i1> undef, <vscale x 1 x i32> zeroinitializer), i32 [[TMP95]]), [[TBAA4]], !llvm.access.group !8
; STRIDED-NEXT:    [[TMP180:%.*]] = mul i64 [[INDEX]], [[TMP55]]
; STRIDED-NEXT:    [[TMP181:%.*]] = getelementptr i8, i8* [[TMP89]], i64 [[TMP180]]
; STRIDED-NEXT:    [[TMP182:%.*]] = bitcast i8* [[TMP181]] to double*
; STRIDED-NEXT:    call void @llvm.vp.strided.store.nxv1f64.p0f64.i64(<vscale x 1 x double> [[VP_OP177]], double* [[TMP182]], i64 [[TMP55]], <vscale x 1 x i1> shufflevector (<vscale x 1 x i1> insertelement (<vscale x 1 x i1> undef, i1 true, i32 0), <vscale x 1 x i1> undef, <vscale x 1 x i32> zeroinitializer), i32 [[TMP95]]), [[TBAA4]], !llvm.access.group !8
; STRIDED-NEXT:    [[TMP183:%.*]] = mul i64 [[INDEX]], [[TMP57]]
; STRIDED-NEXT:    [[TMP184:%.*]] = getelementptr i8, i8* [[TMP90]], i64 [[TMP183]]
; STRIDED-NEXT:    [[TMP185:%.*]] = bitcast i8* [[TMP184]] to double*
; STRIDED-NEXT:    call void @llvm.vp.strided.store.nxv1f64.p0f64.i64(<vscale x 1 x double> [[VP_OP180]], double* [[TMP185]], i64 [[TMP57]], <vscale x 1 x i1> shufflevector (<vscale x 1 x i1> insertelement (<vscale x 1 x i1> undef, i1 true, i32 0), <vscale x 1 x i1> undef, <vscale x 1 x i32> zeroinitializer), i32 [[TMP95]]), [[TBAA4]], !llvm.access.group !8
; STRIDED-NEXT:    [[TMP186:%.*]] = mul i64 [[INDEX]], [[TMP58]]
; STRIDED-NEXT:    [[TMP187:%.*]] = getelementptr i8, i8* [[TMP91]], i64 [[TMP186]]
; STRIDED-NEXT:    [[TMP188:%.*]] = bitcast i8* [[TMP187]] to double*
; STRIDED-NEXT:    call void @llvm.vp.strided.store.nxv1f64.p0f64.i64(<vscale x 1 x double> [[VP_OP177]], double* [[TMP188]], i64 [[TMP58]], <vscale x 1 x i1> shufflevector (<vscale x 1 x i1> insertelement (<vscale x 1 x i1> undef, i1 true, i32 0), <vscale x 1 x i1> undef, <vscale x 1 x i32> zeroinitializer), i32 [[TMP95]]), [[TBAA4]], !llvm.access.group !8
; STRIDED-NEXT:    [[TMP189:%.*]] = mul i64 [[INDEX]], [[TMP60]]
; STRIDED-NEXT:    [[TMP190:%.*]] = getelementptr i8, i8* [[TMP92]], i64 [[TMP189]]
; STRIDED-NEXT:    [[TMP191:%.*]] = bitcast i8* [[TMP190]] to double*
; STRIDED-NEXT:    call void @llvm.vp.strided.store.nxv1f64.p0f64.i64(<vscale x 1 x double> [[VP_OP180]], double* [[TMP191]], i64 [[TMP60]], <vscale x 1 x i1> shufflevector (<vscale x 1 x i1> insertelement (<vscale x 1 x i1> undef, i1 true, i32 0), <vscale x 1 x i1> undef, <vscale x 1 x i32> zeroinitializer), i32 [[TMP95]]), [[TBAA4]], !llvm.access.group !8
; STRIDED-NEXT:    [[TMP192:%.*]] = and i64 [[TMP94]], 4294967295
; STRIDED-NEXT:    [[INDEX_NEXT]] = add i64 [[INDEX]], [[TMP192]]
; STRIDED-NEXT:    [[TMP193:%.*]] = icmp eq i64 [[INDEX_NEXT]], [[WIDE_TRIP_COUNT]]
; STRIDED-NEXT:    br i1 [[TMP193]], label [[FOR_COND_CLEANUP]], label [[VECTOR_BODY]], [[LOOP9:!llvm.loop !.*]]
; STRIDED:       for.cond.cleanup:
; STRIDED-NEXT:    [[TMP194:%.*]] = load double, double* [[VB]], align 8, [[TBAA4]]
; STRIDED-NEXT:    ret double [[TMP194]]
;
entry:
  %cmp402 = icmp sgt i32 %batches, 0
  br i1 %cmp402, label %for.body.lr.ph, label %for.cond.cleanup

for.body.lr.ph:                                   ; preds = %entry
  %shl = shl i32 %groups, 1
  %mul19 = shl i32 %groups, 2
  %mul33 = mul i32 %groups, 6
  %mul47 = shl i32 %groups, 3
  %mul61 = mul i32 %groups, 10
  %mul75 = mul i32 %groups, 12
  %mul89 = mul i32 %groups, 14
  %shr = ashr i32 %N, 2
  %mul150 = shl nsw i32 %shr, 1
  %mul164 = mul nsw i32 %shr, 3
  %mul178 = and i32 %N, -4
  %mul192 = mul nsw i32 %shr, 5
  %mul206 = mul nsw i32 %shr, 6
  %mul220 = mul nsw i32 %shr, 7
  %0 = sext i32 %bstride to i64
  %1 = sext i32 %shl to i64
  %2 = sext i32 %mul19 to i64
  %3 = sext i32 %mul33 to i64
  %4 = sext i32 %mul47 to i64
  %5 = sext i32 %mul61 to i64
  %6 = sext i32 %mul75 to i64
  %7 = sext i32 %mul89 to i64
  %8 = sext i32 %shr to i64
  %9 = sext i32 %mul150 to i64
  %10 = sext i32 %mul164 to i64
  %11 = sext i32 %mul178 to i64
  %12 = sext i32 %mul192 to i64
  %13 = sext i32 %mul206 to i64
  %14 = sext i32 %mul220 to i64
  %wide.trip.count = zext i32 %batches to i64
  br label %for.body

for.cond.cleanup.loopexit:                        ; preds = %for.body
  br label %for.cond.cleanup

for.cond.cleanup:                                 ; preds = %for.cond.cleanup.loopexit, %entry
  %15 = load double, double* %vb, align 8, !tbaa !4
  ret double %15

for.body:                                         ; preds = %for.body.lr.ph, %for.body
  %indvars.iv = phi i64 [ 0, %for.body.lr.ph ], [ %indvars.iv.next, %for.body ]
  %16 = mul nsw i64 %indvars.iv, %0
  %arrayidx = getelementptr inbounds double, double* %va, i64 %16
  %17 = load double, double* %arrayidx, align 8, !tbaa !4, !llvm.access.group !8
  %18 = add nsw i64 %16, 1
  %arrayidx4 = getelementptr inbounds double, double* %va, i64 %18
  %19 = load double, double* %arrayidx4, align 8, !tbaa !4, !llvm.access.group !8
  %20 = add nsw i64 %16, %1
  %arrayidx9 = getelementptr inbounds double, double* %va, i64 %20
  %21 = load double, double* %arrayidx9, align 8, !tbaa !4, !llvm.access.group !8
  %22 = add nsw i64 %18, %1
  %arrayidx15 = getelementptr inbounds double, double* %va, i64 %22
  %23 = load double, double* %arrayidx15, align 8, !tbaa !4, !llvm.access.group !8
  %24 = add nsw i64 %16, %2
  %arrayidx22 = getelementptr inbounds double, double* %va, i64 %24
  %25 = load double, double* %arrayidx22, align 8, !tbaa !4, !llvm.access.group !8
  %26 = add nsw i64 %18, %2
  %arrayidx29 = getelementptr inbounds double, double* %va, i64 %26
  %27 = load double, double* %arrayidx29, align 8, !tbaa !4, !llvm.access.group !8
  %28 = add nsw i64 %16, %3
  %arrayidx36 = getelementptr inbounds double, double* %va, i64 %28
  %29 = load double, double* %arrayidx36, align 8, !tbaa !4, !llvm.access.group !8
  %30 = add nsw i64 %18, %3
  %arrayidx43 = getelementptr inbounds double, double* %va, i64 %30
  %31 = load double, double* %arrayidx43, align 8, !tbaa !4, !llvm.access.group !8
  %32 = add nsw i64 %16, %4
  %arrayidx50 = getelementptr inbounds double, double* %va, i64 %32
  %33 = load double, double* %arrayidx50, align 8, !tbaa !4, !llvm.access.group !8
  %34 = add nsw i64 %18, %4
  %arrayidx57 = getelementptr inbounds double, double* %va, i64 %34
  %35 = load double, double* %arrayidx57, align 8, !tbaa !4, !llvm.access.group !8
  %36 = add nsw i64 %16, %5
  %arrayidx64 = getelementptr inbounds double, double* %va, i64 %36
  %37 = load double, double* %arrayidx64, align 8, !tbaa !4, !llvm.access.group !8
  %38 = add nsw i64 %18, %5
  %arrayidx71 = getelementptr inbounds double, double* %va, i64 %38
  %39 = load double, double* %arrayidx71, align 8, !tbaa !4, !llvm.access.group !8
  %40 = add nsw i64 %16, %6
  %arrayidx78 = getelementptr inbounds double, double* %va, i64 %40
  %41 = load double, double* %arrayidx78, align 8, !tbaa !4, !llvm.access.group !8
  %42 = add nsw i64 %18, %6
  %arrayidx85 = getelementptr inbounds double, double* %va, i64 %42
  %43 = load double, double* %arrayidx85, align 8, !tbaa !4, !llvm.access.group !8
  %44 = add nsw i64 %16, %7
  %arrayidx92 = getelementptr inbounds double, double* %va, i64 %44
  %45 = load double, double* %arrayidx92, align 8, !tbaa !4, !llvm.access.group !8
  %46 = add nsw i64 %18, %7
  %arrayidx99 = getelementptr inbounds double, double* %va, i64 %46
  %47 = load double, double* %arrayidx99, align 8, !tbaa !4, !llvm.access.group !8
  %add100 = fadd double %17, %21
  %add101 = fadd double %add100, %25
  %add102 = fadd double %add101, %29
  %add103 = fadd double %add102, %33
  %add104 = fadd double %add103, %37
  %add105 = fadd double %add104, %41
  %add106 = fadd double %add105, %45
  %add107 = fadd double %19, %23
  %add108 = fadd double %add107, %27
  %add109 = fadd double %add108, %31
  %add110 = fadd double %add109, %35
  %add111 = fadd double %add110, %39
  %add112 = fadd double %add111, %43
  %add113 = fadd double %add112, %47
  %mul114 = fmul double %add106, 2.000000e+00
  %mul115 = fmul double %add113, 2.000000e+00
  %arrayidx131 = getelementptr inbounds double, double* %vb, i64 %16
  store double %add106, double* %arrayidx131, align 8, !tbaa !4, !llvm.access.group !8
  %arrayidx135 = getelementptr inbounds double, double* %vb, i64 %18
  store double %add113, double* %arrayidx135, align 8, !tbaa !4, !llvm.access.group !8
  %48 = add nsw i64 %16, %8
  %arrayidx140 = getelementptr inbounds double, double* %vb, i64 %48
  store double %mul114, double* %arrayidx140, align 8, !tbaa !4, !llvm.access.group !8
  %49 = add nsw i64 %18, %8
  %arrayidx146 = getelementptr inbounds double, double* %vb, i64 %49
  store double %mul115, double* %arrayidx146, align 8, !tbaa !4, !llvm.access.group !8
  %50 = add nsw i64 %16, %9
  %arrayidx153 = getelementptr inbounds double, double* %vb, i64 %50
  store double %mul114, double* %arrayidx153, align 8, !tbaa !4, !llvm.access.group !8
  %51 = add nsw i64 %18, %9
  %arrayidx160 = getelementptr inbounds double, double* %vb, i64 %51
  store double %mul115, double* %arrayidx160, align 8, !tbaa !4, !llvm.access.group !8
  %52 = add nsw i64 %16, %10
  %arrayidx167 = getelementptr inbounds double, double* %vb, i64 %52
  store double %mul114, double* %arrayidx167, align 8, !tbaa !4, !llvm.access.group !8
  %53 = add nsw i64 %18, %10
  %arrayidx174 = getelementptr inbounds double, double* %vb, i64 %53
  store double %mul115, double* %arrayidx174, align 8, !tbaa !4, !llvm.access.group !8
  %54 = add nsw i64 %16, %11
  %arrayidx181 = getelementptr inbounds double, double* %vb, i64 %54
  store double %mul114, double* %arrayidx181, align 8, !tbaa !4, !llvm.access.group !8
  %55 = add nsw i64 %18, %11
  %arrayidx188 = getelementptr inbounds double, double* %vb, i64 %55
  store double %mul115, double* %arrayidx188, align 8, !tbaa !4, !llvm.access.group !8
  %56 = add nsw i64 %16, %12
  %arrayidx195 = getelementptr inbounds double, double* %vb, i64 %56
  store double %mul114, double* %arrayidx195, align 8, !tbaa !4, !llvm.access.group !8
  %57 = add nsw i64 %18, %12
  %arrayidx202 = getelementptr inbounds double, double* %vb, i64 %57
  store double %mul115, double* %arrayidx202, align 8, !tbaa !4, !llvm.access.group !8
  %58 = add nsw i64 %16, %13
  %arrayidx209 = getelementptr inbounds double, double* %vb, i64 %58
  store double %mul114, double* %arrayidx209, align 8, !tbaa !4, !llvm.access.group !8
  %59 = add nsw i64 %18, %13
  %arrayidx216 = getelementptr inbounds double, double* %vb, i64 %59
  store double %mul115, double* %arrayidx216, align 8, !tbaa !4, !llvm.access.group !8
  %60 = add nsw i64 %16, %14
  %arrayidx223 = getelementptr inbounds double, double* %vb, i64 %60
  store double %mul114, double* %arrayidx223, align 8, !tbaa !4, !llvm.access.group !8
  %61 = add nsw i64 %18, %14
  %arrayidx230 = getelementptr inbounds double, double* %vb, i64 %61
  store double %mul115, double* %arrayidx230, align 8, !tbaa !4, !llvm.access.group !8
  %indvars.iv.next = add nuw nsw i64 %indvars.iv, 1
  %exitcond.not = icmp eq i64 %indvars.iv.next, %wide.trip.count
  br i1 %exitcond.not, label %for.cond.cleanup.loopexit, label %for.body, !llvm.loop !9
}

attributes #0 = { nofree norecurse nounwind "disable-tail-calls"="false" "frame-pointer"="none" "less-precise-fpmad"="false" "min-legal-vector-width"="0" "no-infs-fp-math"="false" "no-jump-tables"="false" "no-nans-fp-math"="false" "no-signed-zeros-fp-math"="false" "no-trapping-math"="true" "stack-protector-buffer-size"="8" "target-features"="+a,+c,+d,+experimental-v,+experimental-zvlsseg,+f,+m,-relax,-save-restore" "unsafe-fp-math"="false" "use-soft-float"="false" }

!llvm.module.flags = !{!0, !1, !2}
!llvm.ident = !{!3}

!0 = !{i32 1, !"wchar_size", i32 4}
!1 = !{i32 1, !"target-abi", !"lp64d"}
!2 = !{i32 1, !"SmallDataLimit", i32 8}
!3 = !{!"clang version 12.0.0"}
!4 = !{!5, !5, i64 0}
!5 = !{!"double", !6, i64 0}
!6 = !{!"omnipotent char", !7, i64 0}
!7 = !{!"Simple C/C++ TBAA"}
!8 = distinct !{}
!9 = distinct !{!9, !10, !11, !12}
!10 = !{!"llvm.loop.mustprogress"}
!11 = !{!"llvm.loop.parallel_accesses", !8}
!12 = !{!"llvm.loop.vectorize.enable", i1 true}
