; NOTE: Assertions have been autogenerated by utils/update_llc_test_checks.py
; RUN: llc -mtriple=riscv64 -mattr=+m,+f,+d,+a,+c,+experimental-v \
; RUN:    -verify-machineinstrs --riscv-no-aliases < %s | \
; RUN:    FileCheck -check-prefix=VSETVLI_IRRELEVANT %s


; This is a general test set that documents the limitations of the current
; implementation through tests that are meant to be broken in the future
; when the limitations are overcome





; vsetvli_irrelevant: In the following test, llc is expected to produce only
; one vsetvli instruction, which is an error because the vfadd instruction needs
; a second vsetvli with "b16,m1". This is due to a faulty irrelevant alternative
; management.
declare <vscale x 4 x i16> @llvm.epi.vadd.vv.nxv4i16.nxv4i16.nxv4i16(<vscale x 4 x i16>, <vscale x 4 x i16>, i64)
declare <vscale x 4 x bfloat> @llvm.epi.vfadd.vv.nxv4bf16.nxv4bf16.nxv4bf16(<vscale x 4 x bfloat>, <vscale x 4 x bfloat>, i64)

declare void @llvm.epi.vstore.nxv4i16 (<vscale x 4 x i16>, <vscale x 4 x i16>*, i64)
declare void @llvm.epi.vstore.nxv4bf16 (<vscale x 4 x bfloat>, <vscale x 4 x bfloat>*, i64)

define void @vsetvli_anticipation(
; VSETVLI_IRRELEVANT-LABEL: vsetvli_anticipation:
; VSETVLI_IRRELEVANT:       # %bb.0:
; VSETVLI_IRRELEVANT-NEXT:    vsetvli zero, a2, e16,m1
; VSETVLI_IRRELEVANT-NEXT:    vadd.vv v1, v16, v17
; VSETVLI_IRRELEVANT-NEXT:    vsetvli zero, a2, b16,m1
; VSETVLI_IRRELEVANT-NEXT:    vfadd.vv v2, v18, v19
; VSETVLI_IRRELEVANT-NEXT:    vse.v v1, (a0)
; VSETVLI_IRRELEVANT-NEXT:    vse.v v2, (a1)
; VSETVLI_IRRELEVANT-NEXT:    c.jr ra
  <vscale x 4 x i16> %a1,
  <vscale x 4 x i16> %a2,
  <vscale x 4 x bfloat> %b1,
  <vscale x 4 x bfloat> %b2,
  <vscale x 4 x i16>* %pa,
  <vscale x 4 x bfloat>* %pb,
  i64 %gvl) nounwind {

  %va = call <vscale x 4 x i16> @llvm.epi.vadd.vv.nxv4i16.nxv4i16.nxv4i16(<vscale x 4 x i16> %a1, <vscale x 4 x i16> %a2, i64 %gvl)
  %vb = call <vscale x 4 x bfloat> @llvm.epi.vfadd.vv.nxv4bf16.nxv4bf16.nxv4bf16(<vscale x 4 x bfloat> %b1, <vscale x 4 x bfloat> %b2, i64 %gvl)

  call void @llvm.epi.vstore.nxv4i16 (<vscale x 4 x i16> %va, <vscale x 4 x i16>* %pa, i64 %gvl)
  call void @llvm.epi.vstore.nxv4bf16 (<vscale x 4 x bfloat> %vb, <vscale x 4 x bfloat>* %pb, i64 %gvl)

  ret void
}
