; NOTE: Assertions have been autogenerated by utils/update_llc_test_checks.py
; RUN: llc -mtriple=riscv64 -mattr=+f,+d,+experimental-v -verify-machineinstrs \
; RUN:     < %s | FileCheck %s

define <vscale x 2 x i1> @test_false_vv_nxv2f32(<vscale x 2 x float> %va, <vscale x 2 x float> %vb) {
; CHECK-LABEL: test_false_vv_nxv2f32:
; CHECK:       # %bb.0:
; CHECK-NEXT:    vsetvli zero, zero, e32,m1
; CHECK-NEXT:    vmclr.m v0
; CHECK-NEXT:    ret
  %vc = fcmp false <vscale x 2 x float> %va, %vb
  ret <vscale x 2 x i1> %vc
}

define <vscale x 2 x i1> @test_false_vf_nxv2f32(<vscale x 2 x float> %va, float %b) {
; CHECK-LABEL: test_false_vf_nxv2f32:
; CHECK:       # %bb.0:
; CHECK-NEXT:    vsetvli zero, zero, e32,m1
; CHECK-NEXT:    vmclr.m v0
; CHECK-NEXT:    ret
  %head = insertelement <vscale x 2 x float> undef, float %b, i32 0
  %splat = shufflevector <vscale x 2 x float> %head, <vscale x 2 x float> undef, <vscale x 2 x i32> zeroinitializer
  %vc = fcmp false <vscale x 2 x float> %va, %splat
  ret <vscale x 2 x i1> %vc
}

define <vscale x 2 x i1> @test_false_fv_nxv2f32(<vscale x 2 x float> %va, float %b) {
; CHECK-LABEL: test_false_fv_nxv2f32:
; CHECK:       # %bb.0:
; CHECK-NEXT:    vsetvli zero, zero, e32,m1
; CHECK-NEXT:    vmclr.m v0
; CHECK-NEXT:    ret
  %head = insertelement <vscale x 2 x float> undef, float %b, i32 0
  %splat = shufflevector <vscale x 2 x float> %head, <vscale x 2 x float> undef, <vscale x 2 x i32> zeroinitializer
  %vc = fcmp false <vscale x 2 x float> %splat, %va
  ret <vscale x 2 x i1> %vc
}

define <vscale x 2 x i1> @test_oeq_vv_nxv2f32(<vscale x 2 x float> %va, <vscale x 2 x float> %vb) {
; CHECK-LABEL: test_oeq_vv_nxv2f32:
; CHECK:       # %bb.0:
; CHECK-NEXT:    vsetvli zero, zero, e32,m1
; CHECK-NEXT:    vmfeq.vv v0, v16, v17
; CHECK-NEXT:    ret
  %vc = fcmp oeq <vscale x 2 x float> %va, %vb
  ret <vscale x 2 x i1> %vc
}

define <vscale x 2 x i1> @test_oeq_vf_nxv2f32(<vscale x 2 x float> %va, float %b) {
; CHECK-LABEL: test_oeq_vf_nxv2f32:
; CHECK:       # %bb.0:
; CHECK-NEXT:    fmv.w.x ft0, a0
; CHECK-NEXT:    vsetvli zero, zero, e32,m1
; CHECK-NEXT:    vmfeq.vf v0, v16, ft0
; CHECK-NEXT:    ret
  %head = insertelement <vscale x 2 x float> undef, float %b, i32 0
  %splat = shufflevector <vscale x 2 x float> %head, <vscale x 2 x float> undef, <vscale x 2 x i32> zeroinitializer
  %vc = fcmp oeq <vscale x 2 x float> %va, %splat
  ret <vscale x 2 x i1> %vc
}

define <vscale x 2 x i1> @test_oeq_fv_nxv2f32(<vscale x 2 x float> %va, float %b) {
; CHECK-LABEL: test_oeq_fv_nxv2f32:
; CHECK:       # %bb.0:
; CHECK-NEXT:    fmv.w.x ft0, a0
; CHECK-NEXT:    vsetvli zero, zero, e32,m1
; CHECK-NEXT:    vfmv.v.f v1, ft0
; CHECK-NEXT:    vmfeq.vv v0, v1, v16
; CHECK-NEXT:    ret
  %head = insertelement <vscale x 2 x float> undef, float %b, i32 0
  %splat = shufflevector <vscale x 2 x float> %head, <vscale x 2 x float> undef, <vscale x 2 x i32> zeroinitializer
  %vc = fcmp oeq <vscale x 2 x float> %splat, %va
  ret <vscale x 2 x i1> %vc
}

define <vscale x 2 x i1> @test_ogt_vv_nxv2f32(<vscale x 2 x float> %va, <vscale x 2 x float> %vb) {
; CHECK-LABEL: test_ogt_vv_nxv2f32:
; CHECK:       # %bb.0:
; CHECK-NEXT:    vsetvli zero, zero, e32,m1
; CHECK-NEXT:    vmflt.vv v0, v17, v16
; CHECK-NEXT:    ret
  %vc = fcmp ogt <vscale x 2 x float> %va, %vb
  ret <vscale x 2 x i1> %vc
}

define <vscale x 2 x i1> @test_ogt_vf_nxv2f32(<vscale x 2 x float> %va, float %b) {
; CHECK-LABEL: test_ogt_vf_nxv2f32:
; CHECK:       # %bb.0:
; CHECK-NEXT:    fmv.w.x ft0, a0
; CHECK-NEXT:    vsetvli zero, zero, e32,m1
; CHECK-NEXT:    vmfgt.vf v0, v16, ft0
; CHECK-NEXT:    ret
  %head = insertelement <vscale x 2 x float> undef, float %b, i32 0
  %splat = shufflevector <vscale x 2 x float> %head, <vscale x 2 x float> undef, <vscale x 2 x i32> zeroinitializer
  %vc = fcmp ogt <vscale x 2 x float> %va, %splat
  ret <vscale x 2 x i1> %vc
}

define <vscale x 2 x i1> @test_ogt_fv_nxv2f32(<vscale x 2 x float> %va, float %b) {
; CHECK-LABEL: test_ogt_fv_nxv2f32:
; CHECK:       # %bb.0:
; CHECK-NEXT:    fmv.w.x ft0, a0
; CHECK-NEXT:    vsetvli zero, zero, e32,m1
; CHECK-NEXT:    vfmv.v.f v1, ft0
; CHECK-NEXT:    vmflt.vv v0, v16, v1
; CHECK-NEXT:    ret
  %head = insertelement <vscale x 2 x float> undef, float %b, i32 0
  %splat = shufflevector <vscale x 2 x float> %head, <vscale x 2 x float> undef, <vscale x 2 x i32> zeroinitializer
  %vc = fcmp ogt <vscale x 2 x float> %splat, %va
  ret <vscale x 2 x i1> %vc
}

define <vscale x 2 x i1> @test_oge_vv_nxv2f32(<vscale x 2 x float> %va, <vscale x 2 x float> %vb) {
; CHECK-LABEL: test_oge_vv_nxv2f32:
; CHECK:       # %bb.0:
; CHECK-NEXT:    vsetvli zero, zero, e32,m1
; CHECK-NEXT:    vmfle.vv v0, v17, v16
; CHECK-NEXT:    ret
  %vc = fcmp oge <vscale x 2 x float> %va, %vb
  ret <vscale x 2 x i1> %vc
}

define <vscale x 2 x i1> @test_oge_vf_nxv2f32(<vscale x 2 x float> %va, float %b) {
; CHECK-LABEL: test_oge_vf_nxv2f32:
; CHECK:       # %bb.0:
; CHECK-NEXT:    fmv.w.x ft0, a0
; CHECK-NEXT:    vsetvli zero, zero, e32,m1
; CHECK-NEXT:    vmfge.vf v0, v16, ft0
; CHECK-NEXT:    ret
  %head = insertelement <vscale x 2 x float> undef, float %b, i32 0
  %splat = shufflevector <vscale x 2 x float> %head, <vscale x 2 x float> undef, <vscale x 2 x i32> zeroinitializer
  %vc = fcmp oge <vscale x 2 x float> %va, %splat
  ret <vscale x 2 x i1> %vc
}

define <vscale x 2 x i1> @test_oge_fv_nxv2f32(<vscale x 2 x float> %va, float %b) {
; CHECK-LABEL: test_oge_fv_nxv2f32:
; CHECK:       # %bb.0:
; CHECK-NEXT:    fmv.w.x ft0, a0
; CHECK-NEXT:    vsetvli zero, zero, e32,m1
; CHECK-NEXT:    vfmv.v.f v1, ft0
; CHECK-NEXT:    vmfle.vv v0, v16, v1
; CHECK-NEXT:    ret
  %head = insertelement <vscale x 2 x float> undef, float %b, i32 0
  %splat = shufflevector <vscale x 2 x float> %head, <vscale x 2 x float> undef, <vscale x 2 x i32> zeroinitializer
  %vc = fcmp oge <vscale x 2 x float> %splat, %va
  ret <vscale x 2 x i1> %vc
}

define <vscale x 2 x i1> @test_olt_vv_nxv2f32(<vscale x 2 x float> %va, <vscale x 2 x float> %vb) {
; CHECK-LABEL: test_olt_vv_nxv2f32:
; CHECK:       # %bb.0:
; CHECK-NEXT:    vsetvli zero, zero, e32,m1
; CHECK-NEXT:    vmflt.vv v0, v16, v17
; CHECK-NEXT:    ret
  %vc = fcmp olt <vscale x 2 x float> %va, %vb
  ret <vscale x 2 x i1> %vc
}

define <vscale x 2 x i1> @test_olt_vf_nxv2f32(<vscale x 2 x float> %va, float %b) {
; CHECK-LABEL: test_olt_vf_nxv2f32:
; CHECK:       # %bb.0:
; CHECK-NEXT:    fmv.w.x ft0, a0
; CHECK-NEXT:    vsetvli zero, zero, e32,m1
; CHECK-NEXT:    vmflt.vf v0, v16, ft0
; CHECK-NEXT:    ret
  %head = insertelement <vscale x 2 x float> undef, float %b, i32 0
  %splat = shufflevector <vscale x 2 x float> %head, <vscale x 2 x float> undef, <vscale x 2 x i32> zeroinitializer
  %vc = fcmp olt <vscale x 2 x float> %va, %splat
  ret <vscale x 2 x i1> %vc
}

define <vscale x 2 x i1> @test_olt_fv_nxv2f32(<vscale x 2 x float> %va, float %b) {
; CHECK-LABEL: test_olt_fv_nxv2f32:
; CHECK:       # %bb.0:
; CHECK-NEXT:    fmv.w.x ft0, a0
; CHECK-NEXT:    vsetvli zero, zero, e32,m1
; CHECK-NEXT:    vfmv.v.f v1, ft0
; CHECK-NEXT:    vmflt.vv v0, v1, v16
; CHECK-NEXT:    ret
  %head = insertelement <vscale x 2 x float> undef, float %b, i32 0
  %splat = shufflevector <vscale x 2 x float> %head, <vscale x 2 x float> undef, <vscale x 2 x i32> zeroinitializer
  %vc = fcmp olt <vscale x 2 x float> %splat, %va
  ret <vscale x 2 x i1> %vc
}

define <vscale x 2 x i1> @test_ole_vv_nxv2f32(<vscale x 2 x float> %va, <vscale x 2 x float> %vb) {
; CHECK-LABEL: test_ole_vv_nxv2f32:
; CHECK:       # %bb.0:
; CHECK-NEXT:    vsetvli zero, zero, e32,m1
; CHECK-NEXT:    vmfle.vv v0, v16, v17
; CHECK-NEXT:    ret
  %vc = fcmp ole <vscale x 2 x float> %va, %vb
  ret <vscale x 2 x i1> %vc
}

define <vscale x 2 x i1> @test_ole_vf_nxv2f32(<vscale x 2 x float> %va, float %b) {
; CHECK-LABEL: test_ole_vf_nxv2f32:
; CHECK:       # %bb.0:
; CHECK-NEXT:    fmv.w.x ft0, a0
; CHECK-NEXT:    vsetvli zero, zero, e32,m1
; CHECK-NEXT:    vmfle.vf v0, v16, ft0
; CHECK-NEXT:    ret
  %head = insertelement <vscale x 2 x float> undef, float %b, i32 0
  %splat = shufflevector <vscale x 2 x float> %head, <vscale x 2 x float> undef, <vscale x 2 x i32> zeroinitializer
  %vc = fcmp ole <vscale x 2 x float> %va, %splat
  ret <vscale x 2 x i1> %vc
}

define <vscale x 2 x i1> @test_ole_fv_nxv2f32(<vscale x 2 x float> %va, float %b) {
; CHECK-LABEL: test_ole_fv_nxv2f32:
; CHECK:       # %bb.0:
; CHECK-NEXT:    fmv.w.x ft0, a0
; CHECK-NEXT:    vsetvli zero, zero, e32,m1
; CHECK-NEXT:    vfmv.v.f v1, ft0
; CHECK-NEXT:    vmfle.vv v0, v1, v16
; CHECK-NEXT:    ret
  %head = insertelement <vscale x 2 x float> undef, float %b, i32 0
  %splat = shufflevector <vscale x 2 x float> %head, <vscale x 2 x float> undef, <vscale x 2 x i32> zeroinitializer
  %vc = fcmp ole <vscale x 2 x float> %splat, %va
  ret <vscale x 2 x i1> %vc
}

define <vscale x 2 x i1> @test_one_vv_nxv2f32(<vscale x 2 x float> %va, <vscale x 2 x float> %vb) {
; CHECK-LABEL: test_one_vv_nxv2f32:
; CHECK:       # %bb.0:
; CHECK-NEXT:    vsetvli zero, zero, e32,m1
; CHECK-NEXT:    vmford.vv v0, v16, v17
; CHECK-NEXT:    vmfne.vv v0, v16, v17, v0.t
; CHECK-NEXT:    ret
  %vc = fcmp one <vscale x 2 x float> %va, %vb
  ret <vscale x 2 x i1> %vc
}

define <vscale x 2 x i1> @test_one_vf_nxv2f32(<vscale x 2 x float> %va, float %b) {
; CHECK-LABEL: test_one_vf_nxv2f32:
; CHECK:       # %bb.0:
; CHECK-NEXT:    fmv.w.x ft0, a0
; CHECK-NEXT:    vsetvli zero, zero, e32,m1
; CHECK-NEXT:    vfmv.v.f v1, ft0
; CHECK-NEXT:    vmford.vv v0, v16, v1
; CHECK-NEXT:    vmfne.vv v0, v16, v1, v0.t
; CHECK-NEXT:    ret
  %head = insertelement <vscale x 2 x float> undef, float %b, i32 0
  %splat = shufflevector <vscale x 2 x float> %head, <vscale x 2 x float> undef, <vscale x 2 x i32> zeroinitializer
  %vc = fcmp one <vscale x 2 x float> %va, %splat
  ret <vscale x 2 x i1> %vc
}

define <vscale x 2 x i1> @test_one_fv_nxv2f32(<vscale x 2 x float> %va, float %b) {
; CHECK-LABEL: test_one_fv_nxv2f32:
; CHECK:       # %bb.0:
; CHECK-NEXT:    fmv.w.x ft0, a0
; CHECK-NEXT:    vsetvli zero, zero, e32,m1
; CHECK-NEXT:    vfmv.v.f v1, ft0
; CHECK-NEXT:    vmford.vv v0, v1, v16
; CHECK-NEXT:    vmfne.vv v0, v1, v16, v0.t
; CHECK-NEXT:    ret
  %head = insertelement <vscale x 2 x float> undef, float %b, i32 0
  %splat = shufflevector <vscale x 2 x float> %head, <vscale x 2 x float> undef, <vscale x 2 x i32> zeroinitializer
  %vc = fcmp one <vscale x 2 x float> %splat, %va
  ret <vscale x 2 x i1> %vc
}

define <vscale x 2 x i1> @test_ord_vv_nxv2f32(<vscale x 2 x float> %va, <vscale x 2 x float> %vb) {
; CHECK-LABEL: test_ord_vv_nxv2f32:
; CHECK:       # %bb.0:
; CHECK-NEXT:    vsetvli zero, zero, e32,m1
; CHECK-NEXT:    vmford.vv v0, v16, v17
; CHECK-NEXT:    ret
  %vc = fcmp ord <vscale x 2 x float> %va, %vb
  ret <vscale x 2 x i1> %vc
}

define <vscale x 2 x i1> @test_ord_vf_nxv2f32(<vscale x 2 x float> %va, float %b) {
; CHECK-LABEL: test_ord_vf_nxv2f32:
; CHECK:       # %bb.0:
; CHECK-NEXT:    fmv.w.x ft0, a0
; CHECK-NEXT:    vsetvli zero, zero, e32,m1
; CHECK-NEXT:    vmford.vf v0, v16, ft0
; CHECK-NEXT:    ret
  %head = insertelement <vscale x 2 x float> undef, float %b, i32 0
  %splat = shufflevector <vscale x 2 x float> %head, <vscale x 2 x float> undef, <vscale x 2 x i32> zeroinitializer
  %vc = fcmp ord <vscale x 2 x float> %va, %splat
  ret <vscale x 2 x i1> %vc
}

define <vscale x 2 x i1> @test_ord_fv_nxv2f32(<vscale x 2 x float> %va, float %b) {
; CHECK-LABEL: test_ord_fv_nxv2f32:
; CHECK:       # %bb.0:
; CHECK-NEXT:    fmv.w.x ft0, a0
; CHECK-NEXT:    vsetvli zero, zero, e32,m1
; CHECK-NEXT:    vfmv.v.f v1, ft0
; CHECK-NEXT:    vmford.vv v0, v1, v16
; CHECK-NEXT:    ret
  %head = insertelement <vscale x 2 x float> undef, float %b, i32 0
  %splat = shufflevector <vscale x 2 x float> %head, <vscale x 2 x float> undef, <vscale x 2 x i32> zeroinitializer
  %vc = fcmp ord <vscale x 2 x float> %splat, %va
  ret <vscale x 2 x i1> %vc
}

define <vscale x 2 x i1> @test_ueq_vv_nxv2f32(<vscale x 2 x float> %va, <vscale x 2 x float> %vb) {
; CHECK-LABEL: test_ueq_vv_nxv2f32:
; CHECK:       # %bb.0:
; CHECK-NEXT:    vsetvli zero, zero, e32,m1
; CHECK-NEXT:    vmfeq.vv v1, v16, v17
; CHECK-NEXT:    vmford.vv v2, v16, v17
; CHECK-NEXT:    vmnot.m v2, v2
; CHECK-NEXT:    vmor.mm v0, v2, v1
; CHECK-NEXT:    ret
  %vc = fcmp ueq <vscale x 2 x float> %va, %vb
  ret <vscale x 2 x i1> %vc
}

define <vscale x 2 x i1> @test_ueq_vf_nxv2f32(<vscale x 2 x float> %va, float %b) {
; CHECK-LABEL: test_ueq_vf_nxv2f32:
; CHECK:       # %bb.0:
; CHECK-NEXT:    fmv.w.x ft0, a0
; CHECK-NEXT:    vsetvli zero, zero, e32,m1
; CHECK-NEXT:    vfmv.v.f v1, ft0
; CHECK-NEXT:    vmfeq.vv v2, v16, v1
; CHECK-NEXT:    vmford.vv v1, v16, v1
; CHECK-NEXT:    vmnot.m v1, v1
; CHECK-NEXT:    vmor.mm v0, v1, v2
; CHECK-NEXT:    ret
  %head = insertelement <vscale x 2 x float> undef, float %b, i32 0
  %splat = shufflevector <vscale x 2 x float> %head, <vscale x 2 x float> undef, <vscale x 2 x i32> zeroinitializer
  %vc = fcmp ueq <vscale x 2 x float> %va, %splat
  ret <vscale x 2 x i1> %vc
}

define <vscale x 2 x i1> @test_ueq_fv_nxv2f32(<vscale x 2 x float> %va, float %b) {
; CHECK-LABEL: test_ueq_fv_nxv2f32:
; CHECK:       # %bb.0:
; CHECK-NEXT:    fmv.w.x ft0, a0
; CHECK-NEXT:    vsetvli zero, zero, e32,m1
; CHECK-NEXT:    vfmv.v.f v1, ft0
; CHECK-NEXT:    vmfeq.vv v2, v1, v16
; CHECK-NEXT:    vmford.vv v1, v1, v16
; CHECK-NEXT:    vmnot.m v1, v1
; CHECK-NEXT:    vmor.mm v0, v1, v2
; CHECK-NEXT:    ret
  %head = insertelement <vscale x 2 x float> undef, float %b, i32 0
  %splat = shufflevector <vscale x 2 x float> %head, <vscale x 2 x float> undef, <vscale x 2 x i32> zeroinitializer
  %vc = fcmp ueq <vscale x 2 x float> %splat, %va
  ret <vscale x 2 x i1> %vc
}

define <vscale x 2 x i1> @test_ugt_vv_nxv2f32(<vscale x 2 x float> %va, <vscale x 2 x float> %vb) {
; CHECK-LABEL: test_ugt_vv_nxv2f32:
; CHECK:       # %bb.0:
; CHECK-NEXT:    vsetvli zero, zero, e32,m1
; CHECK-NEXT:    vmflt.vv v1, v17, v16
; CHECK-NEXT:    vmford.vv v2, v16, v17
; CHECK-NEXT:    vmnot.m v2, v2
; CHECK-NEXT:    vmor.mm v0, v2, v1
; CHECK-NEXT:    ret
  %vc = fcmp ugt <vscale x 2 x float> %va, %vb
  ret <vscale x 2 x i1> %vc
}

define <vscale x 2 x i1> @test_ugt_vf_nxv2f32(<vscale x 2 x float> %va, float %b) {
; CHECK-LABEL: test_ugt_vf_nxv2f32:
; CHECK:       # %bb.0:
; CHECK-NEXT:    fmv.w.x ft0, a0
; CHECK-NEXT:    vsetvli zero, zero, e32,m1
; CHECK-NEXT:    vfmv.v.f v1, ft0
; CHECK-NEXT:    vmflt.vv v2, v1, v16
; CHECK-NEXT:    vmford.vv v1, v16, v1
; CHECK-NEXT:    vmnot.m v1, v1
; CHECK-NEXT:    vmor.mm v0, v1, v2
; CHECK-NEXT:    ret
  %head = insertelement <vscale x 2 x float> undef, float %b, i32 0
  %splat = shufflevector <vscale x 2 x float> %head, <vscale x 2 x float> undef, <vscale x 2 x i32> zeroinitializer
  %vc = fcmp ugt <vscale x 2 x float> %va, %splat
  ret <vscale x 2 x i1> %vc
}

define <vscale x 2 x i1> @test_ugt_fv_nxv2f32(<vscale x 2 x float> %va, float %b) {
; CHECK-LABEL: test_ugt_fv_nxv2f32:
; CHECK:       # %bb.0:
; CHECK-NEXT:    fmv.w.x ft0, a0
; CHECK-NEXT:    vsetvli zero, zero, e32,m1
; CHECK-NEXT:    vfmv.v.f v1, ft0
; CHECK-NEXT:    vmflt.vv v2, v16, v1
; CHECK-NEXT:    vmford.vv v1, v1, v16
; CHECK-NEXT:    vmnot.m v1, v1
; CHECK-NEXT:    vmor.mm v0, v1, v2
; CHECK-NEXT:    ret
  %head = insertelement <vscale x 2 x float> undef, float %b, i32 0
  %splat = shufflevector <vscale x 2 x float> %head, <vscale x 2 x float> undef, <vscale x 2 x i32> zeroinitializer
  %vc = fcmp ugt <vscale x 2 x float> %splat, %va
  ret <vscale x 2 x i1> %vc
}

define <vscale x 2 x i1> @test_uge_vv_nxv2f32(<vscale x 2 x float> %va, <vscale x 2 x float> %vb) {
; CHECK-LABEL: test_uge_vv_nxv2f32:
; CHECK:       # %bb.0:
; CHECK-NEXT:    vsetvli zero, zero, e32,m1
; CHECK-NEXT:    vmfle.vv v1, v17, v16
; CHECK-NEXT:    vmford.vv v2, v16, v17
; CHECK-NEXT:    vmnot.m v2, v2
; CHECK-NEXT:    vmor.mm v0, v2, v1
; CHECK-NEXT:    ret
  %vc = fcmp uge <vscale x 2 x float> %va, %vb
  ret <vscale x 2 x i1> %vc
}

define <vscale x 2 x i1> @test_uge_vf_nxv2f32(<vscale x 2 x float> %va, float %b) {
; CHECK-LABEL: test_uge_vf_nxv2f32:
; CHECK:       # %bb.0:
; CHECK-NEXT:    fmv.w.x ft0, a0
; CHECK-NEXT:    vsetvli zero, zero, e32,m1
; CHECK-NEXT:    vfmv.v.f v1, ft0
; CHECK-NEXT:    vmfle.vv v2, v1, v16
; CHECK-NEXT:    vmford.vv v1, v16, v1
; CHECK-NEXT:    vmnot.m v1, v1
; CHECK-NEXT:    vmor.mm v0, v1, v2
; CHECK-NEXT:    ret
  %head = insertelement <vscale x 2 x float> undef, float %b, i32 0
  %splat = shufflevector <vscale x 2 x float> %head, <vscale x 2 x float> undef, <vscale x 2 x i32> zeroinitializer
  %vc = fcmp uge <vscale x 2 x float> %va, %splat
  ret <vscale x 2 x i1> %vc
}

define <vscale x 2 x i1> @test_uge_fv_nxv2f32(<vscale x 2 x float> %va, float %b) {
; CHECK-LABEL: test_uge_fv_nxv2f32:
; CHECK:       # %bb.0:
; CHECK-NEXT:    fmv.w.x ft0, a0
; CHECK-NEXT:    vsetvli zero, zero, e32,m1
; CHECK-NEXT:    vfmv.v.f v1, ft0
; CHECK-NEXT:    vmfle.vv v2, v16, v1
; CHECK-NEXT:    vmford.vv v1, v1, v16
; CHECK-NEXT:    vmnot.m v1, v1
; CHECK-NEXT:    vmor.mm v0, v1, v2
; CHECK-NEXT:    ret
  %head = insertelement <vscale x 2 x float> undef, float %b, i32 0
  %splat = shufflevector <vscale x 2 x float> %head, <vscale x 2 x float> undef, <vscale x 2 x i32> zeroinitializer
  %vc = fcmp uge <vscale x 2 x float> %splat, %va
  ret <vscale x 2 x i1> %vc
}

define <vscale x 2 x i1> @test_ult_vv_nxv2f32(<vscale x 2 x float> %va, <vscale x 2 x float> %vb) {
; CHECK-LABEL: test_ult_vv_nxv2f32:
; CHECK:       # %bb.0:
; CHECK-NEXT:    vsetvli zero, zero, e32,m1
; CHECK-NEXT:    vmflt.vv v1, v16, v17
; CHECK-NEXT:    vmford.vv v2, v16, v17
; CHECK-NEXT:    vmnot.m v2, v2
; CHECK-NEXT:    vmor.mm v0, v2, v1
; CHECK-NEXT:    ret
  %vc = fcmp ult <vscale x 2 x float> %va, %vb
  ret <vscale x 2 x i1> %vc
}

define <vscale x 2 x i1> @test_ult_vf_nxv2f32(<vscale x 2 x float> %va, float %b) {
; CHECK-LABEL: test_ult_vf_nxv2f32:
; CHECK:       # %bb.0:
; CHECK-NEXT:    fmv.w.x ft0, a0
; CHECK-NEXT:    vsetvli zero, zero, e32,m1
; CHECK-NEXT:    vfmv.v.f v1, ft0
; CHECK-NEXT:    vmflt.vv v2, v16, v1
; CHECK-NEXT:    vmford.vv v1, v16, v1
; CHECK-NEXT:    vmnot.m v1, v1
; CHECK-NEXT:    vmor.mm v0, v1, v2
; CHECK-NEXT:    ret
  %head = insertelement <vscale x 2 x float> undef, float %b, i32 0
  %splat = shufflevector <vscale x 2 x float> %head, <vscale x 2 x float> undef, <vscale x 2 x i32> zeroinitializer
  %vc = fcmp ult <vscale x 2 x float> %va, %splat
  ret <vscale x 2 x i1> %vc
}

define <vscale x 2 x i1> @test_ult_fv_nxv2f32(<vscale x 2 x float> %va, float %b) {
; CHECK-LABEL: test_ult_fv_nxv2f32:
; CHECK:       # %bb.0:
; CHECK-NEXT:    fmv.w.x ft0, a0
; CHECK-NEXT:    vsetvli zero, zero, e32,m1
; CHECK-NEXT:    vfmv.v.f v1, ft0
; CHECK-NEXT:    vmflt.vv v2, v1, v16
; CHECK-NEXT:    vmford.vv v1, v1, v16
; CHECK-NEXT:    vmnot.m v1, v1
; CHECK-NEXT:    vmor.mm v0, v1, v2
; CHECK-NEXT:    ret
  %head = insertelement <vscale x 2 x float> undef, float %b, i32 0
  %splat = shufflevector <vscale x 2 x float> %head, <vscale x 2 x float> undef, <vscale x 2 x i32> zeroinitializer
  %vc = fcmp ult <vscale x 2 x float> %splat, %va
  ret <vscale x 2 x i1> %vc
}

define <vscale x 2 x i1> @test_ule_vv_nxv2f32(<vscale x 2 x float> %va, <vscale x 2 x float> %vb) {
; CHECK-LABEL: test_ule_vv_nxv2f32:
; CHECK:       # %bb.0:
; CHECK-NEXT:    vsetvli zero, zero, e32,m1
; CHECK-NEXT:    vmfle.vv v1, v16, v17
; CHECK-NEXT:    vmford.vv v2, v16, v17
; CHECK-NEXT:    vmnot.m v2, v2
; CHECK-NEXT:    vmor.mm v0, v2, v1
; CHECK-NEXT:    ret
  %vc = fcmp ule <vscale x 2 x float> %va, %vb
  ret <vscale x 2 x i1> %vc
}

define <vscale x 2 x i1> @test_ule_vf_nxv2f32(<vscale x 2 x float> %va, float %b) {
; CHECK-LABEL: test_ule_vf_nxv2f32:
; CHECK:       # %bb.0:
; CHECK-NEXT:    fmv.w.x ft0, a0
; CHECK-NEXT:    vsetvli zero, zero, e32,m1
; CHECK-NEXT:    vfmv.v.f v1, ft0
; CHECK-NEXT:    vmfle.vv v2, v16, v1
; CHECK-NEXT:    vmford.vv v1, v16, v1
; CHECK-NEXT:    vmnot.m v1, v1
; CHECK-NEXT:    vmor.mm v0, v1, v2
; CHECK-NEXT:    ret
  %head = insertelement <vscale x 2 x float> undef, float %b, i32 0
  %splat = shufflevector <vscale x 2 x float> %head, <vscale x 2 x float> undef, <vscale x 2 x i32> zeroinitializer
  %vc = fcmp ule <vscale x 2 x float> %va, %splat
  ret <vscale x 2 x i1> %vc
}

define <vscale x 2 x i1> @test_ule_fv_nxv2f32(<vscale x 2 x float> %va, float %b) {
; CHECK-LABEL: test_ule_fv_nxv2f32:
; CHECK:       # %bb.0:
; CHECK-NEXT:    fmv.w.x ft0, a0
; CHECK-NEXT:    vsetvli zero, zero, e32,m1
; CHECK-NEXT:    vfmv.v.f v1, ft0
; CHECK-NEXT:    vmfle.vv v2, v1, v16
; CHECK-NEXT:    vmford.vv v1, v1, v16
; CHECK-NEXT:    vmnot.m v1, v1
; CHECK-NEXT:    vmor.mm v0, v1, v2
; CHECK-NEXT:    ret
  %head = insertelement <vscale x 2 x float> undef, float %b, i32 0
  %splat = shufflevector <vscale x 2 x float> %head, <vscale x 2 x float> undef, <vscale x 2 x i32> zeroinitializer
  %vc = fcmp ule <vscale x 2 x float> %splat, %va
  ret <vscale x 2 x i1> %vc
}

define <vscale x 2 x i1> @test_une_vv_nxv2f32(<vscale x 2 x float> %va, <vscale x 2 x float> %vb) {
; CHECK-LABEL: test_une_vv_nxv2f32:
; CHECK:       # %bb.0:
; CHECK-NEXT:    vsetvli zero, zero, e32,m1
; CHECK-NEXT:    vmfne.vv v0, v16, v17
; CHECK-NEXT:    ret
  %vc = fcmp une <vscale x 2 x float> %va, %vb
  ret <vscale x 2 x i1> %vc
}

define <vscale x 2 x i1> @test_une_vf_nxv2f32(<vscale x 2 x float> %va, float %b) {
; CHECK-LABEL: test_une_vf_nxv2f32:
; CHECK:       # %bb.0:
; CHECK-NEXT:    fmv.w.x ft0, a0
; CHECK-NEXT:    vsetvli zero, zero, e32,m1
; CHECK-NEXT:    vmfne.vf v0, v16, ft0
; CHECK-NEXT:    ret
  %head = insertelement <vscale x 2 x float> undef, float %b, i32 0
  %splat = shufflevector <vscale x 2 x float> %head, <vscale x 2 x float> undef, <vscale x 2 x i32> zeroinitializer
  %vc = fcmp une <vscale x 2 x float> %va, %splat
  ret <vscale x 2 x i1> %vc
}

define <vscale x 2 x i1> @test_une_fv_nxv2f32(<vscale x 2 x float> %va, float %b) {
; CHECK-LABEL: test_une_fv_nxv2f32:
; CHECK:       # %bb.0:
; CHECK-NEXT:    fmv.w.x ft0, a0
; CHECK-NEXT:    vsetvli zero, zero, e32,m1
; CHECK-NEXT:    vfmv.v.f v1, ft0
; CHECK-NEXT:    vmfne.vv v0, v1, v16
; CHECK-NEXT:    ret
  %head = insertelement <vscale x 2 x float> undef, float %b, i32 0
  %splat = shufflevector <vscale x 2 x float> %head, <vscale x 2 x float> undef, <vscale x 2 x i32> zeroinitializer
  %vc = fcmp une <vscale x 2 x float> %splat, %va
  ret <vscale x 2 x i1> %vc
}

define <vscale x 2 x i1> @test_uno_vv_nxv2f32(<vscale x 2 x float> %va, <vscale x 2 x float> %vb) {
; CHECK-LABEL: test_uno_vv_nxv2f32:
; CHECK:       # %bb.0:
; CHECK-NEXT:    vsetvli zero, zero, e32,m1
; CHECK-NEXT:    vmford.vv v1, v16, v17
; CHECK-NEXT:    vmnot.m v0, v1
; CHECK-NEXT:    ret
  %vc = fcmp uno <vscale x 2 x float> %va, %vb
  ret <vscale x 2 x i1> %vc
}

define <vscale x 2 x i1> @test_uno_vf_nxv2f32(<vscale x 2 x float> %va, float %b) {
; CHECK-LABEL: test_uno_vf_nxv2f32:
; CHECK:       # %bb.0:
; CHECK-NEXT:    fmv.w.x ft0, a0
; CHECK-NEXT:    vsetvli zero, zero, e32,m1
; CHECK-NEXT:    vfmv.v.f v1, ft0
; CHECK-NEXT:    vmford.vv v1, v16, v1
; CHECK-NEXT:    vmnot.m v0, v1
; CHECK-NEXT:    ret
  %head = insertelement <vscale x 2 x float> undef, float %b, i32 0
  %splat = shufflevector <vscale x 2 x float> %head, <vscale x 2 x float> undef, <vscale x 2 x i32> zeroinitializer
  %vc = fcmp uno <vscale x 2 x float> %va, %splat
  ret <vscale x 2 x i1> %vc
}

define <vscale x 2 x i1> @test_uno_fv_nxv2f32(<vscale x 2 x float> %va, float %b) {
; CHECK-LABEL: test_uno_fv_nxv2f32:
; CHECK:       # %bb.0:
; CHECK-NEXT:    fmv.w.x ft0, a0
; CHECK-NEXT:    vsetvli zero, zero, e32,m1
; CHECK-NEXT:    vfmv.v.f v1, ft0
; CHECK-NEXT:    vmford.vv v1, v1, v16
; CHECK-NEXT:    vmnot.m v0, v1
; CHECK-NEXT:    ret
  %head = insertelement <vscale x 2 x float> undef, float %b, i32 0
  %splat = shufflevector <vscale x 2 x float> %head, <vscale x 2 x float> undef, <vscale x 2 x i32> zeroinitializer
  %vc = fcmp uno <vscale x 2 x float> %splat, %va
  ret <vscale x 2 x i1> %vc
}

define <vscale x 2 x i1> @test_true_vv_nxv2f32(<vscale x 2 x float> %va, <vscale x 2 x float> %vb) {
; CHECK-LABEL: test_true_vv_nxv2f32:
; CHECK:       # %bb.0:
; CHECK-NEXT:    vsetvli zero, zero, e32,m1
; CHECK-NEXT:    vmset.m v0
; CHECK-NEXT:    ret
  %vc = fcmp true <vscale x 2 x float> %va, %vb
  ret <vscale x 2 x i1> %vc
}

define <vscale x 2 x i1> @test_true_vf_nxv2f32(<vscale x 2 x float> %va, float %b) {
; CHECK-LABEL: test_true_vf_nxv2f32:
; CHECK:       # %bb.0:
; CHECK-NEXT:    vsetvli zero, zero, e32,m1
; CHECK-NEXT:    vmset.m v0
; CHECK-NEXT:    ret
  %head = insertelement <vscale x 2 x float> undef, float %b, i32 0
  %splat = shufflevector <vscale x 2 x float> %head, <vscale x 2 x float> undef, <vscale x 2 x i32> zeroinitializer
  %vc = fcmp true <vscale x 2 x float> %va, %splat
  ret <vscale x 2 x i1> %vc
}

define <vscale x 2 x i1> @test_true_fv_nxv2f32(<vscale x 2 x float> %va, float %b) {
; CHECK-LABEL: test_true_fv_nxv2f32:
; CHECK:       # %bb.0:
; CHECK-NEXT:    vsetvli zero, zero, e32,m1
; CHECK-NEXT:    vmset.m v0
; CHECK-NEXT:    ret
  %head = insertelement <vscale x 2 x float> undef, float %b, i32 0
  %splat = shufflevector <vscale x 2 x float> %head, <vscale x 2 x float> undef, <vscale x 2 x i32> zeroinitializer
  %vc = fcmp true <vscale x 2 x float> %splat, %va
  ret <vscale x 2 x i1> %vc
}

define <vscale x 1 x i1> @test_oeq_vv_nxv1f64(<vscale x 1 x double> %va, <vscale x 1 x double> %vb) {
; CHECK-LABEL: test_oeq_vv_nxv1f64:
; CHECK:       # %bb.0:
; CHECK-NEXT:    vsetvli zero, zero, e64,m1
; CHECK-NEXT:    vmfeq.vv v0, v16, v17
; CHECK-NEXT:    ret
  %vc = fcmp oeq <vscale x 1 x double> %va, %vb
  ret <vscale x 1 x i1> %vc
}

define <vscale x 1 x i1> @test_oeq_vf_nxv1f64(<vscale x 1 x double> %va, double %b) {
; CHECK-LABEL: test_oeq_vf_nxv1f64:
; CHECK:       # %bb.0:
; CHECK-NEXT:    fmv.d.x ft0, a0
; CHECK-NEXT:    vsetvli zero, zero, e64,m1
; CHECK-NEXT:    vmfeq.vf v0, v16, ft0
; CHECK-NEXT:    ret
  %head = insertelement <vscale x 1 x double> undef, double %b, i32 0
  %splat = shufflevector <vscale x 1 x double> %head, <vscale x 1 x double> undef, <vscale x 1 x i32> zeroinitializer
  %vc = fcmp oeq <vscale x 1 x double> %va, %splat
  ret <vscale x 1 x i1> %vc
}

define <vscale x 1 x i1> @test_oeq_fv_nxv1f64(<vscale x 1 x double> %va, double %b) {
; CHECK-LABEL: test_oeq_fv_nxv1f64:
; CHECK:       # %bb.0:
; CHECK-NEXT:    fmv.d.x ft0, a0
; CHECK-NEXT:    vsetvli zero, zero, e64,m1
; CHECK-NEXT:    vfmv.v.f v1, ft0
; CHECK-NEXT:    vmfeq.vv v0, v1, v16
; CHECK-NEXT:    ret
  %head = insertelement <vscale x 1 x double> undef, double %b, i32 0
  %splat = shufflevector <vscale x 1 x double> %head, <vscale x 1 x double> undef, <vscale x 1 x i32> zeroinitializer
  %vc = fcmp oeq <vscale x 1 x double> %splat, %va
  ret <vscale x 1 x i1> %vc
}

define <vscale x 2 x i1> @test_oeq_vv_nxv2f64(<vscale x 2 x double> %va, <vscale x 2 x double> %vb) {
; CHECK-LABEL: test_oeq_vv_nxv2f64:
; CHECK:       # %bb.0:
; CHECK-NEXT:    vsetvli zero, zero, e64,m2
; CHECK-NEXT:    vmfeq.vv v0, v16, v18
; CHECK-NEXT:    ret
  %vc = fcmp oeq <vscale x 2 x double> %va, %vb
  ret <vscale x 2 x i1> %vc
}

define <vscale x 2 x i1> @test_oeq_vf_nxv2f64(<vscale x 2 x double> %va, double %b) {
; CHECK-LABEL: test_oeq_vf_nxv2f64:
; CHECK:       # %bb.0:
; CHECK-NEXT:    fmv.d.x ft0, a0
; CHECK-NEXT:    vsetvli zero, zero, e64,m2
; CHECK-NEXT:    vmfeq.vf v0, v16, ft0
; CHECK-NEXT:    ret
  %head = insertelement <vscale x 2 x double> undef, double %b, i32 0
  %splat = shufflevector <vscale x 2 x double> %head, <vscale x 2 x double> undef, <vscale x 2 x i32> zeroinitializer
  %vc = fcmp oeq <vscale x 2 x double> %va, %splat
  ret <vscale x 2 x i1> %vc
}

define <vscale x 2 x i1> @test_oeq_fv_nxv2f64(<vscale x 2 x double> %va, double %b) {
; CHECK-LABEL: test_oeq_fv_nxv2f64:
; CHECK:       # %bb.0:
; CHECK-NEXT:    fmv.d.x ft0, a0
; CHECK-NEXT:    vsetvli zero, zero, e64,m2
; CHECK-NEXT:    vfmv.v.f v2, ft0
; CHECK-NEXT:    vmfeq.vv v0, v2, v16
; CHECK-NEXT:    ret
  %head = insertelement <vscale x 2 x double> undef, double %b, i32 0
  %splat = shufflevector <vscale x 2 x double> %head, <vscale x 2 x double> undef, <vscale x 2 x i32> zeroinitializer
  %vc = fcmp oeq <vscale x 2 x double> %splat, %va
  ret <vscale x 2 x i1> %vc
}

define <vscale x 4 x i1> @test_oeq_vv_nxv4f64(<vscale x 4 x double> %va, <vscale x 4 x double> %vb) {
; CHECK-LABEL: test_oeq_vv_nxv4f64:
; CHECK:       # %bb.0:
; CHECK-NEXT:    vsetvli zero, zero, e64,m4
; CHECK-NEXT:    vmfeq.vv v0, v16, v20
; CHECK-NEXT:    ret
  %vc = fcmp oeq <vscale x 4 x double> %va, %vb
  ret <vscale x 4 x i1> %vc
}

define <vscale x 4 x i1> @test_oeq_vf_nxv4f64(<vscale x 4 x double> %va, double %b) {
; CHECK-LABEL: test_oeq_vf_nxv4f64:
; CHECK:       # %bb.0:
; CHECK-NEXT:    fmv.d.x ft0, a0
; CHECK-NEXT:    vsetvli zero, zero, e64,m4
; CHECK-NEXT:    vmfeq.vf v0, v16, ft0
; CHECK-NEXT:    ret
  %head = insertelement <vscale x 4 x double> undef, double %b, i32 0
  %splat = shufflevector <vscale x 4 x double> %head, <vscale x 4 x double> undef, <vscale x 4 x i32> zeroinitializer
  %vc = fcmp oeq <vscale x 4 x double> %va, %splat
  ret <vscale x 4 x i1> %vc
}

define <vscale x 4 x i1> @test_oeq_fv_nxv4f64(<vscale x 4 x double> %va, double %b) {
; CHECK-LABEL: test_oeq_fv_nxv4f64:
; CHECK:       # %bb.0:
; CHECK-NEXT:    fmv.d.x ft0, a0
; CHECK-NEXT:    vsetvli zero, zero, e64,m4
; CHECK-NEXT:    vfmv.v.f v4, ft0
; CHECK-NEXT:    vmfeq.vv v0, v4, v16
; CHECK-NEXT:    ret
  %head = insertelement <vscale x 4 x double> undef, double %b, i32 0
  %splat = shufflevector <vscale x 4 x double> %head, <vscale x 4 x double> undef, <vscale x 4 x i32> zeroinitializer
  %vc = fcmp oeq <vscale x 4 x double> %splat, %va
  ret <vscale x 4 x i1> %vc
}

define <vscale x 8 x i1> @test_oeq_vv_nxv8f64(<vscale x 8 x double> %va, <vscale x 8 x double> %vb) {
; CHECK-LABEL: test_oeq_vv_nxv8f64:
; CHECK:       # %bb.0:
; CHECK-NEXT:    vsetvli zero, zero, e64,m8
; CHECK-NEXT:    vle.v v8, (a0)
; CHECK-NEXT:    vmfeq.vv v0, v16, v8
; CHECK-NEXT:    ret
  %vc = fcmp oeq <vscale x 8 x double> %va, %vb
  ret <vscale x 8 x i1> %vc
}

define <vscale x 8 x i1> @test_oeq_vf_nxv8f64(<vscale x 8 x double> %va, double %b) {
; CHECK-LABEL: test_oeq_vf_nxv8f64:
; CHECK:       # %bb.0:
; CHECK-NEXT:    fmv.d.x ft0, a0
; CHECK-NEXT:    vsetvli zero, zero, e64,m8
; CHECK-NEXT:    vmfeq.vf v0, v16, ft0
; CHECK-NEXT:    ret
  %head = insertelement <vscale x 8 x double> undef, double %b, i32 0
  %splat = shufflevector <vscale x 8 x double> %head, <vscale x 8 x double> undef, <vscale x 8 x i32> zeroinitializer
  %vc = fcmp oeq <vscale x 8 x double> %va, %splat
  ret <vscale x 8 x i1> %vc
}

define <vscale x 8 x i1> @test_oeq_fv_nxv8f64(<vscale x 8 x double> %va, double %b) {
; CHECK-LABEL: test_oeq_fv_nxv8f64:
; CHECK:       # %bb.0:
; CHECK-NEXT:    fmv.d.x ft0, a0
; CHECK-NEXT:    vsetvli zero, zero, e64,m8
; CHECK-NEXT:    vfmv.v.f v8, ft0
; CHECK-NEXT:    vmfeq.vv v0, v8, v16
; CHECK-NEXT:    ret
  %head = insertelement <vscale x 8 x double> undef, double %b, i32 0
  %splat = shufflevector <vscale x 8 x double> %head, <vscale x 8 x double> undef, <vscale x 8 x i32> zeroinitializer
  %vc = fcmp oeq <vscale x 8 x double> %splat, %va
  ret <vscale x 8 x i1> %vc
}
