; NOTE: Tests autogenerated by utils/EPI/generate-intrinsic-tests.py
; RUN: llc -mtriple=riscv64 -mattr=+m,+f,+d,+a,+c,+experimental-v \
; RUN:    -verify-machineinstrs --riscv-no-aliases < %s | FileCheck %s


define void @test1(i16* %spa, i16* %spb, i16* %spc) {
; CHECK: Begin function test1
  %pa = bitcast i16*  %spa to half*
  %pb = bitcast i16*  %spb to half*
  %pc = bitcast i16*  %spc to half*

; CHECK: call    __gnu_h2f_ieee
; CHECK: call    __gnu_h2f_ieee
  %a = load half, half* %pa
  %b = load half, half* %pb

  %d = fadd half %a, %b

; CHECK: call    __gnu_f2h_ieee
  store half %d, half* %pc

  ret void
}

define void @test2(i16* %spa, i16* %spb, i16* %spc) {
; CHECK: Begin function test2
  %pa = bitcast i16*  %spa to bfloat*
  %pb = bitcast i16*  %spb to bfloat*
  %pc = bitcast i16*  %spc to bfloat*

; CHECK: c.slli  {{.*}}, 16
; CHECK: slli    {{.*}}, {{.*}}, 16
  %a = load bfloat, bfloat* %pa
  %b = load bfloat, bfloat* %pb

  %d = fadd bfloat %a, %b

; CHECK: call    __truncsfbf2
  store bfloat %d, bfloat* %pc

  ret void
}

