; NOTE: Assertions have been autogenerated by utils/update_llc_test_checks.py
; RUN: llc -mtriple riscv64 -mattr +experimental-v -o - %s \
; RUN:     -verify-machineinstrs | FileCheck %s

define <vscale x 1 x i64> @insertelt.nxv1i64(<vscale x 1 x i64> %a, i64 %b) {
; CHECK-LABEL: insertelt.nxv1i64:
; CHECK:       # %bb.0:
; CHECK-NEXT:    vsetvli zero, zero, e64,m1
; CHECK-NEXT:    vid.v v1
; CHECK-NEXT:    vmseq.vx v0, v1, zero
; CHECK-NEXT:    vmerge.vxm v16, v16, a0, v0
; CHECK-NEXT:    ret
  %x = insertelement <vscale x 1 x i64> %a, i64 %b, i32 0
  ret <vscale x 1 x i64> %x
}

define <vscale x 2 x i64> @insertelt.nxv2i64(<vscale x 2 x i64> %a, i64 %b) {
; CHECK-LABEL: insertelt.nxv2i64:
; CHECK:       # %bb.0:
; CHECK-NEXT:    vsetvli zero, zero, e64,m2
; CHECK-NEXT:    vid.v v2
; CHECK-NEXT:    vmseq.vx v0, v2, zero
; CHECK-NEXT:    vmerge.vxm v16, v16, a0, v0
; CHECK-NEXT:    ret
  %x = insertelement <vscale x 2 x i64> %a, i64 %b, i32 0
  ret <vscale x 2 x i64> %x
}
