; NOTE: Assertions have been autogenerated by utils/update_llc_test_checks.py
; RUN: llc -mtriple riscv64 -mattr=+experimental-v -verify-machineinstrs < %s \
; RUN:    | FileCheck %s

define <vscale x 1 x i64> @nxv1i64(i64* %ptr, <vscale x 1 x i64> %indices, <vscale x 1 x i1> %mask, <vscale x 1 x i64> %passthru) {
; CHECK-LABEL: nxv1i64:
; CHECK:       # %bb.0:
; CHECK-NEXT:    vsetvli zero, zero, e64,m1
; CHECK-NEXT:    vsll.vi v1, v16, 3
; CHECK-NEXT:    vlxe.v v17, (a0), v1, v0.t
; CHECK-NEXT:    rdvtype t0
; CHECK-NEXT:    rdvl t1
; CHECK-NEXT:    vsetvli zero, zero, e64,m1
; CHECK-NEXT:    vmv.v.v v16, v17
; CHECK-NEXT:    vsetvl zero, t1, t0
; CHECK-NEXT:    ret
  %1 = getelementptr i64, i64* %ptr, <vscale x 1 x i64> %indices
  %2 = call <vscale x 1 x i64> @llvm.masked.gather.nxv1i64.nxv1p0i64(<vscale x 1 x i64*> %1, i32 8, <vscale x 1 x i1> %mask, <vscale x 1 x i64> %passthru)
  ret <vscale x 1 x i64> %2
}

; FIXME: Enable when gather of element types <i64 is supported.

;define <vscale x 2 x float> @nxv2f32(float* %ptr, <vscale x 2 x i32> %indices, <vscale x 2 x i1> %mask, <vscale x 2 x float> %passthru) {
;  %1 = getelementptr float, float* %ptr, <vscale x 2 x i32> %indices
;  %2 = call <vscale x 2 x float> @llvm.masked.gather.nxv2f32.nxv2p0f32(<vscale x 2 x float*> %1, i32 4, <vscale x 2 x i1> %mask, <vscale x 2 x float> %passthru)
;  ret <vscale x 2 x float> %2
;}

;define <vscale x 16 x i8> @nxv16i8(i8* %ptr, <vscale x 16 x i8> %indices, <vscale x 16 x i1> %mask, <vscale x 16 x i8> %passthru) {
;  %1 = getelementptr i8, i8* %ptr, <vscale x 16 x i8> %indices
;  %2 = call <vscale x 16 x i8> @llvm.masked.gather.nxv16i8.nxv16p0i8(<vscale x 16 x i8*> %1, i32 1, <vscale x 16 x i1> %mask, <vscale x 16 x i8> %passthru)
;  ret <vscale x 16 x i8> %2
;}

;define <vscale x 16 x i16> @nxv16i16(i16* %ptr, <vscale x 16 x i16> %indices, <vscale x 16 x i1> %mask, <vscale x 16 x i16> %passthru) {
;  %1 = getelementptr i16, i16* %ptr, <vscale x 16 x i16> %indices
;  %2 = call <vscale x 16 x i16> @llvm.masked.gather.nxv16i16.nxv16p0i16(<vscale x 16 x i16*> %1, i32 2, <vscale x 16 x i1> %mask, <vscale x 16 x i16> %passthru)
;  ret <vscale x 16 x i16> %2
;}

define <vscale x 8 x double> @nxv8f64(double* %ptr, <vscale x 8 x i64> %indices, <vscale x 8 x i1> %mask, <vscale x 8 x double> %passthru) {
; CHECK-LABEL: nxv8f64:
; CHECK:       # %bb.0:
; CHECK-NEXT:    vsetvli zero, zero, e64,m8
; CHECK-NEXT:    vle.v v8, (a1)
; CHECK-NEXT:    vsll.vi v16, v16, 3
; CHECK-NEXT:    vlxe.v v8, (a0), v16, v0.t
; CHECK-NEXT:    rdvtype t0
; CHECK-NEXT:    rdvl t1
; CHECK-NEXT:    vsetvli zero, zero, e64,m8
; CHECK-NEXT:    vmv.v.v v16, v8
; CHECK-NEXT:    vsetvl zero, t1, t0
; CHECK-NEXT:    ret
  %1 = getelementptr double, double* %ptr, <vscale x 8 x i64> %indices
  %2 = call <vscale x 8 x double> @llvm.masked.gather.nxv8f64.nxv8p0f64(<vscale x 8 x double*> %1, i32 8, <vscale x 8 x i1> %mask, <vscale x 8 x double> %passthru)
  ret <vscale x 8 x double> %2
}

; LMUL=1
declare <vscale x 1 x i64> @llvm.masked.gather.nxv1i64.nxv1p0i64(<vscale x 1 x i64*>, i32, <vscale x 1 x i1>, <vscale x 1 x i64>)
declare <vscale x 2 x float> @llvm.masked.gather.nxv2f32.nxv2p0f32(<vscale x 2 x float*>, i32, <vscale x 2 x i1>, <vscale x 2 x float>)

; LMUL>1
declare <vscale x 16 x i8> @llvm.masked.gather.nxv16i8.nxv16p0i8(<vscale x 16 x i8*>, i32, <vscale x 16 x i1>, <vscale x 16 x i8>)
declare <vscale x 16 x i16> @llvm.masked.gather.nxv16i16.nxv16p0i16(<vscale x 16 x i16*>, i32, <vscale x 16 x i1>, <vscale x 16 x i16>)
declare <vscale x 8 x double> @llvm.masked.gather.nxv8f64.nxv8p0f64(<vscale x 8 x double*>, i32, <vscale x 8 x i1>, <vscale x 8 x double>)
