; NOTE: Assertions have been autogenerated by utils/update_llc_test_checks.py
; RUN: llc -mtriple=riscv64 -mattr=+m,+f,+d,+a,+c,+experimental-v,+only-lmul1 \
; RUN:    -target-abi lp64d -verify-machineinstrs < %s | FileCheck %s

define dso_local void @swiden2(<vscale x 2 x i32> %a, <vscale x 2 x i1> %mask, i32 %evl, <vscale x 2 x i64> *%pb ) {
; CHECK-LABEL: swiden2:
; CHECK:       # %bb.0:
; CHECK-NEXT:    sext.w a4, a0
; CHECK-NEXT:    vsetvli a2, zero, e64,m1
; CHECK-NEXT:    sext.w a3, a2
; CHECK-NEXT:    bltu a3, a4, .LBB0_2
; CHECK-NEXT:  # %bb.1:
; CHECK-NEXT:    add a3, zero, a4
; CHECK-NEXT:  .LBB0_2:
; CHECK-NEXT:    subw a0, a0, a3
; CHECK-NEXT:    slli a4, a2, 1
; CHECK-NEXT:    vsetvli zero, a4, e32,m1
; CHECK-NEXT:    vslidedown.vx v1, v16, a2
; CHECK-NEXT:    vsetvli zero, a0, e32,m1
; CHECK-NEXT:    vwcvt.x.x.v v2, v1
; CHECK-NEXT:    vsetvli zero, a3, e32,m1
; CHECK-NEXT:    vwcvt.x.x.v v4, v16
; CHECK-NEXT:    vsetvli zero, zero, e64,m1
; CHECK-NEXT:    vse.v v4, (a1)
; CHECK-NEXT:    slli a0, a2, 3
; CHECK-NEXT:    add a0, a0, a1
; CHECK-NEXT:    vse.v v2, (a0)
; CHECK-NEXT:    ret
  %b = call <vscale x 2 x i64> @llvm.vp.sext.nxv2i64.nxv2i32(<vscale x 2 x i32> %a, <vscale x 2 x i1> %mask, i32 %evl)
  store <vscale x 2 x i64> %b, <vscale x 2 x i64>* %pb
  ret void
}

declare <vscale x 2 x i64> @llvm.vp.sext.nxv2i64.nxv2i32(<vscale x 2 x i32> %a, <vscale x 2 x i1> %mask, i32 %evl)

define dso_local <vscale x 2 x i32> @snarrow(<vscale x 2 x i1> %mask, i32 %evl, <vscale x 2 x i64> *%pa) {
; CHECK-LABEL: snarrow:
; CHECK:       # %bb.0:
; CHECK-NEXT:    sext.w a4, a0
; CHECK-NEXT:    vsetvli a2, zero, e64,m1
; CHECK-NEXT:    sext.w a3, a2
; CHECK-NEXT:    bltu a3, a4, .LBB1_2
; CHECK-NEXT:  # %bb.1:
; CHECK-NEXT:    add a3, zero, a4
; CHECK-NEXT:  .LBB1_2:
; CHECK-NEXT:    subw a0, a0, a3
; CHECK-NEXT:    slli a4, a2, 3
; CHECK-NEXT:    vle.v v2, (a1)
; CHECK-NEXT:    add a1, a1, a4
; CHECK-NEXT:    vle.v v4, (a1)
; CHECK-NEXT:    vsetvli zero, a3, e32,m1
; CHECK-NEXT:    vnsrl.vi v16, v2, 0
; CHECK-NEXT:    vsetvli zero, a0, e32,m1
; CHECK-NEXT:    vnsrl.vi v1, v4, 0
; CHECK-NEXT:    slli a0, a2, 1
; CHECK-NEXT:    vsetvli zero, a0, e32,m1
; CHECK-NEXT:    vslideup.vx v16, v1, a2
; CHECK-NEXT:    ret
  %a = load <vscale x 2 x i64>, <vscale x 2 x i64>* %pa
  %b = call <vscale x 2 x i32> @llvm.vp.trunc.nxv2i32.nxv2i64(<vscale x 2 x i64> %a, <vscale x 2 x i1> %mask, i32 %evl)
  ret <vscale x 2 x i32> %b
}

declare <vscale x 2 x i32> @llvm.vp.trunc.nxv2i32.nxv2i64(<vscale x 2 x i64> %a, <vscale x 2 x i1> %mask, i32 %evl)

define dso_local void @fpext2(<vscale x 2 x float> %a, <vscale x 2 x i1> %mask, i32 %evl, <vscale x 2 x double> *%pb ) {
; CHECK-LABEL: fpext2:
; CHECK:       # %bb.0:
; CHECK-NEXT:    sext.w a4, a0
; CHECK-NEXT:    vsetvli a2, zero, e64,m1
; CHECK-NEXT:    sext.w a3, a2
; CHECK-NEXT:    bltu a3, a4, .LBB2_2
; CHECK-NEXT:  # %bb.1:
; CHECK-NEXT:    add a3, zero, a4
; CHECK-NEXT:  .LBB2_2:
; CHECK-NEXT:    subw a0, a0, a3
; CHECK-NEXT:    slli a4, a2, 1
; CHECK-NEXT:    vsetvli zero, a4, e32,m1
; CHECK-NEXT:    vslidedown.vx v1, v16, a2
; CHECK-NEXT:    vsetvli zero, a0, e32,m1
; CHECK-NEXT:    vfwcvt.f.f.v v2, v1
; CHECK-NEXT:    vsetvli zero, a3, e32,m1
; CHECK-NEXT:    vfwcvt.f.f.v v4, v16
; CHECK-NEXT:    vsetvli zero, zero, e64,m1
; CHECK-NEXT:    vse.v v4, (a1)
; CHECK-NEXT:    slli a0, a2, 3
; CHECK-NEXT:    add a0, a0, a1
; CHECK-NEXT:    vse.v v2, (a0)
; CHECK-NEXT:    ret
  %b = call <vscale x 2 x double> @llvm.vp.fpext.nxv2f64.nxv2f32(<vscale x 2 x float> %a, metadata !"fpexcept.ignore", <vscale x 2 x i1> %mask, i32 %evl)
  store <vscale x 2 x double> %b, <vscale x 2 x double>* %pb
  ret void
}

declare <vscale x 2 x double> @llvm.vp.fpext.nxv2f64.nxv2f32(<vscale x 2 x float> %a, metadata, <vscale x 2 x i1> %mask, i32 %evl)

define dso_local <vscale x 2 x float> @fptrunc2(<vscale x 2 x i1> %mask, i32 %evl, <vscale x 2 x double> *%pa) {
; CHECK-LABEL: fptrunc2:
; CHECK:       # %bb.0:
; CHECK-NEXT:    sext.w a4, a0
; CHECK-NEXT:    vsetvli a2, zero, e64,m1
; CHECK-NEXT:    sext.w a3, a2
; CHECK-NEXT:    rdvtype t0
; CHECK-NEXT:    rdvl t1
; CHECK-NEXT:    vsetvli zero, zero, e64,m1
; CHECK-NEXT:    vmv.v.v v1, v0
; CHECK-NEXT:    vsetvl zero, t1, t0
; CHECK-NEXT:    bltu a3, a4, .LBB3_2
; CHECK-NEXT:  # %bb.1:
; CHECK-NEXT:    add a3, zero, a4
; CHECK-NEXT:  .LBB3_2:
; CHECK-NEXT:    slli a4, a2, 3
; CHECK-NEXT:    vle.v v2, (a1)
; CHECK-NEXT:    add a1, a1, a4
; CHECK-NEXT:    vle.v v4, (a1)
; CHECK-NEXT:    vsetvli zero, a3, e32,m1
; CHECK-NEXT:    vfncvt.f.f.v v6, v2
; CHECK-NEXT:    vsetvli a1, zero, e64,m1
; CHECK-NEXT:    vsetvli zero, a1, e32,m1
; CHECK-NEXT:    vwcvtu.x.x.v v2, v1
; CHECK-NEXT:    vsetvli zero, a3, e32,m1
; CHECK-NEXT:    vnsrl.vi v0, v2, 0
; CHECK-NEXT:    subw a0, a0, a3
; CHECK-NEXT:    vmerge.vvm v16, v1, v6, v0
; CHECK-NEXT:    vsetvli a3, zero, e32,m1
; CHECK-NEXT:    vslidedown.vx v1, v1, a2
; CHECK-NEXT:    vsetvli zero, a1, e32,m1
; CHECK-NEXT:    vwcvtu.x.x.v v2, v1
; CHECK-NEXT:    vsetvli zero, a0, e32,m1
; CHECK-NEXT:    vnsrl.vi v0, v2, 0
; CHECK-NEXT:    vfncvt.f.f.v v1, v4
; CHECK-NEXT:    vmerge.vvm v1, v1, v1, v0
; CHECK-NEXT:    slli a0, a2, 1
; CHECK-NEXT:    vsetvli zero, a0, e32,m1
; CHECK-NEXT:    vslideup.vx v16, v1, a2
; CHECK-NEXT:    ret
  %a = load <vscale x 2 x double>, <vscale x 2 x double>* %pa
  %b = call <vscale x 2 x float> @llvm.vp.fptrunc.nxv2f32.nxv2f64(<vscale x 2 x double> %a, metadata !"round.tonearest", metadata !"fpexcept.ignore", <vscale x 2 x i1> %mask, i32 %evl)
  ret <vscale x 2 x float> %b
}

declare <vscale x 2 x float> @llvm.vp.fptrunc.nxv2f32.nxv2f64(<vscale x 2 x double> %a, metadata, metadata, <vscale x 2 x i1> %mask, i32 %evl)
