; NOTE: Assertions have been autogenerated by utils/update_llc_test_checks.py
; RUN: llc -mtriple=riscv64 -mattr=+f,+d,+experimental-v -verify-machineinstrs \
; RUN:    < %s | FileCheck %s

define <vscale x 2 x float> @ceil_nxv2f32(<vscale x 2 x float> %x) {
; CHECK-LABEL: ceil_nxv2f32:
; CHECK:       # %bb.0:
; CHECK-NEXT:    lui a0, %hi(.LCPI0_0)
; CHECK-NEXT:    flw ft0, %lo(.LCPI0_0)(a0)
; CHECK-NEXT:    vsetvli zero, zero, e32,m1
; CHECK-NEXT:    vfsgnjx.vv v1, v16, v16
; CHECK-NEXT:    vmflt.vf v1, v1, ft0
; CHECK-NEXT:    lui a0, %hi(.LCPI0_1)
; CHECK-NEXT:    flw ft0, %lo(.LCPI0_1)(a0)
; CHECK-NEXT:    vfcvt.x.f.v v2, v16
; CHECK-NEXT:    vfcvt.f.x.v v2, v2
; CHECK-NEXT:    vmflt.vv v0, v2, v16
; CHECK-NEXT:    vfadd.vf v3, v2, ft0
; CHECK-NEXT:    vmerge.vvm v2, v2, v3, v0
; CHECK-NEXT:    vfsgnj.vv v2, v2, v16
; CHECK-NEXT:    rdvtype t0
; CHECK-NEXT:    rdvl t1
; CHECK-NEXT:    vsetvli zero, zero, e64,m1
; CHECK-NEXT:    vmv.v.v v0, v1
; CHECK-NEXT:    vsetvl zero, t1, t0
; CHECK-NEXT:    vmerge.vvm v16, v16, v2, v0
; CHECK-NEXT:    ret
  %a = call <vscale x 2 x float> @llvm.ceil.nxv2f32(<vscale x 2 x float> %x)
  ret <vscale x 2 x float> %a
}
declare <vscale x 2 x float> @llvm.ceil.nxv2f32(<vscale x 2 x float>)

define <vscale x 4 x float> @ceil_nxv4f32(<vscale x 4 x float> %x) {
; CHECK-LABEL: ceil_nxv4f32:
; CHECK:       # %bb.0:
; CHECK-NEXT:    lui a0, %hi(.LCPI1_0)
; CHECK-NEXT:    flw ft0, %lo(.LCPI1_0)(a0)
; CHECK-NEXT:    vsetvli zero, zero, e32,m2
; CHECK-NEXT:    vfsgnjx.vv v2, v16, v16
; CHECK-NEXT:    vmflt.vf v1, v2, ft0
; CHECK-NEXT:    lui a0, %hi(.LCPI1_1)
; CHECK-NEXT:    flw ft0, %lo(.LCPI1_1)(a0)
; CHECK-NEXT:    vfcvt.x.f.v v2, v16
; CHECK-NEXT:    vfcvt.f.x.v v2, v2
; CHECK-NEXT:    vmflt.vv v0, v2, v16
; CHECK-NEXT:    vfadd.vf v4, v2, ft0
; CHECK-NEXT:    vmerge.vvm v2, v2, v4, v0
; CHECK-NEXT:    vfsgnj.vv v2, v2, v16
; CHECK-NEXT:    rdvtype t0
; CHECK-NEXT:    rdvl t1
; CHECK-NEXT:    vsetvli zero, zero, e64,m1
; CHECK-NEXT:    vmv.v.v v0, v1
; CHECK-NEXT:    vsetvl zero, t1, t0
; CHECK-NEXT:    vmerge.vvm v16, v16, v2, v0
; CHECK-NEXT:    ret
  %a = call <vscale x 4 x float> @llvm.ceil.nxv4f32(<vscale x 4 x float> %x)
  ret <vscale x 4 x float> %a
}
declare <vscale x 4 x float> @llvm.ceil.nxv4f32(<vscale x 4 x float>)

define <vscale x 8 x float> @ceil_nxv8f32(<vscale x 8 x float> %x) {
; CHECK-LABEL: ceil_nxv8f32:
; CHECK:       # %bb.0:
; CHECK-NEXT:    lui a0, %hi(.LCPI2_0)
; CHECK-NEXT:    flw ft0, %lo(.LCPI2_0)(a0)
; CHECK-NEXT:    vsetvli zero, zero, e32,m4
; CHECK-NEXT:    vfsgnjx.vv v4, v16, v16
; CHECK-NEXT:    vmflt.vf v1, v4, ft0
; CHECK-NEXT:    lui a0, %hi(.LCPI2_1)
; CHECK-NEXT:    flw ft0, %lo(.LCPI2_1)(a0)
; CHECK-NEXT:    vfcvt.x.f.v v4, v16
; CHECK-NEXT:    vfcvt.f.x.v v4, v4
; CHECK-NEXT:    vmflt.vv v0, v4, v16
; CHECK-NEXT:    vfadd.vf v20, v4, ft0
; CHECK-NEXT:    vmerge.vvm v4, v4, v20, v0
; CHECK-NEXT:    vfsgnj.vv v4, v4, v16
; CHECK-NEXT:    rdvtype t0
; CHECK-NEXT:    rdvl t1
; CHECK-NEXT:    vsetvli zero, zero, e64,m1
; CHECK-NEXT:    vmv.v.v v0, v1
; CHECK-NEXT:    vsetvl zero, t1, t0
; CHECK-NEXT:    vmerge.vvm v16, v16, v4, v0
; CHECK-NEXT:    ret
  %a = call <vscale x 8 x float> @llvm.ceil.nxv8f32(<vscale x 8 x float> %x)
  ret <vscale x 8 x float> %a
}
declare <vscale x 8 x float> @llvm.ceil.nxv8f32(<vscale x 8 x float>)

define <vscale x 16 x float> @ceil_nxv16f32(<vscale x 16 x float> %x) {
; CHECK-LABEL: ceil_nxv16f32:
; CHECK:       # %bb.0:
; CHECK-NEXT:    lui a0, %hi(.LCPI3_0)
; CHECK-NEXT:    flw ft0, %lo(.LCPI3_0)(a0)
; CHECK-NEXT:    vsetvli zero, zero, e32,m8
; CHECK-NEXT:    vfsgnjx.vv v8, v16, v16
; CHECK-NEXT:    vmflt.vf v1, v8, ft0
; CHECK-NEXT:    lui a0, %hi(.LCPI3_1)
; CHECK-NEXT:    flw ft0, %lo(.LCPI3_1)(a0)
; CHECK-NEXT:    vfcvt.x.f.v v8, v16
; CHECK-NEXT:    vfcvt.f.x.v v8, v8
; CHECK-NEXT:    vmflt.vv v0, v8, v16
; CHECK-NEXT:    vfadd.vf v24, v8, ft0
; CHECK-NEXT:    vmerge.vvm v8, v8, v24, v0
; CHECK-NEXT:    vfsgnj.vv v8, v8, v16
; CHECK-NEXT:    rdvtype t0
; CHECK-NEXT:    rdvl t1
; CHECK-NEXT:    vsetvli zero, zero, e64,m1
; CHECK-NEXT:    vmv.v.v v0, v1
; CHECK-NEXT:    vsetvl zero, t1, t0
; CHECK-NEXT:    vmerge.vvm v16, v16, v8, v0
; CHECK-NEXT:    ret
  %a = call <vscale x 16 x float> @llvm.ceil.nxv16f32(<vscale x 16 x float> %x)
  ret <vscale x 16 x float> %a
}
declare <vscale x 16 x float> @llvm.ceil.nxv16f32(<vscale x 16 x float>)

define <vscale x 1 x double> @ceil_nxv1f64(<vscale x 1 x double> %x) {
; CHECK-LABEL: ceil_nxv1f64:
; CHECK:       # %bb.0:
; CHECK-NEXT:    vsetvli zero, zero, e64,m1
; CHECK-NEXT:    vfcvt.x.f.v v1, v16
; CHECK-NEXT:    vfcvt.f.x.v v1, v1
; CHECK-NEXT:    lui a0, %hi(.LCPI4_0)
; CHECK-NEXT:    fld ft0, %lo(.LCPI4_0)(a0)
; CHECK-NEXT:    vmflt.vv v0, v1, v16
; CHECK-NEXT:    lui a0, %hi(.LCPI4_1)
; CHECK-NEXT:    fld ft1, %lo(.LCPI4_1)(a0)
; CHECK-NEXT:    vfadd.vf v2, v1, ft0
; CHECK-NEXT:    vmerge.vvm v1, v1, v2, v0
; CHECK-NEXT:    vfsgnjx.vv v2, v16, v16
; CHECK-NEXT:    vmflt.vf v0, v2, ft1
; CHECK-NEXT:    vfsgnj.vv v1, v1, v16
; CHECK-NEXT:    vmerge.vvm v16, v16, v1, v0
; CHECK-NEXT:    ret
  %a = call <vscale x 1 x double> @llvm.ceil.nxv1f64(<vscale x 1 x double> %x)
  ret <vscale x 1 x double> %a
}
declare <vscale x 1 x double> @llvm.ceil.nxv1f64(<vscale x 1 x double>)

define <vscale x 2 x double> @ceil_nxv2f64(<vscale x 2 x double> %x) {
; CHECK-LABEL: ceil_nxv2f64:
; CHECK:       # %bb.0:
; CHECK-NEXT:    vsetvli zero, zero, e64,m2
; CHECK-NEXT:    vfcvt.x.f.v v2, v16
; CHECK-NEXT:    vfcvt.f.x.v v2, v2
; CHECK-NEXT:    lui a0, %hi(.LCPI5_0)
; CHECK-NEXT:    fld ft0, %lo(.LCPI5_0)(a0)
; CHECK-NEXT:    vmflt.vv v0, v2, v16
; CHECK-NEXT:    lui a0, %hi(.LCPI5_1)
; CHECK-NEXT:    fld ft1, %lo(.LCPI5_1)(a0)
; CHECK-NEXT:    vfadd.vf v4, v2, ft0
; CHECK-NEXT:    vmerge.vvm v2, v2, v4, v0
; CHECK-NEXT:    vfsgnjx.vv v4, v16, v16
; CHECK-NEXT:    vmflt.vf v0, v4, ft1
; CHECK-NEXT:    vfsgnj.vv v2, v2, v16
; CHECK-NEXT:    vmerge.vvm v16, v16, v2, v0
; CHECK-NEXT:    ret
  %a = call <vscale x 2 x double> @llvm.ceil.nxv2f64(<vscale x 2 x double> %x)
  ret <vscale x 2 x double> %a
}
declare <vscale x 2 x double> @llvm.ceil.nxv2f64(<vscale x 2 x double>)

define <vscale x 4 x double> @ceil_nxv4f64(<vscale x 4 x double> %x) {
; CHECK-LABEL: ceil_nxv4f64:
; CHECK:       # %bb.0:
; CHECK-NEXT:    vsetvli zero, zero, e64,m4
; CHECK-NEXT:    vfcvt.x.f.v v4, v16
; CHECK-NEXT:    vfcvt.f.x.v v4, v4
; CHECK-NEXT:    lui a0, %hi(.LCPI6_0)
; CHECK-NEXT:    fld ft0, %lo(.LCPI6_0)(a0)
; CHECK-NEXT:    vmflt.vv v0, v4, v16
; CHECK-NEXT:    lui a0, %hi(.LCPI6_1)
; CHECK-NEXT:    fld ft1, %lo(.LCPI6_1)(a0)
; CHECK-NEXT:    vfadd.vf v20, v4, ft0
; CHECK-NEXT:    vmerge.vvm v4, v4, v20, v0
; CHECK-NEXT:    vfsgnjx.vv v20, v16, v16
; CHECK-NEXT:    vmflt.vf v0, v20, ft1
; CHECK-NEXT:    vfsgnj.vv v4, v4, v16
; CHECK-NEXT:    vmerge.vvm v16, v16, v4, v0
; CHECK-NEXT:    ret
  %a = call <vscale x 4 x double> @llvm.ceil.nxv4f64(<vscale x 4 x double> %x)
  ret <vscale x 4 x double> %a
}
declare <vscale x 4 x double> @llvm.ceil.nxv4f64(<vscale x 4 x double>)

define <vscale x 8 x double> @ceil_nxv8f64(<vscale x 8 x double> %x) {
; CHECK-LABEL: ceil_nxv8f64:
; CHECK:       # %bb.0:
; CHECK-NEXT:    vsetvli zero, zero, e64,m8
; CHECK-NEXT:    vfcvt.x.f.v v8, v16
; CHECK-NEXT:    vfcvt.f.x.v v8, v8
; CHECK-NEXT:    lui a0, %hi(.LCPI7_0)
; CHECK-NEXT:    fld ft0, %lo(.LCPI7_0)(a0)
; CHECK-NEXT:    vmflt.vv v0, v8, v16
; CHECK-NEXT:    lui a0, %hi(.LCPI7_1)
; CHECK-NEXT:    fld ft1, %lo(.LCPI7_1)(a0)
; CHECK-NEXT:    vfadd.vf v24, v8, ft0
; CHECK-NEXT:    vmerge.vvm v8, v8, v24, v0
; CHECK-NEXT:    vfsgnjx.vv v24, v16, v16
; CHECK-NEXT:    vmflt.vf v0, v24, ft1
; CHECK-NEXT:    vfsgnj.vv v8, v8, v16
; CHECK-NEXT:    vmerge.vvm v16, v16, v8, v0
; CHECK-NEXT:    ret
  %a = call <vscale x 8 x double> @llvm.ceil.nxv8f64(<vscale x 8 x double> %x)
  ret <vscale x 8 x double> %a
}
declare <vscale x 8 x double> @llvm.ceil.nxv8f64(<vscale x 8 x double>)
