; NOTE: Assertions have been autogenerated by utils/update_test_checks.py
; RUN: opt < %s -mtriple=riscv64 -mattr=+m,+a,+f,+d,+experimental-v \
; RUN:    -loop-vectorize -vector-register-width-factor=8 -debug-only=loop-vectorize \
; RUN:    -prefer-predicate-over-epilogue=predicate-dont-vectorize -S 2>&1 \
; RUN:    | FileCheck %s -check-prefixes=CHECK
; RUN: opt < %s -mtriple=riscv64 -mattr=+m,+a,+f,+d,+experimental-v \
; RUN:    -loop-vectorize -debug-only=loop-vectorize \
; RUN:    -prefer-predicate-over-epilogue=predicate-dont-vectorize -S 2>&1 \
; RUN:    | FileCheck %s -check-prefixes=CHECK1
; REQUIRE: asserts

target datalayout = "e-m:e-p270:32:32-p271:32:32-p272:64:64-i64:64-f80:128-n8:16:32:64-S128"

define internal i64 @foo(i32* %t0) !prof !1 {
; CHECK-LABEL: @foo(
; CHECK-NEXT:  t16:
; CHECK-NEXT:    br i1 false, label [[SCALAR_PH:%.*]], label [[VECTOR_PH:%.*]]
; CHECK:       vector.ph:
; CHECK-NEXT:    [[BROADCAST_SPLATINSERT:%.*]] = insertelement <vscale x 16 x i64> undef, i64 undef, i32 0
; CHECK-NEXT:    [[BROADCAST_SPLAT:%.*]] = shufflevector <vscale x 16 x i64> [[BROADCAST_SPLATINSERT]], <vscale x 16 x i64> undef, <vscale x 16 x i32> zeroinitializer
; CHECK-NEXT:    [[BROADCAST_SPLATINSERT6:%.*]] = insertelement <vscale x 16 x i32> undef, i32 3, i32 0
; CHECK-NEXT:    [[BROADCAST_SPLAT7:%.*]] = shufflevector <vscale x 16 x i32> [[BROADCAST_SPLATINSERT6]], <vscale x 16 x i32> undef, <vscale x 16 x i32> zeroinitializer
; CHECK-NEXT:    [[BROADCAST_SPLATINSERT10:%.*]] = insertelement <vscale x 16 x i32> undef, i32 5, i32 0
; CHECK-NEXT:    [[BROADCAST_SPLAT11:%.*]] = shufflevector <vscale x 16 x i32> [[BROADCAST_SPLATINSERT10]], <vscale x 16 x i32> undef, <vscale x 16 x i32> zeroinitializer
; CHECK-NEXT:    [[TMP0:%.*]] = insertelement <vscale x 16 x i32> zeroinitializer, i32 0, i32 0
; CHECK-NEXT:    [[TMP1:%.*]] = insertelement <vscale x 16 x i32> zeroinitializer, i32 0, i32 0
; CHECK-NEXT:    br label [[VECTOR_BODY:%.*]]
; CHECK:       vector.body:
; CHECK-NEXT:    [[INDEX:%.*]] = phi i64 [ 0, [[VECTOR_PH]] ], [ [[INDEX_NEXT:%.*]], [[VECTOR_BODY]] ]
; CHECK-NEXT:    [[VEC_PHI:%.*]] = phi <vscale x 16 x i32> [ [[TMP0]], [[VECTOR_PH]] ], [ [[TMP10:%.*]], [[VECTOR_BODY]] ]
; CHECK-NEXT:    [[VEC_PHI5:%.*]] = phi <vscale x 16 x i32> [ [[TMP1]], [[VECTOR_PH]] ], [ [[TMP11:%.*]], [[VECTOR_BODY]] ]
; CHECK-NEXT:    [[BROADCAST_SPLATINSERT1:%.*]] = insertelement <vscale x 16 x i64> undef, i64 [[INDEX]], i32 0
; CHECK-NEXT:    [[BROADCAST_SPLAT2:%.*]] = shufflevector <vscale x 16 x i64> [[BROADCAST_SPLATINSERT1]], <vscale x 16 x i64> undef, <vscale x 16 x i32> zeroinitializer
; CHECK-NEXT:    [[TMP2:%.*]] = call <vscale x 16 x i64> @llvm.experimental.vector.stepvector.nxv16i64()
; CHECK-NEXT:    [[DOTSPLATINSERT:%.*]] = insertelement <vscale x 16 x i64> undef, i64 0, i32 0
; CHECK-NEXT:    [[DOTSPLAT:%.*]] = shufflevector <vscale x 16 x i64> [[DOTSPLATINSERT]], <vscale x 16 x i64> undef, <vscale x 16 x i32> zeroinitializer
; CHECK-NEXT:    [[TMP3:%.*]] = add <vscale x 16 x i64> [[TMP2]], [[DOTSPLAT]]
; CHECK-NEXT:    [[DOTSPLATINSERT3:%.*]] = insertelement <vscale x 16 x i64> undef, i64 1, i32 0
; CHECK-NEXT:    [[DOTSPLAT4:%.*]] = shufflevector <vscale x 16 x i64> [[DOTSPLATINSERT3]], <vscale x 16 x i64> undef, <vscale x 16 x i32> zeroinitializer
; CHECK-NEXT:    [[TMP4:%.*]] = mul <vscale x 16 x i64> [[TMP3]], [[DOTSPLAT4]]
; CHECK-NEXT:    [[INDUCTION:%.*]] = add <vscale x 16 x i64> [[BROADCAST_SPLAT2]], [[TMP4]]
; CHECK-NEXT:    [[TMP5:%.*]] = add i64 [[INDEX]], 0
; CHECK-NEXT:    [[TMP6:%.*]] = icmp ule <vscale x 16 x i64> [[INDUCTION]], [[BROADCAST_SPLAT]]
; CHECK-NEXT:    [[TMP7:%.*]] = sub i64 undef, [[INDEX]]
; CHECK-NEXT:    [[TMP8:%.*]] = call i64 @llvm.epi.vsetvl(i64 [[TMP7]], i64 2, i64 3)
; CHECK-NEXT:    [[TMP9:%.*]] = trunc i64 [[TMP8]] to i32
; CHECK-NEXT:    [[DOTSPLATINSERT8:%.*]] = insertelement <vscale x 16 x i1> undef, i1 true, i32 0
; CHECK-NEXT:    [[DOTSPLAT9:%.*]] = shufflevector <vscale x 16 x i1> [[DOTSPLATINSERT8]], <vscale x 16 x i1> undef, <vscale x 16 x i32> zeroinitializer
; CHECK-NEXT:    [[VP_OP:%.*]] = call <vscale x 16 x i32> @llvm.vp.add.nxv16i32(<vscale x 16 x i32> [[BROADCAST_SPLAT7]], <vscale x 16 x i32> [[VEC_PHI5]], <vscale x 16 x i1> [[DOTSPLAT9]], i32 [[TMP9]])
; CHECK-NEXT:    [[VP_OP14:%.*]] = call <vscale x 16 x i32> @llvm.vp.add.nxv16i32(<vscale x 16 x i32> [[VEC_PHI]], <vscale x 16 x i32> [[BROADCAST_SPLAT11]], <vscale x 16 x i1> [[DOTSPLAT9]], i32 [[TMP9]])
; CHECK-NEXT:    [[EVL_SPLATINSERT:%.*]] = insertelement <vscale x 16 x i32> undef, i32 [[TMP9]], i32 0
; CHECK-NEXT:    [[EVL_SPLAT:%.*]] = shufflevector <vscale x 16 x i32> [[EVL_SPLATINSERT]], <vscale x 16 x i32> undef, <vscale x 16 x i32> zeroinitializer
; CHECK-NEXT:    [[STEP_VEC:%.*]] = call <vscale x 16 x i32> @llvm.experimental.vector.stepvector.nxv16i32()
; CHECK-NEXT:    [[EVL_MASK:%.*]] = icmp ult <vscale x 16 x i32> [[STEP_VEC]], [[EVL_SPLAT]]
; CHECK-NEXT:    [[TMP10]] = select <vscale x 16 x i1> [[EVL_MASK]], <vscale x 16 x i32> [[VP_OP14]], <vscale x 16 x i32> [[VEC_PHI]]
; CHECK-NEXT:    [[TMP11]] = select <vscale x 16 x i1> [[EVL_MASK]], <vscale x 16 x i32> [[VP_OP]], <vscale x 16 x i32> [[VEC_PHI5]]
; CHECK-NEXT:    [[TMP12:%.*]] = zext i32 [[TMP9]] to i64
; CHECK-NEXT:    [[INDEX_NEXT]] = add i64 [[INDEX]], [[TMP12]]
; CHECK-NEXT:    [[TMP13:%.*]] = icmp eq i64 [[INDEX_NEXT]], undef
; CHECK-NEXT:    br i1 [[TMP13]], label [[MIDDLE_BLOCK:%.*]], label [[VECTOR_BODY]], !prof !1, [[LOOP2:!llvm.loop !.*]]
; CHECK:       middle.block:
; CHECK-NEXT:    [[TMP14:%.*]] = call i32 @llvm.vector.reduce.add.nxv16i32(<vscale x 16 x i32> [[TMP11]])
; CHECK-NEXT:    [[TMP15:%.*]] = call i32 @llvm.vector.reduce.add.nxv16i32(<vscale x 16 x i32> [[TMP10]])
; CHECK-NEXT:    br i1 true, label [[T17:%.*]], label [[SCALAR_PH]]
; CHECK:       scalar.ph:
; CHECK-NEXT:    [[BC_RESUME_VAL:%.*]] = phi i64 [ undef, [[MIDDLE_BLOCK]] ], [ 0, [[T16:%.*]] ]
; CHECK-NEXT:    [[BC_MERGE_RDX:%.*]] = phi i32 [ 0, [[T16]] ], [ [[TMP15]], [[MIDDLE_BLOCK]] ]
; CHECK-NEXT:    [[BC_MERGE_RDX15:%.*]] = phi i32 [ 0, [[T16]] ], [ [[TMP14]], [[MIDDLE_BLOCK]] ]
; CHECK-NEXT:    br label [[T20:%.*]]
; CHECK:       t17:
; CHECK-NEXT:    [[T18:%.*]] = phi i32 [ [[T24:%.*]], [[T20]] ], [ [[TMP14]], [[MIDDLE_BLOCK]] ]
; CHECK-NEXT:    [[T19:%.*]] = phi i32 [ [[T28:%.*]], [[T20]] ], [ [[TMP15]], [[MIDDLE_BLOCK]] ]
; CHECK-NEXT:    br label [[T31:%.*]]
; CHECK:       t20:
; CHECK-NEXT:    [[T21:%.*]] = phi i64 [ [[BC_RESUME_VAL]], [[SCALAR_PH]] ], [ [[T29:%.*]], [[T20]] ]
; CHECK-NEXT:    [[T22:%.*]] = phi i32 [ [[BC_MERGE_RDX]], [[SCALAR_PH]] ], [ [[T28]], [[T20]] ]
; CHECK-NEXT:    [[T23:%.*]] = phi i32 [ [[BC_MERGE_RDX15]], [[SCALAR_PH]] ], [ [[T24]], [[T20]] ]
; CHECK-NEXT:    [[T24]] = add i32 3, [[T23]]
; CHECK-NEXT:    [[T28]] = add i32 [[T22]], 5
; CHECK-NEXT:    [[T29]] = add nuw nsw i64 [[T21]], 1
; CHECK-NEXT:    [[T30:%.*]] = icmp eq i64 [[T29]], undef
; CHECK-NEXT:    br i1 [[T30]], label [[T17]], label [[T20]], !prof !4, [[LOOP5:!llvm.loop !.*]]
; CHECK:       t31:
; CHECK-NEXT:    ret i64 undef
;
; CHECK1-LABEL: @foo(
; CHECK1-NEXT:  t16:
; CHECK1-NEXT:    br i1 false, label [[SCALAR_PH:%.*]], label [[VECTOR_PH:%.*]]
; CHECK1:       vector.ph:
; CHECK1-NEXT:    [[BROADCAST_SPLATINSERT:%.*]] = insertelement <vscale x 2 x i64> undef, i64 undef, i32 0
; CHECK1-NEXT:    [[BROADCAST_SPLAT:%.*]] = shufflevector <vscale x 2 x i64> [[BROADCAST_SPLATINSERT]], <vscale x 2 x i64> undef, <vscale x 2 x i32> zeroinitializer
; CHECK1-NEXT:    [[BROADCAST_SPLATINSERT6:%.*]] = insertelement <vscale x 2 x i32> undef, i32 3, i32 0
; CHECK1-NEXT:    [[BROADCAST_SPLAT7:%.*]] = shufflevector <vscale x 2 x i32> [[BROADCAST_SPLATINSERT6]], <vscale x 2 x i32> undef, <vscale x 2 x i32> zeroinitializer
; CHECK1-NEXT:    [[BROADCAST_SPLATINSERT10:%.*]] = insertelement <vscale x 2 x i32> undef, i32 5, i32 0
; CHECK1-NEXT:    [[BROADCAST_SPLAT11:%.*]] = shufflevector <vscale x 2 x i32> [[BROADCAST_SPLATINSERT10]], <vscale x 2 x i32> undef, <vscale x 2 x i32> zeroinitializer
; CHECK1-NEXT:    [[TMP0:%.*]] = insertelement <vscale x 2 x i32> zeroinitializer, i32 0, i32 0
; CHECK1-NEXT:    [[TMP1:%.*]] = insertelement <vscale x 2 x i32> zeroinitializer, i32 0, i32 0
; CHECK1-NEXT:    br label [[VECTOR_BODY:%.*]]
; CHECK1:       vector.body:
; CHECK1-NEXT:    [[INDEX:%.*]] = phi i64 [ 0, [[VECTOR_PH]] ], [ [[INDEX_NEXT:%.*]], [[VECTOR_BODY]] ]
; CHECK1-NEXT:    [[VEC_PHI:%.*]] = phi <vscale x 2 x i32> [ [[TMP0]], [[VECTOR_PH]] ], [ [[TMP10:%.*]], [[VECTOR_BODY]] ]
; CHECK1-NEXT:    [[VEC_PHI5:%.*]] = phi <vscale x 2 x i32> [ [[TMP1]], [[VECTOR_PH]] ], [ [[TMP11:%.*]], [[VECTOR_BODY]] ]
; CHECK1-NEXT:    [[BROADCAST_SPLATINSERT1:%.*]] = insertelement <vscale x 2 x i64> undef, i64 [[INDEX]], i32 0
; CHECK1-NEXT:    [[BROADCAST_SPLAT2:%.*]] = shufflevector <vscale x 2 x i64> [[BROADCAST_SPLATINSERT1]], <vscale x 2 x i64> undef, <vscale x 2 x i32> zeroinitializer
; CHECK1-NEXT:    [[TMP2:%.*]] = call <vscale x 2 x i64> @llvm.experimental.vector.stepvector.nxv2i64()
; CHECK1-NEXT:    [[DOTSPLATINSERT:%.*]] = insertelement <vscale x 2 x i64> undef, i64 0, i32 0
; CHECK1-NEXT:    [[DOTSPLAT:%.*]] = shufflevector <vscale x 2 x i64> [[DOTSPLATINSERT]], <vscale x 2 x i64> undef, <vscale x 2 x i32> zeroinitializer
; CHECK1-NEXT:    [[TMP3:%.*]] = add <vscale x 2 x i64> [[TMP2]], [[DOTSPLAT]]
; CHECK1-NEXT:    [[DOTSPLATINSERT3:%.*]] = insertelement <vscale x 2 x i64> undef, i64 1, i32 0
; CHECK1-NEXT:    [[DOTSPLAT4:%.*]] = shufflevector <vscale x 2 x i64> [[DOTSPLATINSERT3]], <vscale x 2 x i64> undef, <vscale x 2 x i32> zeroinitializer
; CHECK1-NEXT:    [[TMP4:%.*]] = mul <vscale x 2 x i64> [[TMP3]], [[DOTSPLAT4]]
; CHECK1-NEXT:    [[INDUCTION:%.*]] = add <vscale x 2 x i64> [[BROADCAST_SPLAT2]], [[TMP4]]
; CHECK1-NEXT:    [[TMP5:%.*]] = add i64 [[INDEX]], 0
; CHECK1-NEXT:    [[TMP6:%.*]] = icmp ule <vscale x 2 x i64> [[INDUCTION]], [[BROADCAST_SPLAT]]
; CHECK1-NEXT:    [[TMP7:%.*]] = sub i64 undef, [[INDEX]]
; CHECK1-NEXT:    [[TMP8:%.*]] = call i64 @llvm.epi.vsetvl(i64 [[TMP7]], i64 2, i64 0)
; CHECK1-NEXT:    [[TMP9:%.*]] = trunc i64 [[TMP8]] to i32
; CHECK1-NEXT:    [[DOTSPLATINSERT8:%.*]] = insertelement <vscale x 2 x i1> undef, i1 true, i32 0
; CHECK1-NEXT:    [[DOTSPLAT9:%.*]] = shufflevector <vscale x 2 x i1> [[DOTSPLATINSERT8]], <vscale x 2 x i1> undef, <vscale x 2 x i32> zeroinitializer
; CHECK1-NEXT:    [[VP_OP:%.*]] = call <vscale x 2 x i32> @llvm.vp.add.nxv2i32(<vscale x 2 x i32> [[BROADCAST_SPLAT7]], <vscale x 2 x i32> [[VEC_PHI5]], <vscale x 2 x i1> [[DOTSPLAT9]], i32 [[TMP9]])
; CHECK1-NEXT:    [[VP_OP14:%.*]] = call <vscale x 2 x i32> @llvm.vp.add.nxv2i32(<vscale x 2 x i32> [[VEC_PHI]], <vscale x 2 x i32> [[BROADCAST_SPLAT11]], <vscale x 2 x i1> [[DOTSPLAT9]], i32 [[TMP9]])
; CHECK1-NEXT:    [[EVL_SPLATINSERT:%.*]] = insertelement <vscale x 2 x i32> undef, i32 [[TMP9]], i32 0
; CHECK1-NEXT:    [[EVL_SPLAT:%.*]] = shufflevector <vscale x 2 x i32> [[EVL_SPLATINSERT]], <vscale x 2 x i32> undef, <vscale x 2 x i32> zeroinitializer
; CHECK1-NEXT:    [[STEP_VEC:%.*]] = call <vscale x 2 x i32> @llvm.experimental.vector.stepvector.nxv2i32()
; CHECK1-NEXT:    [[EVL_MASK:%.*]] = icmp ult <vscale x 2 x i32> [[STEP_VEC]], [[EVL_SPLAT]]
; CHECK1-NEXT:    [[TMP10]] = select <vscale x 2 x i1> [[EVL_MASK]], <vscale x 2 x i32> [[VP_OP14]], <vscale x 2 x i32> [[VEC_PHI]]
; CHECK1-NEXT:    [[TMP11]] = select <vscale x 2 x i1> [[EVL_MASK]], <vscale x 2 x i32> [[VP_OP]], <vscale x 2 x i32> [[VEC_PHI5]]
; CHECK1-NEXT:    [[TMP12:%.*]] = zext i32 [[TMP9]] to i64
; CHECK1-NEXT:    [[INDEX_NEXT]] = add i64 [[INDEX]], [[TMP12]]
; CHECK1-NEXT:    [[TMP13:%.*]] = icmp eq i64 [[INDEX_NEXT]], undef
; CHECK1-NEXT:    br i1 [[TMP13]], label [[MIDDLE_BLOCK:%.*]], label [[VECTOR_BODY]], !prof !1, [[LOOP2:!llvm.loop !.*]]
; CHECK1:       middle.block:
; CHECK1-NEXT:    [[TMP14:%.*]] = call i32 @llvm.vector.reduce.add.nxv2i32(<vscale x 2 x i32> [[TMP11]])
; CHECK1-NEXT:    [[TMP15:%.*]] = call i32 @llvm.vector.reduce.add.nxv2i32(<vscale x 2 x i32> [[TMP10]])
; CHECK1-NEXT:    br i1 true, label [[T17:%.*]], label [[SCALAR_PH]]
; CHECK1:       scalar.ph:
; CHECK1-NEXT:    [[BC_RESUME_VAL:%.*]] = phi i64 [ undef, [[MIDDLE_BLOCK]] ], [ 0, [[T16:%.*]] ]
; CHECK1-NEXT:    [[BC_MERGE_RDX:%.*]] = phi i32 [ 0, [[T16]] ], [ [[TMP15]], [[MIDDLE_BLOCK]] ]
; CHECK1-NEXT:    [[BC_MERGE_RDX15:%.*]] = phi i32 [ 0, [[T16]] ], [ [[TMP14]], [[MIDDLE_BLOCK]] ]
; CHECK1-NEXT:    br label [[T20:%.*]]
; CHECK1:       t17:
; CHECK1-NEXT:    [[T18:%.*]] = phi i32 [ [[T24:%.*]], [[T20]] ], [ [[TMP14]], [[MIDDLE_BLOCK]] ]
; CHECK1-NEXT:    [[T19:%.*]] = phi i32 [ [[T28:%.*]], [[T20]] ], [ [[TMP15]], [[MIDDLE_BLOCK]] ]
; CHECK1-NEXT:    br label [[T31:%.*]]
; CHECK1:       t20:
; CHECK1-NEXT:    [[T21:%.*]] = phi i64 [ [[BC_RESUME_VAL]], [[SCALAR_PH]] ], [ [[T29:%.*]], [[T20]] ]
; CHECK1-NEXT:    [[T22:%.*]] = phi i32 [ [[BC_MERGE_RDX]], [[SCALAR_PH]] ], [ [[T28]], [[T20]] ]
; CHECK1-NEXT:    [[T23:%.*]] = phi i32 [ [[BC_MERGE_RDX15]], [[SCALAR_PH]] ], [ [[T24]], [[T20]] ]
; CHECK1-NEXT:    [[T24]] = add i32 3, [[T23]]
; CHECK1-NEXT:    [[T28]] = add i32 [[T22]], 5
; CHECK1-NEXT:    [[T29]] = add nuw nsw i64 [[T21]], 1
; CHECK1-NEXT:    [[T30:%.*]] = icmp eq i64 [[T29]], undef
; CHECK1-NEXT:    br i1 [[T30]], label [[T17]], label [[T20]], !prof !4, [[LOOP5:!llvm.loop !.*]]
; CHECK1:       t31:
; CHECK1-NEXT:    ret i64 undef
;
t16:
  br label %t20

t17:                                               ; preds = %t20
  %t18 = phi i32 [ %t24, %t20 ]
  %t19 = phi i32 [ %t28, %t20 ]
  br label %t31

t20:                                               ; preds = %t20, %t16
  %t21 = phi i64 [ 0, %t16 ], [ %t29, %t20 ]
  %t22 = phi i32 [ 0, %t16 ], [ %t28, %t20 ]
  %t23 = phi i32 [ 0, %t16 ], [ %t24, %t20 ]
  %t24 = add i32 3, %t23
  %t28 = add i32 %t22, 5
  %t29 = add nuw nsw i64 %t21, 1
  %t30 = icmp eq i64 %t29, undef
  br i1 %t30, label %t17, label %t20, !prof !2

t31:
  ret i64 undef
}

!1 = !{!"function_entry_count", i64 801}
!2 = !{!"branch_weights", i32 746, i32 1}
