; NOTE: Assertions have been autogenerated by utils/update_llc_test_checks.py
; RUN: llc -mtriple=riscv64 -mattr=+d,+f,+experimental-v -verify-machineinstrs \
; RUN:    < %s | FileCheck %s

define <vscale x 2 x float> @trunc_nxv2f32(<vscale x 2 x float> %x) {
; CHECK-LABEL: trunc_nxv2f32:
; CHECK:       # %bb.0:
; CHECK-NEXT:    lui a0, %hi(.LCPI0_0)
; CHECK-NEXT:    flw ft0, %lo(.LCPI0_0)(a0)
; CHECK-NEXT:    vsetvli zero, zero, e32,m1
; CHECK-NEXT:    vfsgnjx.vv v1, v16, v16
; CHECK-NEXT:    vmflt.vf v0, v1, ft0
; CHECK-NEXT:    vfcvt.x.f.v v1, v16
; CHECK-NEXT:    vfcvt.f.x.v v1, v1
; CHECK-NEXT:    vfsgnj.vv v1, v1, v16
; CHECK-NEXT:    vmerge.vvm v16, v16, v1, v0
; CHECK-NEXT:    ret
  %a = call <vscale x 2 x float> @llvm.trunc.nxv2f32(<vscale x 2 x float> %x)
  ret <vscale x 2 x float> %a
}
declare <vscale x 2 x float> @llvm.trunc.nxv2f32(<vscale x 2 x float>)

define <vscale x 4 x float> @trunc_nxv4f32(<vscale x 4 x float> %x) {
; CHECK-LABEL: trunc_nxv4f32:
; CHECK:       # %bb.0:
; CHECK-NEXT:    lui a0, %hi(.LCPI1_0)
; CHECK-NEXT:    flw ft0, %lo(.LCPI1_0)(a0)
; CHECK-NEXT:    vsetvli zero, zero, e32,m2
; CHECK-NEXT:    vfsgnjx.vv v2, v16, v16
; CHECK-NEXT:    vmflt.vf v0, v2, ft0
; CHECK-NEXT:    vfcvt.x.f.v v2, v16
; CHECK-NEXT:    vfcvt.f.x.v v2, v2
; CHECK-NEXT:    vfsgnj.vv v2, v2, v16
; CHECK-NEXT:    vmerge.vvm v16, v16, v2, v0
; CHECK-NEXT:    ret
  %a = call <vscale x 4 x float> @llvm.trunc.nxv4f32(<vscale x 4 x float> %x)
  ret <vscale x 4 x float> %a
}
declare <vscale x 4 x float> @llvm.trunc.nxv4f32(<vscale x 4 x float>)

define <vscale x 8 x float> @trunc_nxv8f32(<vscale x 8 x float> %x) {
; CHECK-LABEL: trunc_nxv8f32:
; CHECK:       # %bb.0:
; CHECK-NEXT:    lui a0, %hi(.LCPI2_0)
; CHECK-NEXT:    flw ft0, %lo(.LCPI2_0)(a0)
; CHECK-NEXT:    vsetvli zero, zero, e32,m4
; CHECK-NEXT:    vfsgnjx.vv v4, v16, v16
; CHECK-NEXT:    vmflt.vf v0, v4, ft0
; CHECK-NEXT:    vfcvt.x.f.v v4, v16
; CHECK-NEXT:    vfcvt.f.x.v v4, v4
; CHECK-NEXT:    vfsgnj.vv v4, v4, v16
; CHECK-NEXT:    vmerge.vvm v16, v16, v4, v0
; CHECK-NEXT:    ret
  %a = call <vscale x 8 x float> @llvm.trunc.nxv8f32(<vscale x 8 x float> %x)
  ret <vscale x 8 x float> %a
}
declare <vscale x 8 x float> @llvm.trunc.nxv8f32(<vscale x 8 x float>)

define <vscale x 16 x float> @trunc_nxv16f32(<vscale x 16 x float> %x) {
; CHECK-LABEL: trunc_nxv16f32:
; CHECK:       # %bb.0:
; CHECK-NEXT:    lui a0, %hi(.LCPI3_0)
; CHECK-NEXT:    flw ft0, %lo(.LCPI3_0)(a0)
; CHECK-NEXT:    vsetvli zero, zero, e32,m8
; CHECK-NEXT:    vfsgnjx.vv v8, v16, v16
; CHECK-NEXT:    vmflt.vf v0, v8, ft0
; CHECK-NEXT:    vfcvt.x.f.v v8, v16
; CHECK-NEXT:    vfcvt.f.x.v v8, v8
; CHECK-NEXT:    vfsgnj.vv v8, v8, v16
; CHECK-NEXT:    vmerge.vvm v16, v16, v8, v0
; CHECK-NEXT:    ret
  %a = call <vscale x 16 x float> @llvm.trunc.nxv16f32(<vscale x 16 x float> %x)
  ret <vscale x 16 x float> %a
}
declare <vscale x 16 x float> @llvm.trunc.nxv16f32(<vscale x 16 x float>)

define <vscale x 1 x double> @trunc_nxv1f64(<vscale x 1 x double> %x) {
; CHECK-LABEL: trunc_nxv1f64:
; CHECK:       # %bb.0:
; CHECK-NEXT:    lui a0, %hi(.LCPI4_0)
; CHECK-NEXT:    fld ft0, %lo(.LCPI4_0)(a0)
; CHECK-NEXT:    vsetvli zero, zero, e64,m1
; CHECK-NEXT:    vfsgnjx.vv v1, v16, v16
; CHECK-NEXT:    vmflt.vf v0, v1, ft0
; CHECK-NEXT:    vfcvt.x.f.v v1, v16
; CHECK-NEXT:    vfcvt.f.x.v v1, v1
; CHECK-NEXT:    vfsgnj.vv v1, v1, v16
; CHECK-NEXT:    vmerge.vvm v16, v16, v1, v0
; CHECK-NEXT:    ret
  %a = call <vscale x 1 x double> @llvm.trunc.nxv1f64(<vscale x 1 x double> %x)
  ret <vscale x 1 x double> %a
}
declare <vscale x 1 x double> @llvm.trunc.nxv1f64(<vscale x 1 x double>)

define <vscale x 2 x double> @trunc_nxv2f64(<vscale x 2 x double> %x) {
; CHECK-LABEL: trunc_nxv2f64:
; CHECK:       # %bb.0:
; CHECK-NEXT:    lui a0, %hi(.LCPI5_0)
; CHECK-NEXT:    fld ft0, %lo(.LCPI5_0)(a0)
; CHECK-NEXT:    vsetvli zero, zero, e64,m2
; CHECK-NEXT:    vfsgnjx.vv v2, v16, v16
; CHECK-NEXT:    vmflt.vf v0, v2, ft0
; CHECK-NEXT:    vfcvt.x.f.v v2, v16
; CHECK-NEXT:    vfcvt.f.x.v v2, v2
; CHECK-NEXT:    vfsgnj.vv v2, v2, v16
; CHECK-NEXT:    vmerge.vvm v16, v16, v2, v0
; CHECK-NEXT:    ret
  %a = call <vscale x 2 x double> @llvm.trunc.nxv2f64(<vscale x 2 x double> %x)
  ret <vscale x 2 x double> %a
}
declare <vscale x 2 x double> @llvm.trunc.nxv2f64(<vscale x 2 x double>)

define <vscale x 4 x double> @trunc_nxv4f64(<vscale x 4 x double> %x) {
; CHECK-LABEL: trunc_nxv4f64:
; CHECK:       # %bb.0:
; CHECK-NEXT:    lui a0, %hi(.LCPI6_0)
; CHECK-NEXT:    fld ft0, %lo(.LCPI6_0)(a0)
; CHECK-NEXT:    vsetvli zero, zero, e64,m4
; CHECK-NEXT:    vfsgnjx.vv v4, v16, v16
; CHECK-NEXT:    vmflt.vf v0, v4, ft0
; CHECK-NEXT:    vfcvt.x.f.v v4, v16
; CHECK-NEXT:    vfcvt.f.x.v v4, v4
; CHECK-NEXT:    vfsgnj.vv v4, v4, v16
; CHECK-NEXT:    vmerge.vvm v16, v16, v4, v0
; CHECK-NEXT:    ret
  %a = call <vscale x 4 x double> @llvm.trunc.nxv4f64(<vscale x 4 x double> %x)
  ret <vscale x 4 x double> %a
}
declare <vscale x 4 x double> @llvm.trunc.nxv4f64(<vscale x 4 x double>)

define <vscale x 8 x double> @trunc_nxv8f64(<vscale x 8 x double> %x) {
; CHECK-LABEL: trunc_nxv8f64:
; CHECK:       # %bb.0:
; CHECK-NEXT:    lui a0, %hi(.LCPI7_0)
; CHECK-NEXT:    fld ft0, %lo(.LCPI7_0)(a0)
; CHECK-NEXT:    vsetvli zero, zero, e64,m8
; CHECK-NEXT:    vfsgnjx.vv v8, v16, v16
; CHECK-NEXT:    vmflt.vf v0, v8, ft0
; CHECK-NEXT:    vfcvt.x.f.v v8, v16
; CHECK-NEXT:    vfcvt.f.x.v v8, v8
; CHECK-NEXT:    vfsgnj.vv v8, v8, v16
; CHECK-NEXT:    vmerge.vvm v16, v16, v8, v0
; CHECK-NEXT:    ret
  %a = call <vscale x 8 x double> @llvm.trunc.nxv8f64(<vscale x 8 x double> %x)
  ret <vscale x 8 x double> %a
}
declare <vscale x 8 x double> @llvm.trunc.nxv8f64(<vscale x 8 x double>)
