; NOTE: Assertions have been autogenerated by utils/update_test_checks.py
; RUN: opt -mtriple riscv64 -mattr +m,+a,+f,+d,+experimental-v \
; RUN:    -prefer-predicate-over-epilogue=predicate-dont-vectorize -S -O2 \
; RUN:    < %s -o - | FileCheck %s

define dso_local void @vec_nearbyint(i64 %n, double* noalias nocapture %a, double* noalias nocapture readonly %b, double* noalias nocapture readnone %c) {
; CHECK-LABEL: @vec_nearbyint(
; CHECK-NEXT:  entry:
; CHECK-NEXT:    [[CMP6:%.*]] = icmp sgt i64 [[N:%.*]], 0
; CHECK-NEXT:    br i1 [[CMP6]], label [[FOR_BODY:%.*]], label [[FOR_COND_CLEANUP:%.*]]
; CHECK:       for.cond.cleanup:
; CHECK-NEXT:    ret void
; CHECK:       for.body:
; CHECK-NEXT:    [[I_07:%.*]] = phi i64 [ [[INC:%.*]], [[FOR_BODY]] ], [ 0, [[ENTRY:%.*]] ]
; CHECK-NEXT:    [[ARRAYIDX:%.*]] = getelementptr inbounds double, double* [[B:%.*]], i64 [[I_07]]
; CHECK-NEXT:    [[TMP0:%.*]] = load double, double* [[ARRAYIDX]], align 8
; CHECK-NEXT:    [[TMP1:%.*]] = tail call double @llvm.nearbyint.f64(double [[TMP0]])
; CHECK-NEXT:    [[ARRAYIDX1:%.*]] = getelementptr inbounds double, double* [[A:%.*]], i64 [[I_07]]
; CHECK-NEXT:    store double [[TMP1]], double* [[ARRAYIDX1]], align 8
; CHECK-NEXT:    [[INC]] = add nuw nsw i64 [[I_07]], 1
; CHECK-NEXT:    [[EXITCOND_NOT:%.*]] = icmp eq i64 [[INC]], [[N]]
; CHECK-NEXT:    br i1 [[EXITCOND_NOT]], label [[FOR_COND_CLEANUP]], label [[FOR_BODY]]
;
entry:
  %cmp6 = icmp sgt i64 %n, 0
  br i1 %cmp6, label %for.body.preheader, label %for.cond.cleanup

for.body.preheader:                               ; preds = %entry
  br label %for.body

for.cond.cleanup.loopexit:                        ; preds = %for.body
  br label %for.cond.cleanup

for.cond.cleanup:                                 ; preds = %for.cond.cleanup.loopexit, %entry
  ret void

for.body:                                         ; preds = %for.body.preheader, %for.body
  %i.07 = phi i64 [ %inc, %for.body ], [ 0, %for.body.preheader ]
  %arrayidx = getelementptr inbounds double, double* %b, i64 %i.07
  %0 = load double, double* %arrayidx, align 8
  %1 = tail call double @llvm.nearbyint.f64(double %0)
  %arrayidx1 = getelementptr inbounds double, double* %a, i64 %i.07
  store double %1, double* %arrayidx1, align 8
  %inc = add nuw nsw i64 %i.07, 1
  %exitcond.not = icmp eq i64 %inc, %n
  br i1 %exitcond.not, label %for.cond.cleanup.loopexit, label %for.body
}

declare double @llvm.nearbyint.f64(double) #1

