; NOTE: Assertions have been autogenerated by utils/update_llc_test_checks.py
; RUN: llc -mtriple=riscv64 -mattr=+m,+f,+d,+a,+c,+experimental-v,+only-lmul1 \
; RUN:    -target-abi lp64d -verify-machineinstrs < %s | FileCheck %s

define <vscale x 1 x i1> @insert_nxv16f32(<vscale x 1 x i1> %merge, i1 %e, i64 %idx) {
; CHECK-LABEL: insert_nxv16f32:
; CHECK:       # %bb.0:
; CHECK-NEXT:    vsetvli zero, zero, e64,m1
; CHECK-NEXT:    vid.v v1
; CHECK-NEXT:    vmseq.vx v1, v1, a1
; CHECK-NEXT:    vmcpy.m v2, v0
; CHECK-NEXT:    rdvtype t0
; CHECK-NEXT:    rdvl t1
; CHECK-NEXT:    vsetvli zero, zero, e64,m1
; CHECK-NEXT:    vmv.v.v v0, v1
; CHECK-NEXT:    vsetvl zero, t1, t0
; CHECK-NEXT:    vmerge.vxm v0, v2, a0, v0
; CHECK-NEXT:    ret
  %v = insertelement <vscale x 1 x i1> %merge, i1 %e, i64 %idx
  ret <vscale x 1 x i1> %v
}

