; NOTE: Assertions have been autogenerated by utils/update_llc_test_checks.py
; RUN: llc -mtriple=riscv64 -mattr=+m,+f,+d,+experimental-v -verify-machineinstrs \
; RUN:    < %s | FileCheck --check-prefix=FOLD %s
; RUN: llc -mtriple=riscv64 -mattr=+m,+f,+d,+experimental-v -verify-machineinstrs \
; RUN:    -riscv-enable-commuting-fma < %s | FileCheck --check-prefix=FOLD-COMMUTE %s

; ModuleID = 't.c'
source_filename = "t.c"
target datalayout = "e-m:e-p:64:64-i64:64-i128:128-n64-S128-v128:128:128-v256:128:128-v512:128:128-v1024:128:128"
target triple = "riscv64-unknown-linux-gnu"

; Function Attrs: nofree norecurse nounwind
define dso_local void @vfmsub_vfmsac(double* noalias nocapture %dw, double* noalias nocapture readonly %dz, double* noalias nocapture readonly %dx, double* noalias nocapture readonly %dy, i32 signext %n) local_unnamed_addr #0 {
; FOLD-LABEL: vfmsub_vfmsac:
; FOLD:       # %bb.0: # %entry
; FOLD-NEXT:    addi a5, zero, 1
; FOLD-NEXT:    blt a4, a5, .LBB0_3
; FOLD-NEXT:  # %bb.1: # %for.body.preheader
; FOLD-NEXT:    mv a5, zero
; FOLD-NEXT:    slli a4, a4, 32
; FOLD-NEXT:    srli a6, a4, 32
; FOLD-NEXT:  .LBB0_2: # %vector.body
; FOLD-NEXT:    # =>This Inner Loop Header: Depth=1
; FOLD-NEXT:    slli t0, a5, 3
; FOLD-NEXT:    add a7, a1, t0
; FOLD-NEXT:    sub a4, a6, a5
; FOLD-NEXT:    vsetvli t1, a4, e64,m1
; FOLD-NEXT:    vle.v v1, (a7)
; FOLD-NEXT:    add a4, a2, t0
; FOLD-NEXT:    vle.v v2, (a4)
; FOLD-NEXT:    add a4, a3, t0
; FOLD-NEXT:    vle.v v3, (a4)
; FOLD-NEXT:    vfmsac.vv v3, v1, v2
; FOLD-NEXT:    add a7, a0, t0
; FOLD-NEXT:    slli a4, t1, 32
; FOLD-NEXT:    srli a4, a4, 32
; FOLD-NEXT:    add a5, a5, a4
; FOLD-NEXT:    vse.v v3, (a7)
; FOLD-NEXT:    bne a5, a6, .LBB0_2
; FOLD-NEXT:  .LBB0_3: # %for.end
; FOLD-NEXT:    ret
;
; FOLD-COMMUTE-LABEL: vfmsub_vfmsac:
; FOLD-COMMUTE:       # %bb.0: # %entry
; FOLD-COMMUTE-NEXT:    addi a5, zero, 1
; FOLD-COMMUTE-NEXT:    blt a4, a5, .LBB0_3
; FOLD-COMMUTE-NEXT:  # %bb.1: # %for.body.preheader
; FOLD-COMMUTE-NEXT:    mv a5, zero
; FOLD-COMMUTE-NEXT:    slli a4, a4, 32
; FOLD-COMMUTE-NEXT:    srli a6, a4, 32
; FOLD-COMMUTE-NEXT:  .LBB0_2: # %vector.body
; FOLD-COMMUTE-NEXT:    # =>This Inner Loop Header: Depth=1
; FOLD-COMMUTE-NEXT:    slli t0, a5, 3
; FOLD-COMMUTE-NEXT:    add a7, a1, t0
; FOLD-COMMUTE-NEXT:    sub a4, a6, a5
; FOLD-COMMUTE-NEXT:    vsetvli t1, a4, e64,m1
; FOLD-COMMUTE-NEXT:    vle.v v1, (a7)
; FOLD-COMMUTE-NEXT:    add a4, a2, t0
; FOLD-COMMUTE-NEXT:    vle.v v2, (a4)
; FOLD-COMMUTE-NEXT:    add a4, a3, t0
; FOLD-COMMUTE-NEXT:    vle.v v3, (a4)
; FOLD-COMMUTE-NEXT:    vfmsac.vv v3, v1, v2
; FOLD-COMMUTE-NEXT:    add a7, a0, t0
; FOLD-COMMUTE-NEXT:    slli a4, t1, 32
; FOLD-COMMUTE-NEXT:    srli a4, a4, 32
; FOLD-COMMUTE-NEXT:    add a5, a5, a4
; FOLD-COMMUTE-NEXT:    vse.v v3, (a7)
; FOLD-COMMUTE-NEXT:    bne a5, a6, .LBB0_2
; FOLD-COMMUTE-NEXT:  .LBB0_3: # %for.end
; FOLD-COMMUTE-NEXT:    ret
entry:
  %cmp13 = icmp sgt i32 %n, 0
  br i1 %cmp13, label %for.body.preheader, label %for.end

for.body.preheader:                               ; preds = %entry
  %wide.trip.count = zext i32 %n to i64
  br label %vector.body

vector.body:                                      ; preds = %vector.body, %for.body.preheader
  %index = phi i64 [ 0, %for.body.preheader ], [ %index.next, %vector.body ]
  %0 = getelementptr inbounds double, double* %dz, i64 %index
  %1 = sub i64 %wide.trip.count, %index
  %2 = call i64 @llvm.epi.vsetvl(i64 %1, i64 3, i64 0)
  %3 = trunc i64 %2 to i32
  %4 = bitcast double* %0 to <vscale x 1 x double>*
  %vp.op.load = call <vscale x 1 x double> @llvm.vp.load.nxv1f64.p0nxv1f64(<vscale x 1 x double>* %4, i32 8, <vscale x 1 x i1> shufflevector (<vscale x 1 x i1> insertelement (<vscale x 1 x i1> undef, i1 true, i32 0), <vscale x 1 x i1> undef, <vscale x 1 x i32> zeroinitializer), i32 %3), !tbaa !4
  %5 = getelementptr inbounds double, double* %dx, i64 %index
  %6 = bitcast double* %5 to <vscale x 1 x double>*
  %vp.op.load23 = call <vscale x 1 x double> @llvm.vp.load.nxv1f64.p0nxv1f64(<vscale x 1 x double>* %6, i32 8, <vscale x 1 x i1> shufflevector (<vscale x 1 x i1> insertelement (<vscale x 1 x i1> undef, i1 true, i32 0), <vscale x 1 x i1> undef, <vscale x 1 x i32> zeroinitializer), i32 %3), !tbaa !4
  %vp.op = call fast <vscale x 1 x double> @llvm.vp.fmul.nxv1f64(<vscale x 1 x double> %vp.op.load23, <vscale x 1 x double> %vp.op.load, metadata !"round.tonearest", metadata !"fpexcept.ignore", <vscale x 1 x i1> shufflevector (<vscale x 1 x i1> insertelement (<vscale x 1 x i1> undef, i1 true, i32 0), <vscale x 1 x i1> undef, <vscale x 1 x i32> zeroinitializer), i32 %3)
  %7 = getelementptr inbounds double, double* %dy, i64 %index
  %8 = bitcast double* %7 to <vscale x 1 x double>*
  %vp.op.load28 = call <vscale x 1 x double> @llvm.vp.load.nxv1f64.p0nxv1f64(<vscale x 1 x double>* %8, i32 8, <vscale x 1 x i1> shufflevector (<vscale x 1 x i1> insertelement (<vscale x 1 x i1> undef, i1 true, i32 0), <vscale x 1 x i1> undef, <vscale x 1 x i32> zeroinitializer), i32 %3), !tbaa !4
  %vp.op31 = call fast <vscale x 1 x double> @llvm.vp.fsub.nxv1f64(<vscale x 1 x double> %vp.op, <vscale x 1 x double> %vp.op.load28, metadata !"round.tonearest", metadata !"fpexcept.ignore", <vscale x 1 x i1> shufflevector (<vscale x 1 x i1> insertelement (<vscale x 1 x i1> undef, i1 true, i32 0), <vscale x 1 x i1> undef, <vscale x 1 x i32> zeroinitializer), i32 %3)
  %9 = getelementptr inbounds double, double* %dw, i64 %index
  %10 = bitcast double* %9 to <vscale x 1 x double>*
  call void @llvm.vp.store.nxv1f64.p0nxv1f64(<vscale x 1 x double> %vp.op31, <vscale x 1 x double>* %10, i32 8, <vscale x 1 x i1> shufflevector (<vscale x 1 x i1> insertelement (<vscale x 1 x i1> undef, i1 true, i32 0), <vscale x 1 x i1> undef, <vscale x 1 x i32> zeroinitializer), i32 %3), !tbaa !4
  %11 = and i64 %2, 4294967295
  %index.next = add i64 %index, %11
  %12 = icmp eq i64 %index.next, %wide.trip.count
  br i1 %12, label %for.end, label %vector.body, !llvm.loop !8

for.end:                                          ; preds = %vector.body, %entry
  ret void
}

; Function Attrs: nofree norecurse nounwind
define dso_local void @vfnmadd(double* noalias nocapture %dw, double* noalias nocapture readonly %dz, double* noalias nocapture readonly %dx, double* noalias nocapture readonly %dy, i32 signext %n) local_unnamed_addr #0 {
; FOLD-LABEL: vfnmadd:
; FOLD:       # %bb.0: # %entry
; FOLD-NEXT:    addi a5, zero, 1
; FOLD-NEXT:    blt a4, a5, .LBB1_3
; FOLD-NEXT:  # %bb.1: # %for.body.preheader
; FOLD-NEXT:    mv a5, zero
; FOLD-NEXT:    slli a4, a4, 32
; FOLD-NEXT:    srli a6, a4, 32
; FOLD-NEXT:  .LBB1_2: # %vector.body
; FOLD-NEXT:    # =>This Inner Loop Header: Depth=1
; FOLD-NEXT:    slli t0, a5, 3
; FOLD-NEXT:    add a7, a1, t0
; FOLD-NEXT:    sub a4, a6, a5
; FOLD-NEXT:    vsetvli t1, a4, e64,m1
; FOLD-NEXT:    vle.v v1, (a7)
; FOLD-NEXT:    add a4, a2, t0
; FOLD-NEXT:    vle.v v2, (a4)
; FOLD-NEXT:    add a4, a3, t0
; FOLD-NEXT:    vle.v v3, (a4)
; FOLD-NEXT:    vfnmacc.vv v3, v1, v2
; FOLD-NEXT:    add a7, a0, t0
; FOLD-NEXT:    slli a4, t1, 32
; FOLD-NEXT:    srli a4, a4, 32
; FOLD-NEXT:    add a5, a5, a4
; FOLD-NEXT:    vse.v v3, (a7)
; FOLD-NEXT:    bne a5, a6, .LBB1_2
; FOLD-NEXT:  .LBB1_3: # %for.end
; FOLD-NEXT:    ret
;
; FOLD-COMMUTE-LABEL: vfnmadd:
; FOLD-COMMUTE:       # %bb.0: # %entry
; FOLD-COMMUTE-NEXT:    addi a5, zero, 1
; FOLD-COMMUTE-NEXT:    blt a4, a5, .LBB1_3
; FOLD-COMMUTE-NEXT:  # %bb.1: # %for.body.preheader
; FOLD-COMMUTE-NEXT:    mv a5, zero
; FOLD-COMMUTE-NEXT:    slli a4, a4, 32
; FOLD-COMMUTE-NEXT:    srli a6, a4, 32
; FOLD-COMMUTE-NEXT:  .LBB1_2: # %vector.body
; FOLD-COMMUTE-NEXT:    # =>This Inner Loop Header: Depth=1
; FOLD-COMMUTE-NEXT:    slli t0, a5, 3
; FOLD-COMMUTE-NEXT:    add a7, a1, t0
; FOLD-COMMUTE-NEXT:    sub a4, a6, a5
; FOLD-COMMUTE-NEXT:    vsetvli t1, a4, e64,m1
; FOLD-COMMUTE-NEXT:    vle.v v1, (a7)
; FOLD-COMMUTE-NEXT:    add a4, a2, t0
; FOLD-COMMUTE-NEXT:    vle.v v2, (a4)
; FOLD-COMMUTE-NEXT:    add a4, a3, t0
; FOLD-COMMUTE-NEXT:    vle.v v3, (a4)
; FOLD-COMMUTE-NEXT:    vfnmacc.vv v3, v1, v2
; FOLD-COMMUTE-NEXT:    add a7, a0, t0
; FOLD-COMMUTE-NEXT:    slli a4, t1, 32
; FOLD-COMMUTE-NEXT:    srli a4, a4, 32
; FOLD-COMMUTE-NEXT:    add a5, a5, a4
; FOLD-COMMUTE-NEXT:    vse.v v3, (a7)
; FOLD-COMMUTE-NEXT:    bne a5, a6, .LBB1_2
; FOLD-COMMUTE-NEXT:  .LBB1_3: # %for.end
; FOLD-COMMUTE-NEXT:    ret
entry:
  %cmp13 = icmp sgt i32 %n, 0
  br i1 %cmp13, label %for.body.preheader, label %for.end

for.body.preheader:                               ; preds = %entry
  %wide.trip.count = zext i32 %n to i64
  br label %vector.body

vector.body:                                      ; preds = %vector.body, %for.body.preheader
  %index = phi i64 [ 0, %for.body.preheader ], [ %index.next, %vector.body ]
  %0 = getelementptr inbounds double, double* %dz, i64 %index
  %1 = sub i64 %wide.trip.count, %index
  %2 = call i64 @llvm.epi.vsetvl(i64 %1, i64 3, i64 0)
  %3 = trunc i64 %2 to i32
  %4 = bitcast double* %0 to <vscale x 1 x double>*
  %vp.op.load = call <vscale x 1 x double> @llvm.vp.load.nxv1f64.p0nxv1f64(<vscale x 1 x double>* %4, i32 8, <vscale x 1 x i1> shufflevector (<vscale x 1 x i1> insertelement (<vscale x 1 x i1> undef, i1 true, i32 0), <vscale x 1 x i1> undef, <vscale x 1 x i32> zeroinitializer), i32 %3), !tbaa !4
  %5 = getelementptr inbounds double, double* %dx, i64 %index
  %6 = bitcast double* %5 to <vscale x 1 x double>*
  %vp.op.load23 = call <vscale x 1 x double> @llvm.vp.load.nxv1f64.p0nxv1f64(<vscale x 1 x double>* %6, i32 8, <vscale x 1 x i1> shufflevector (<vscale x 1 x i1> insertelement (<vscale x 1 x i1> undef, i1 true, i32 0), <vscale x 1 x i1> undef, <vscale x 1 x i32> zeroinitializer), i32 %3), !tbaa !4
  %vp.op = call fast <vscale x 1 x double> @llvm.vp.fneg.nxv1f64(<vscale x 1 x double> %vp.op.load, metadata !"fpexcept.ignore", <vscale x 1 x i1> shufflevector (<vscale x 1 x i1> insertelement (<vscale x 1 x i1> undef, i1 true, i32 0), <vscale x 1 x i1> undef, <vscale x 1 x i32> zeroinitializer), i32 %3)
  %vp.op28 = call fast <vscale x 1 x double> @llvm.vp.fmul.nxv1f64(<vscale x 1 x double> %vp.op.load23, <vscale x 1 x double> %vp.op, metadata !"round.tonearest", metadata !"fpexcept.ignore", <vscale x 1 x i1> shufflevector (<vscale x 1 x i1> insertelement (<vscale x 1 x i1> undef, i1 true, i32 0), <vscale x 1 x i1> undef, <vscale x 1 x i32> zeroinitializer), i32 %3)
  %7 = getelementptr inbounds double, double* %dy, i64 %index
  %8 = bitcast double* %7 to <vscale x 1 x double>*
  %vp.op.load31 = call <vscale x 1 x double> @llvm.vp.load.nxv1f64.p0nxv1f64(<vscale x 1 x double>* %8, i32 8, <vscale x 1 x i1> shufflevector (<vscale x 1 x i1> insertelement (<vscale x 1 x i1> undef, i1 true, i32 0), <vscale x 1 x i1> undef, <vscale x 1 x i32> zeroinitializer), i32 %3), !tbaa !4
  %vp.op34 = call fast <vscale x 1 x double> @llvm.vp.fsub.nxv1f64(<vscale x 1 x double> %vp.op28, <vscale x 1 x double> %vp.op.load31, metadata !"round.tonearest", metadata !"fpexcept.ignore", <vscale x 1 x i1> shufflevector (<vscale x 1 x i1> insertelement (<vscale x 1 x i1> undef, i1 true, i32 0), <vscale x 1 x i1> undef, <vscale x 1 x i32> zeroinitializer), i32 %3)
  %9 = getelementptr inbounds double, double* %dw, i64 %index
  %10 = bitcast double* %9 to <vscale x 1 x double>*
  call void @llvm.vp.store.nxv1f64.p0nxv1f64(<vscale x 1 x double> %vp.op34, <vscale x 1 x double>* %10, i32 8, <vscale x 1 x i1> shufflevector (<vscale x 1 x i1> insertelement (<vscale x 1 x i1> undef, i1 true, i32 0), <vscale x 1 x i1> undef, <vscale x 1 x i32> zeroinitializer), i32 %3), !tbaa !4
  %11 = and i64 %2, 4294967295
  %index.next = add i64 %index, %11
  %12 = icmp eq i64 %index.next, %wide.trip.count
  br i1 %12, label %for.end, label %vector.body, !llvm.loop !11

for.end:                                          ; preds = %vector.body, %entry
  ret void
}

; Function Attrs: nofree norecurse nounwind
define dso_local void @vfnmsub(double* noalias nocapture %dw, double* noalias nocapture readonly %dz, double* noalias nocapture readonly %dx, double* noalias nocapture readonly %dy, i32 signext %n) local_unnamed_addr #0 {
; FOLD-LABEL: vfnmsub:
; FOLD:       # %bb.0: # %entry
; FOLD-NEXT:    addi a5, zero, 1
; FOLD-NEXT:    blt a4, a5, .LBB2_3
; FOLD-NEXT:  # %bb.1: # %for.body.preheader
; FOLD-NEXT:    mv a5, zero
; FOLD-NEXT:    slli a4, a4, 32
; FOLD-NEXT:    srli a6, a4, 32
; FOLD-NEXT:  .LBB2_2: # %vector.body
; FOLD-NEXT:    # =>This Inner Loop Header: Depth=1
; FOLD-NEXT:    slli t0, a5, 3
; FOLD-NEXT:    add a7, a1, t0
; FOLD-NEXT:    sub a4, a6, a5
; FOLD-NEXT:    vsetvli t1, a4, e64,m1
; FOLD-NEXT:    vle.v v1, (a7)
; FOLD-NEXT:    add a4, a2, t0
; FOLD-NEXT:    vle.v v2, (a4)
; FOLD-NEXT:    add a4, a3, t0
; FOLD-NEXT:    vle.v v3, (a4)
; FOLD-NEXT:    vfnmsac.vv v3, v1, v2
; FOLD-NEXT:    add a7, a0, t0
; FOLD-NEXT:    slli a4, t1, 32
; FOLD-NEXT:    srli a4, a4, 32
; FOLD-NEXT:    add a5, a5, a4
; FOLD-NEXT:    vse.v v3, (a7)
; FOLD-NEXT:    bne a5, a6, .LBB2_2
; FOLD-NEXT:  .LBB2_3: # %for.end
; FOLD-NEXT:    ret
;
; FOLD-COMMUTE-LABEL: vfnmsub:
; FOLD-COMMUTE:       # %bb.0: # %entry
; FOLD-COMMUTE-NEXT:    addi a5, zero, 1
; FOLD-COMMUTE-NEXT:    blt a4, a5, .LBB2_3
; FOLD-COMMUTE-NEXT:  # %bb.1: # %for.body.preheader
; FOLD-COMMUTE-NEXT:    mv a5, zero
; FOLD-COMMUTE-NEXT:    slli a4, a4, 32
; FOLD-COMMUTE-NEXT:    srli a6, a4, 32
; FOLD-COMMUTE-NEXT:  .LBB2_2: # %vector.body
; FOLD-COMMUTE-NEXT:    # =>This Inner Loop Header: Depth=1
; FOLD-COMMUTE-NEXT:    slli t0, a5, 3
; FOLD-COMMUTE-NEXT:    add a7, a1, t0
; FOLD-COMMUTE-NEXT:    sub a4, a6, a5
; FOLD-COMMUTE-NEXT:    vsetvli t1, a4, e64,m1
; FOLD-COMMUTE-NEXT:    vle.v v1, (a7)
; FOLD-COMMUTE-NEXT:    add a4, a2, t0
; FOLD-COMMUTE-NEXT:    vle.v v2, (a4)
; FOLD-COMMUTE-NEXT:    add a4, a3, t0
; FOLD-COMMUTE-NEXT:    vle.v v3, (a4)
; FOLD-COMMUTE-NEXT:    vfnmsac.vv v3, v1, v2
; FOLD-COMMUTE-NEXT:    add a7, a0, t0
; FOLD-COMMUTE-NEXT:    slli a4, t1, 32
; FOLD-COMMUTE-NEXT:    srli a4, a4, 32
; FOLD-COMMUTE-NEXT:    add a5, a5, a4
; FOLD-COMMUTE-NEXT:    vse.v v3, (a7)
; FOLD-COMMUTE-NEXT:    bne a5, a6, .LBB2_2
; FOLD-COMMUTE-NEXT:  .LBB2_3: # %for.end
; FOLD-COMMUTE-NEXT:    ret
entry:
  %cmp13 = icmp sgt i32 %n, 0
  br i1 %cmp13, label %for.body.preheader, label %for.end

for.body.preheader:                               ; preds = %entry
  %wide.trip.count = zext i32 %n to i64
  br label %vector.body

vector.body:                                      ; preds = %vector.body, %for.body.preheader
  %index = phi i64 [ 0, %for.body.preheader ], [ %index.next, %vector.body ]
  %0 = getelementptr inbounds double, double* %dz, i64 %index
  %1 = sub i64 %wide.trip.count, %index
  %2 = call i64 @llvm.epi.vsetvl(i64 %1, i64 3, i64 0)
  %3 = trunc i64 %2 to i32
  %4 = bitcast double* %0 to <vscale x 1 x double>*
  %vp.op.load = call <vscale x 1 x double> @llvm.vp.load.nxv1f64.p0nxv1f64(<vscale x 1 x double>* %4, i32 8, <vscale x 1 x i1> shufflevector (<vscale x 1 x i1> insertelement (<vscale x 1 x i1> undef, i1 true, i32 0), <vscale x 1 x i1> undef, <vscale x 1 x i32> zeroinitializer), i32 %3), !tbaa !4
  %5 = getelementptr inbounds double, double* %dx, i64 %index
  %6 = bitcast double* %5 to <vscale x 1 x double>*
  %vp.op.load23 = call <vscale x 1 x double> @llvm.vp.load.nxv1f64.p0nxv1f64(<vscale x 1 x double>* %6, i32 8, <vscale x 1 x i1> shufflevector (<vscale x 1 x i1> insertelement (<vscale x 1 x i1> undef, i1 true, i32 0), <vscale x 1 x i1> undef, <vscale x 1 x i32> zeroinitializer), i32 %3), !tbaa !4
  %7 = getelementptr inbounds double, double* %dy, i64 %index
  %8 = bitcast double* %7 to <vscale x 1 x double>*
  %vp.op.load26 = call <vscale x 1 x double> @llvm.vp.load.nxv1f64.p0nxv1f64(<vscale x 1 x double>* %8, i32 8, <vscale x 1 x i1> shufflevector (<vscale x 1 x i1> insertelement (<vscale x 1 x i1> undef, i1 true, i32 0), <vscale x 1 x i1> undef, <vscale x 1 x i32> zeroinitializer), i32 %3), !tbaa !4
  %vp.op = call fast <vscale x 1 x double> @llvm.vp.fmul.nxv1f64(<vscale x 1 x double> %vp.op.load23, <vscale x 1 x double> %vp.op.load, metadata !"round.tonearest", metadata !"fpexcept.ignore", <vscale x 1 x i1> shufflevector (<vscale x 1 x i1> insertelement (<vscale x 1 x i1> undef, i1 true, i32 0), <vscale x 1 x i1> undef, <vscale x 1 x i32> zeroinitializer), i32 %3)
  %vp.op31 = call fast <vscale x 1 x double> @llvm.vp.fsub.nxv1f64(<vscale x 1 x double> %vp.op.load26, <vscale x 1 x double> %vp.op, metadata !"round.tonearest", metadata !"fpexcept.ignore", <vscale x 1 x i1> shufflevector (<vscale x 1 x i1> insertelement (<vscale x 1 x i1> undef, i1 true, i32 0), <vscale x 1 x i1> undef, <vscale x 1 x i32> zeroinitializer), i32 %3)
  %9 = getelementptr inbounds double, double* %dw, i64 %index
  %10 = bitcast double* %9 to <vscale x 1 x double>*
  call void @llvm.vp.store.nxv1f64.p0nxv1f64(<vscale x 1 x double> %vp.op31, <vscale x 1 x double>* %10, i32 8, <vscale x 1 x i1> shufflevector (<vscale x 1 x i1> insertelement (<vscale x 1 x i1> undef, i1 true, i32 0), <vscale x 1 x i1> undef, <vscale x 1 x i32> zeroinitializer), i32 %3), !tbaa !4
  %11 = and i64 %2, 4294967295
  %index.next = add i64 %index, %11
  %12 = icmp eq i64 %index.next, %wide.trip.count
  br i1 %12, label %for.end, label %vector.body, !llvm.loop !12

for.end:                                          ; preds = %vector.body, %entry
  ret void
}

; Function Attrs: nounwind readnone
declare i64 @llvm.epi.vsetvl(i64, i64, i64) #1

; Function Attrs: argmemonly nosync nounwind readonly willreturn
declare <vscale x 1 x double> @llvm.vp.load.nxv1f64.p0nxv1f64(<vscale x 1 x double>* nocapture, i32 immarg, <vscale x 1 x i1>, i32) #2

; Function Attrs: nounwind readnone willreturn
declare <vscale x 1 x double> @llvm.vp.fmul.nxv1f64(<vscale x 1 x double>, <vscale x 1 x double>, metadata, metadata, <vscale x 1 x i1>, i32) #3

; Function Attrs: nounwind readnone willreturn
declare <vscale x 1 x double> @llvm.vp.fsub.nxv1f64(<vscale x 1 x double>, <vscale x 1 x double>, metadata, metadata, <vscale x 1 x i1>, i32) #3

; Function Attrs: argmemonly nosync nounwind willreturn writeonly
declare void @llvm.vp.store.nxv1f64.p0nxv1f64(<vscale x 1 x double>, <vscale x 1 x double>* nocapture, i32 immarg, <vscale x 1 x i1>, i32) #4

; Function Attrs: nounwind readnone willreturn
declare <vscale x 1 x double> @llvm.vp.fneg.nxv1f64(<vscale x 1 x double>, metadata, <vscale x 1 x i1>, i32) #3

attributes #0 = { nofree norecurse nounwind "disable-tail-calls"="false" "frame-pointer"="none" "less-precise-fpmad"="false" "min-legal-vector-width"="0" "no-infs-fp-math"="true" "no-jump-tables"="false" "no-nans-fp-math"="true" "no-signed-zeros-fp-math"="true" "no-trapping-math"="true" "stack-protector-buffer-size"="8" "target-features"="+a,+c,+d,+experimental-v,+experimental-zvlsseg,+f,+m,-relax,-save-restore" "unsafe-fp-math"="true" "use-soft-float"="false" }
attributes #1 = { nounwind readnone }
attributes #2 = { argmemonly nosync nounwind readonly willreturn }
attributes #3 = { nounwind readnone willreturn }
attributes #4 = { argmemonly nosync nounwind willreturn writeonly }

!llvm.module.flags = !{!0, !1, !2}
!llvm.ident = !{!3}

!0 = !{i32 1, !"wchar_size", i32 4}
!1 = !{i32 1, !"target-abi", !"lp64d"}
!2 = !{i32 1, !"SmallDataLimit", i32 8}
!3 = !{!"clang version 12.0.0"}
!4 = !{!5, !5, i64 0}
!5 = !{!"double", !6, i64 0}
!6 = !{!"omnipotent char", !7, i64 0}
!7 = !{!"Simple C/C++ TBAA"}
!8 = distinct !{!8, !9, !10}
!9 = !{!"llvm.loop.mustprogress"}
!10 = !{!"llvm.loop.isvectorized", i32 1}
!11 = distinct !{!11, !9, !10}
!12 = distinct !{!12, !9, !10}
