; NOTE: Assertions have been autogenerated by utils/update_llc_test_checks.py
; RUN: llc -mtriple=riscv64 -mattr=+experimental-v -verify-machineinstrs -O0 \
; RUN:    < %s | FileCheck --check-prefix=SPILL-O0 %s
; RUN: llc -mtriple=riscv64 -mattr=+experimental-v -verify-machineinstrs -O2 \
; RUN:    < %s | FileCheck --check-prefix=SPILL-O2 %s

define <vscale x 1 x i64> @spill_lmul_1(<vscale x 1 x i64> %va) nounwind {
; SPILL-O0-LABEL: spill_lmul_1:
; SPILL-O0:       # %bb.0: # %entry
; SPILL-O0-NEXT:    addi sp, sp, -64
; SPILL-O0-NEXT:    sd ra, 56(sp)
; SPILL-O0-NEXT:    sd s0, 48(sp)
; SPILL-O0-NEXT:    addi s0, sp, 64
; SPILL-O0-NEXT:    rdvtype ra
; SPILL-O0-NEXT:    rdvl t0
; SPILL-O0-NEXT:    vsetvli a0, zero, e8,m1
; SPILL-O0-NEXT:    vsetvl zero, t0, ra
; SPILL-O0-NEXT:    sub sp, sp, a0
; SPILL-O0-NEXT:    sd sp, -56(s0)
; SPILL-O0-NEXT:    ld a2, -56(s0)
; SPILL-O0-NEXT:    rdvtype a1
; SPILL-O0-NEXT:    rdvl a0
; SPILL-O0-NEXT:    vsetvli zero, zero, e64,m1
; SPILL-O0-NEXT:    vse.v v16, (a2)
; SPILL-O0-NEXT:    vsetvl zero, a0, a1
; SPILL-O0-NEXT:    #APP
; SPILL-O0-NEXT:    #NO_APP
; SPILL-O0-NEXT:    ld a2, -56(s0)
; SPILL-O0-NEXT:    rdvtype a1
; SPILL-O0-NEXT:    rdvl a0
; SPILL-O0-NEXT:    vsetvli zero, zero, e64,m1
; SPILL-O0-NEXT:    # implicit-def: $v16
; SPILL-O0-NEXT:    vle.v v16, (a2)
; SPILL-O0-NEXT:    vsetvl zero, a0, a1
; SPILL-O0-NEXT:    addi sp, s0, -64
; SPILL-O0-NEXT:    ld s0, 48(sp)
; SPILL-O0-NEXT:    ld ra, 56(sp)
; SPILL-O0-NEXT:    addi sp, sp, 64
; SPILL-O0-NEXT:    ret
;
; SPILL-O2-LABEL: spill_lmul_1:
; SPILL-O2:       # %bb.0: # %entry
; SPILL-O2-NEXT:    addi sp, sp, -64
; SPILL-O2-NEXT:    sd ra, 56(sp)
; SPILL-O2-NEXT:    sd s0, 48(sp)
; SPILL-O2-NEXT:    addi s0, sp, 64
; SPILL-O2-NEXT:    rdvtype ra
; SPILL-O2-NEXT:    rdvl t0
; SPILL-O2-NEXT:    vsetvli a0, zero, e8,m1
; SPILL-O2-NEXT:    vsetvl zero, t0, ra
; SPILL-O2-NEXT:    sub sp, sp, a0
; SPILL-O2-NEXT:    sd sp, -56(s0)
; SPILL-O2-NEXT:    ld a2, -56(s0)
; SPILL-O2-NEXT:    rdvtype a1
; SPILL-O2-NEXT:    rdvl a0
; SPILL-O2-NEXT:    vsetvli zero, zero, e64,m1
; SPILL-O2-NEXT:    vse.v v16, (a2)
; SPILL-O2-NEXT:    vsetvl zero, a0, a1
; SPILL-O2-NEXT:    #APP
; SPILL-O2-NEXT:    #NO_APP
; SPILL-O2-NEXT:    ld a2, -56(s0)
; SPILL-O2-NEXT:    rdvtype a1
; SPILL-O2-NEXT:    rdvl a0
; SPILL-O2-NEXT:    vsetvli zero, zero, e64,m1
; SPILL-O2-NEXT:    # implicit-def: $v16
; SPILL-O2-NEXT:    vle.v v16, (a2)
; SPILL-O2-NEXT:    vsetvl zero, a0, a1
; SPILL-O2-NEXT:    addi sp, s0, -64
; SPILL-O2-NEXT:    ld s0, 48(sp)
; SPILL-O2-NEXT:    ld ra, 56(sp)
; SPILL-O2-NEXT:    addi sp, sp, 64
; SPILL-O2-NEXT:    ret
entry:
  call void asm sideeffect "",
  "~{v0},~{v1},~{v2},~{v3},~{v4},~{v5},~{v6},~{v7},~{v8},~{v9},~{v10},~{v11},~{v12},~{v13},~{v14},~{v15},~{v16},~{v17},~{v18},~{v19},~{v20},~{v21},~{v22},~{v23},~{v24},~{v25},~{v26},~{v27},~{v28},~{v29},~{v30},~{v31}"()

  ret <vscale x 1 x i64> %va
}

define <vscale x 2 x i64> @spill_lmul_2(<vscale x 2 x i64> %va) nounwind {
; SPILL-O0-LABEL: spill_lmul_2:
; SPILL-O0:       # %bb.0: # %entry
; SPILL-O0-NEXT:    addi sp, sp, -64
; SPILL-O0-NEXT:    sd ra, 56(sp)
; SPILL-O0-NEXT:    sd s0, 48(sp)
; SPILL-O0-NEXT:    addi s0, sp, 64
; SPILL-O0-NEXT:    rdvtype ra
; SPILL-O0-NEXT:    rdvl t0
; SPILL-O0-NEXT:    vsetvli a0, zero, e8,m1
; SPILL-O0-NEXT:    vsetvl zero, t0, ra
; SPILL-O0-NEXT:    slli a0, a0, 1
; SPILL-O0-NEXT:    sub sp, sp, a0
; SPILL-O0-NEXT:    sd sp, -56(s0)
; SPILL-O0-NEXT:    ld a2, -56(s0)
; SPILL-O0-NEXT:    rdvtype a1
; SPILL-O0-NEXT:    rdvl a0
; SPILL-O0-NEXT:    vsetvli zero, zero, e64,m2
; SPILL-O0-NEXT:    vse.v v16, (a2)
; SPILL-O0-NEXT:    vsetvl zero, a0, a1
; SPILL-O0-NEXT:    #APP
; SPILL-O0-NEXT:    #NO_APP
; SPILL-O0-NEXT:    ld a2, -56(s0)
; SPILL-O0-NEXT:    rdvtype a1
; SPILL-O0-NEXT:    rdvl a0
; SPILL-O0-NEXT:    vsetvli zero, zero, e64,m2
; SPILL-O0-NEXT:    # implicit-def: $v16m2
; SPILL-O0-NEXT:    vle.v v16, (a2)
; SPILL-O0-NEXT:    vsetvl zero, a0, a1
; SPILL-O0-NEXT:    addi sp, s0, -64
; SPILL-O0-NEXT:    ld s0, 48(sp)
; SPILL-O0-NEXT:    ld ra, 56(sp)
; SPILL-O0-NEXT:    addi sp, sp, 64
; SPILL-O0-NEXT:    ret
;
; SPILL-O2-LABEL: spill_lmul_2:
; SPILL-O2:       # %bb.0: # %entry
; SPILL-O2-NEXT:    addi sp, sp, -64
; SPILL-O2-NEXT:    sd ra, 56(sp)
; SPILL-O2-NEXT:    sd s0, 48(sp)
; SPILL-O2-NEXT:    addi s0, sp, 64
; SPILL-O2-NEXT:    rdvtype ra
; SPILL-O2-NEXT:    rdvl t0
; SPILL-O2-NEXT:    vsetvli a0, zero, e8,m1
; SPILL-O2-NEXT:    vsetvl zero, t0, ra
; SPILL-O2-NEXT:    slli a0, a0, 1
; SPILL-O2-NEXT:    sub sp, sp, a0
; SPILL-O2-NEXT:    sd sp, -56(s0)
; SPILL-O2-NEXT:    ld a2, -56(s0)
; SPILL-O2-NEXT:    rdvtype a1
; SPILL-O2-NEXT:    rdvl a0
; SPILL-O2-NEXT:    vsetvli zero, zero, e64,m2
; SPILL-O2-NEXT:    vse.v v16, (a2)
; SPILL-O2-NEXT:    vsetvl zero, a0, a1
; SPILL-O2-NEXT:    #APP
; SPILL-O2-NEXT:    #NO_APP
; SPILL-O2-NEXT:    ld a2, -56(s0)
; SPILL-O2-NEXT:    rdvtype a1
; SPILL-O2-NEXT:    rdvl a0
; SPILL-O2-NEXT:    vsetvli zero, zero, e64,m2
; SPILL-O2-NEXT:    # implicit-def: $v16m2
; SPILL-O2-NEXT:    vle.v v16, (a2)
; SPILL-O2-NEXT:    vsetvl zero, a0, a1
; SPILL-O2-NEXT:    addi sp, s0, -64
; SPILL-O2-NEXT:    ld s0, 48(sp)
; SPILL-O2-NEXT:    ld ra, 56(sp)
; SPILL-O2-NEXT:    addi sp, sp, 64
; SPILL-O2-NEXT:    ret
entry:
  call void asm sideeffect "",
  "~{v0},~{v1},~{v2},~{v3},~{v4},~{v5},~{v6},~{v7},~{v8},~{v9},~{v10},~{v11},~{v12},~{v13},~{v14},~{v15},~{v16},~{v17},~{v18},~{v19},~{v20},~{v21},~{v22},~{v23},~{v24},~{v25},~{v26},~{v27},~{v28},~{v29},~{v30},~{v31}"()

  ret <vscale x 2 x i64> %va
}

define <vscale x 4 x i64> @spill_lmul_4(<vscale x 4 x i64> %va) nounwind {
; SPILL-O0-LABEL: spill_lmul_4:
; SPILL-O0:       # %bb.0: # %entry
; SPILL-O0-NEXT:    addi sp, sp, -64
; SPILL-O0-NEXT:    sd ra, 56(sp)
; SPILL-O0-NEXT:    sd s0, 48(sp)
; SPILL-O0-NEXT:    addi s0, sp, 64
; SPILL-O0-NEXT:    rdvtype ra
; SPILL-O0-NEXT:    rdvl t0
; SPILL-O0-NEXT:    vsetvli a0, zero, e8,m1
; SPILL-O0-NEXT:    vsetvl zero, t0, ra
; SPILL-O0-NEXT:    slli a0, a0, 2
; SPILL-O0-NEXT:    sub sp, sp, a0
; SPILL-O0-NEXT:    sd sp, -56(s0)
; SPILL-O0-NEXT:    ld a2, -56(s0)
; SPILL-O0-NEXT:    rdvtype a1
; SPILL-O0-NEXT:    rdvl a0
; SPILL-O0-NEXT:    vsetvli zero, zero, e64,m4
; SPILL-O0-NEXT:    vse.v v16, (a2)
; SPILL-O0-NEXT:    vsetvl zero, a0, a1
; SPILL-O0-NEXT:    #APP
; SPILL-O0-NEXT:    #NO_APP
; SPILL-O0-NEXT:    ld a2, -56(s0)
; SPILL-O0-NEXT:    rdvtype a1
; SPILL-O0-NEXT:    rdvl a0
; SPILL-O0-NEXT:    vsetvli zero, zero, e64,m4
; SPILL-O0-NEXT:    # implicit-def: $v16m4
; SPILL-O0-NEXT:    vle.v v16, (a2)
; SPILL-O0-NEXT:    vsetvl zero, a0, a1
; SPILL-O0-NEXT:    addi sp, s0, -64
; SPILL-O0-NEXT:    ld s0, 48(sp)
; SPILL-O0-NEXT:    ld ra, 56(sp)
; SPILL-O0-NEXT:    addi sp, sp, 64
; SPILL-O0-NEXT:    ret
;
; SPILL-O2-LABEL: spill_lmul_4:
; SPILL-O2:       # %bb.0: # %entry
; SPILL-O2-NEXT:    addi sp, sp, -64
; SPILL-O2-NEXT:    sd ra, 56(sp)
; SPILL-O2-NEXT:    sd s0, 48(sp)
; SPILL-O2-NEXT:    addi s0, sp, 64
; SPILL-O2-NEXT:    rdvtype ra
; SPILL-O2-NEXT:    rdvl t0
; SPILL-O2-NEXT:    vsetvli a0, zero, e8,m1
; SPILL-O2-NEXT:    vsetvl zero, t0, ra
; SPILL-O2-NEXT:    slli a0, a0, 2
; SPILL-O2-NEXT:    sub sp, sp, a0
; SPILL-O2-NEXT:    sd sp, -56(s0)
; SPILL-O2-NEXT:    ld a2, -56(s0)
; SPILL-O2-NEXT:    rdvtype a1
; SPILL-O2-NEXT:    rdvl a0
; SPILL-O2-NEXT:    vsetvli zero, zero, e64,m4
; SPILL-O2-NEXT:    vse.v v16, (a2)
; SPILL-O2-NEXT:    vsetvl zero, a0, a1
; SPILL-O2-NEXT:    #APP
; SPILL-O2-NEXT:    #NO_APP
; SPILL-O2-NEXT:    ld a2, -56(s0)
; SPILL-O2-NEXT:    rdvtype a1
; SPILL-O2-NEXT:    rdvl a0
; SPILL-O2-NEXT:    vsetvli zero, zero, e64,m4
; SPILL-O2-NEXT:    # implicit-def: $v16m4
; SPILL-O2-NEXT:    vle.v v16, (a2)
; SPILL-O2-NEXT:    vsetvl zero, a0, a1
; SPILL-O2-NEXT:    addi sp, s0, -64
; SPILL-O2-NEXT:    ld s0, 48(sp)
; SPILL-O2-NEXT:    ld ra, 56(sp)
; SPILL-O2-NEXT:    addi sp, sp, 64
; SPILL-O2-NEXT:    ret
entry:
  call void asm sideeffect "",
  "~{v0},~{v1},~{v2},~{v3},~{v4},~{v5},~{v6},~{v7},~{v8},~{v9},~{v10},~{v11},~{v12},~{v13},~{v14},~{v15},~{v16},~{v17},~{v18},~{v19},~{v20},~{v21},~{v22},~{v23},~{v24},~{v25},~{v26},~{v27},~{v28},~{v29},~{v30},~{v31}"()

  ret <vscale x 4 x i64> %va
}

define <vscale x 8 x i64> @spill_lmul_8(<vscale x 8 x i64> %va) nounwind {
; SPILL-O0-LABEL: spill_lmul_8:
; SPILL-O0:       # %bb.0: # %entry
; SPILL-O0-NEXT:    addi sp, sp, -64
; SPILL-O0-NEXT:    sd ra, 56(sp)
; SPILL-O0-NEXT:    sd s0, 48(sp)
; SPILL-O0-NEXT:    addi s0, sp, 64
; SPILL-O0-NEXT:    rdvtype ra
; SPILL-O0-NEXT:    rdvl t0
; SPILL-O0-NEXT:    vsetvli a0, zero, e8,m1
; SPILL-O0-NEXT:    vsetvl zero, t0, ra
; SPILL-O0-NEXT:    slli a0, a0, 3
; SPILL-O0-NEXT:    sub sp, sp, a0
; SPILL-O0-NEXT:    sd sp, -56(s0)
; SPILL-O0-NEXT:    ld a2, -56(s0)
; SPILL-O0-NEXT:    rdvtype a1
; SPILL-O0-NEXT:    rdvl a0
; SPILL-O0-NEXT:    vsetvli zero, zero, e64,m8
; SPILL-O0-NEXT:    vse.v v16, (a2)
; SPILL-O0-NEXT:    vsetvl zero, a0, a1
; SPILL-O0-NEXT:    #APP
; SPILL-O0-NEXT:    #NO_APP
; SPILL-O0-NEXT:    ld a2, -56(s0)
; SPILL-O0-NEXT:    rdvtype a1
; SPILL-O0-NEXT:    rdvl a0
; SPILL-O0-NEXT:    vsetvli zero, zero, e64,m8
; SPILL-O0-NEXT:    # implicit-def: $v16m8
; SPILL-O0-NEXT:    vle.v v16, (a2)
; SPILL-O0-NEXT:    vsetvl zero, a0, a1
; SPILL-O0-NEXT:    addi sp, s0, -64
; SPILL-O0-NEXT:    ld s0, 48(sp)
; SPILL-O0-NEXT:    ld ra, 56(sp)
; SPILL-O0-NEXT:    addi sp, sp, 64
; SPILL-O0-NEXT:    ret
;
; SPILL-O2-LABEL: spill_lmul_8:
; SPILL-O2:       # %bb.0: # %entry
; SPILL-O2-NEXT:    addi sp, sp, -64
; SPILL-O2-NEXT:    sd ra, 56(sp)
; SPILL-O2-NEXT:    sd s0, 48(sp)
; SPILL-O2-NEXT:    addi s0, sp, 64
; SPILL-O2-NEXT:    rdvtype ra
; SPILL-O2-NEXT:    rdvl t0
; SPILL-O2-NEXT:    vsetvli a0, zero, e8,m1
; SPILL-O2-NEXT:    vsetvl zero, t0, ra
; SPILL-O2-NEXT:    slli a0, a0, 3
; SPILL-O2-NEXT:    sub sp, sp, a0
; SPILL-O2-NEXT:    sd sp, -56(s0)
; SPILL-O2-NEXT:    ld a2, -56(s0)
; SPILL-O2-NEXT:    rdvtype a1
; SPILL-O2-NEXT:    rdvl a0
; SPILL-O2-NEXT:    vsetvli zero, zero, e64,m8
; SPILL-O2-NEXT:    vse.v v16, (a2)
; SPILL-O2-NEXT:    vsetvl zero, a0, a1
; SPILL-O2-NEXT:    #APP
; SPILL-O2-NEXT:    #NO_APP
; SPILL-O2-NEXT:    ld a2, -56(s0)
; SPILL-O2-NEXT:    rdvtype a1
; SPILL-O2-NEXT:    rdvl a0
; SPILL-O2-NEXT:    vsetvli zero, zero, e64,m8
; SPILL-O2-NEXT:    # implicit-def: $v16m8
; SPILL-O2-NEXT:    vle.v v16, (a2)
; SPILL-O2-NEXT:    vsetvl zero, a0, a1
; SPILL-O2-NEXT:    addi sp, s0, -64
; SPILL-O2-NEXT:    ld s0, 48(sp)
; SPILL-O2-NEXT:    ld ra, 56(sp)
; SPILL-O2-NEXT:    addi sp, sp, 64
; SPILL-O2-NEXT:    ret
entry:
  call void asm sideeffect "",
  "~{v0},~{v1},~{v2},~{v3},~{v4},~{v5},~{v6},~{v7},~{v8},~{v9},~{v10},~{v11},~{v12},~{v13},~{v14},~{v15},~{v16},~{v17},~{v18},~{v19},~{v20},~{v21},~{v22},~{v23},~{v24},~{v25},~{v26},~{v27},~{v28},~{v29},~{v30},~{v31}"()

  ret <vscale x 8 x i64> %va
}
