; NOTE: Assertions have been autogenerated by utils/update_llc_test_checks.py
; RUN: llc -mtriple=riscv64 -mattr=+m,+f,+d,+a,+c,+experimental-v,+only-lmul1 \
; RUN:    -target-abi lp64d -verify-machineinstrs < %s | FileCheck %s

declare <vscale x 2 x i64> @llvm.vp.strided.load.nxv2i64.p0i64.i64(i64* nocapture, i64, <vscale x 2 x i1>, i32)
declare void @llvm.vp.strided.store.nxv2i64.p0i64.i64(<vscale x 2 x i64>, i64* nocapture, i64, <vscale x 2 x i1>, i32)

define void @foo(i64* %ptr1, i64* %ptr2, i64 %stride, i32 %evl) {
; CHECK-LABEL: foo:
; CHECK:       # %bb.0:
; CHECK-NEXT:    sext.w a7, a3
; CHECK-NEXT:    vsetvli a5, zero, e64,m1
; CHECK-NEXT:    slli a4, a5, 1
; CHECK-NEXT:    sext.w a4, a4
; CHECK-NEXT:    bltu a4, a7, .LBB0_2
; CHECK-NEXT:  # %bb.1:
; CHECK-NEXT:    add a4, zero, a7
; CHECK-NEXT:  .LBB0_2:
; CHECK-NEXT:    sext.w a5, a5
; CHECK-NEXT:    subw a6, a3, a4
; CHECK-NEXT:    bltu a5, a7, .LBB0_4
; CHECK-NEXT:  # %bb.3:
; CHECK-NEXT:    add a5, zero, a7
; CHECK-NEXT:  .LBB0_4:
; CHECK-NEXT:    subw a7, a3, a5
; CHECK-NEXT:    mul a3, a5, a2
; CHECK-NEXT:    add a3, a3, a0
; CHECK-NEXT:    vsetvli zero, a7, e64,m1
; CHECK-NEXT:    vlse.v v1, (a3), a2
; CHECK-NEXT:    vsetvli zero, a5, e64,m1
; CHECK-NEXT:    vlse.v v2, (a0), a2
; CHECK-NEXT:    mul a0, a4, a2
; CHECK-NEXT:    add a0, a0, a1
; CHECK-NEXT:    vsetvli zero, a6, e64,m1
; CHECK-NEXT:    vsse.v v1, (a0), a2
; CHECK-NEXT:    vsetvli zero, a4, e64,m1
; CHECK-NEXT:    vsse.v v2, (a1), a2
; CHECK-NEXT:    ret
  %allones.1 = insertelement <vscale x 2 x i1> undef, i1 1, i32 0
  %allones = shufflevector <vscale x 2 x i1> %allones.1, <vscale x 2 x i1> undef, <vscale x 2 x i32> zeroinitializer

  %v = call <vscale x 2 x i64> @llvm.vp.strided.load.nxv2i64.p0i64.i64(i64* %ptr1, i64 %stride, <vscale x 2 x i1> %allones, i32 %evl)
  call void @llvm.vp.strided.store.nxv2i64.p0i64.i64(<vscale x 2 x i64> %v, i64* %ptr2, i64 %stride, <vscale x 2 x i1> %allones, i32 %evl)
  ret void
}

