; NOTE: Assertions have been autogenerated by utils/update_llc_test_checks.py
; RUN: llc -mtriple=riscv64 -mattr=+experimental-v -verify-machineinstrs \
; RUN:    < %s | FileCheck %s

define <vscale x 1 x i1> @test_do_not_propagate_when_not_VL_op(<vscale x 1 x i64> %vec, i64 %evl) {
; CHECK-LABEL: test_do_not_propagate_when_not_VL_op:
; CHECK:       # %bb.0:
; CHECK-NEXT:    vsetvli a0, a0, e64,m1
; CHECK-NEXT:    vmsgt.vx v0, v16, a0
; CHECK-NEXT:    ret
  %sum = call i64 @llvm.epi.vsetvl(i64 %evl, i64 3, i64 0)
  %res = call <vscale x 1 x i1> @llvm.epi.vmsgt.nxv1i1.i64(<vscale x 1 x i64> %vec, i64 %sum, i64 %evl)
  ret <vscale x 1 x i1> %res
}

declare i64 @llvm.epi.vsetvl(i64, i64, i64)
declare <vscale x 1 x i1> @llvm.epi.vmsgt.nxv1i1.i64(<vscale x 1 x i64>, i64, i64);
