; NOTE: Assertions have been autogenerated by utils/update_test_checks.py
; RUN: opt -S -passes=instcombine -expand-vector-gep-to-vp=false < %s | FileCheck %s

; ModuleID = '/home/lalbano/tmp/indexed-address.c'
source_filename = "/home/lalbano/tmp/indexed-address.c"
target datalayout = "e-m:e-p:64:64-i64:64-i128:128-n64-S128-v128:128:128-v256:128:128-v512:128:128-v1024:128:128"
target triple = "riscv64-unknown-linux-gnu"

; Function Attrs: nofree norecurse nounwind
define dso_local void @foo(double* nocapture %OUT, i32 signext %N, i32 signext %s, i64* nocapture readonly %indexes) local_unnamed_addr #0 {
; CHECK-LABEL: @foo(
; CHECK-NEXT:  entry:
; CHECK-NEXT:    [[CMP23:%.*]] = icmp sgt i32 [[N:%.*]], 0
; CHECK-NEXT:    br i1 [[CMP23]], label [[FOR_BODY_LR_PH:%.*]], label [[FOR_COND_CLEANUP:%.*]]
; CHECK:       for.body.lr.ph:
; CHECK-NEXT:    [[MUL:%.*]] = shl nsw i32 [[S:%.*]], 1
; CHECK-NEXT:    [[IDX_EXT:%.*]] = sext i32 [[MUL]] to i64
; CHECK-NEXT:    [[WIDE_TRIP_COUNT:%.*]] = zext i32 [[N]] to i64
; CHECK-NEXT:    br label [[VECTOR_BODY:%.*]]
; CHECK:       vector.body:
; CHECK-NEXT:    [[INDEX:%.*]] = phi i64 [ 0, [[FOR_BODY_LR_PH]] ], [ [[INDEX_NEXT:%.*]], [[VECTOR_BODY]] ]
; CHECK-NEXT:    [[TMP0:%.*]] = getelementptr inbounds i64, i64* [[INDEXES:%.*]], i64 [[INDEX]]
; CHECK-NEXT:    [[TMP1:%.*]] = sub i64 [[WIDE_TRIP_COUNT]], [[INDEX]]
; CHECK-NEXT:    [[TMP2:%.*]] = call i64 @llvm.epi.vsetvl(i64 [[TMP1]], i64 3, i64 0)
; CHECK-NEXT:    [[TMP3:%.*]] = trunc i64 [[TMP2]] to i32
; CHECK-NEXT:    [[TMP4:%.*]] = bitcast i64* [[TMP0]] to <vscale x 1 x i64>*
; CHECK-NEXT:    [[VP_OP_LOAD:%.*]] = call <vscale x 1 x i64> @llvm.vp.load.nxv1i64.p0nxv1i64(<vscale x 1 x i64>* [[TMP4]], i32 8, <vscale x 1 x i1> shufflevector (<vscale x 1 x i1> insertelement (<vscale x 1 x i1> undef, i1 true, i32 0), <vscale x 1 x i1> undef, <vscale x 1 x i32> zeroinitializer), i32 [[TMP3]]), [[TBAA4:!tbaa !.*]], !llvm.access.group !8
; CHECK-NEXT:    [[TMP5:%.*]] = getelementptr inbounds double, double* [[OUT:%.*]], <vscale x 1 x i64> [[VP_OP_LOAD]]
; CHECK-NEXT:    call void @llvm.vp.scatter.nxv1f64.nxv1p0f64(<vscale x 1 x double> shufflevector (<vscale x 1 x double> insertelement (<vscale x 1 x double> undef, double 1.000000e+00, i32 0), <vscale x 1 x double> undef, <vscale x 1 x i32> zeroinitializer), <vscale x 1 x double*> [[TMP5]], i32 8, <vscale x 1 x i1> shufflevector (<vscale x 1 x i1> insertelement (<vscale x 1 x i1> undef, i1 true, i32 0), <vscale x 1 x i1> undef, <vscale x 1 x i32> zeroinitializer), i32 [[TMP3]]), [[TBAA9:!tbaa !.*]], !llvm.access.group !8
; CHECK-NEXT:    [[BASE_PTR:%.*]] = getelementptr inbounds double, double* [[OUT]], i64 1
; CHECK-NEXT:    [[GEP_OPT1:%.*]] = getelementptr inbounds double, double* [[BASE_PTR]], <vscale x 1 x i64> [[VP_OP_LOAD]]
; CHECK-NEXT:    call void @llvm.vp.scatter.nxv1f64.nxv1p0f64(<vscale x 1 x double> shufflevector (<vscale x 1 x double> insertelement (<vscale x 1 x double> undef, double 2.000000e+00, i32 0), <vscale x 1 x double> undef, <vscale x 1 x i32> zeroinitializer), <vscale x 1 x double*> [[GEP_OPT1]], i32 8, <vscale x 1 x i1> shufflevector (<vscale x 1 x i1> insertelement (<vscale x 1 x i1> undef, i1 true, i32 0), <vscale x 1 x i1> undef, <vscale x 1 x i32> zeroinitializer), i32 [[TMP3]]), [[TBAA9]], !llvm.access.group !8
; CHECK-NEXT:    [[BASE_PTR14:%.*]] = getelementptr inbounds double, double* [[OUT]], i64 [[IDX_EXT]]
; CHECK-NEXT:    [[GEP_OPT15:%.*]] = getelementptr inbounds double, double* [[BASE_PTR14]], <vscale x 1 x i64> [[VP_OP_LOAD]]
; CHECK-NEXT:    call void @llvm.vp.scatter.nxv1f64.nxv1p0f64(<vscale x 1 x double> shufflevector (<vscale x 1 x double> insertelement (<vscale x 1 x double> undef, double 3.000000e+00, i32 0), <vscale x 1 x double> undef, <vscale x 1 x i32> zeroinitializer), <vscale x 1 x double*> [[GEP_OPT15]], i32 8, <vscale x 1 x i1> shufflevector (<vscale x 1 x i1> insertelement (<vscale x 1 x i1> undef, i1 true, i32 0), <vscale x 1 x i1> undef, <vscale x 1 x i32> zeroinitializer), i32 [[TMP3]]), [[TBAA9]], !llvm.access.group !8
; CHECK-NEXT:    [[TMP6:%.*]] = or i64 [[IDX_EXT]], 1
; CHECK-NEXT:    [[BASE_PTR3:%.*]] = getelementptr inbounds double, double* [[OUT]], i64 [[TMP6]]
; CHECK-NEXT:    [[GEP_OPT:%.*]] = getelementptr inbounds double, double* [[BASE_PTR3]], <vscale x 1 x i64> [[VP_OP_LOAD]]
; CHECK-NEXT:    call void @llvm.vp.scatter.nxv1f64.nxv1p0f64(<vscale x 1 x double> shufflevector (<vscale x 1 x double> insertelement (<vscale x 1 x double> undef, double 4.000000e+00, i32 0), <vscale x 1 x double> undef, <vscale x 1 x i32> zeroinitializer), <vscale x 1 x double*> [[GEP_OPT]], i32 8, <vscale x 1 x i1> shufflevector (<vscale x 1 x i1> insertelement (<vscale x 1 x i1> undef, i1 true, i32 0), <vscale x 1 x i1> undef, <vscale x 1 x i32> zeroinitializer), i32 [[TMP3]]), [[TBAA9]], !llvm.access.group !8
; CHECK-NEXT:    [[TMP7:%.*]] = shl nsw i64 [[IDX_EXT]], 1
; CHECK-NEXT:    [[BASE_PTR11:%.*]] = getelementptr inbounds double, double* [[OUT]], i64 [[TMP7]]
; CHECK-NEXT:    [[GEP_OPT12:%.*]] = getelementptr inbounds double, double* [[BASE_PTR11]], <vscale x 1 x i64> [[VP_OP_LOAD]]
; CHECK-NEXT:    call void @llvm.vp.scatter.nxv1f64.nxv1p0f64(<vscale x 1 x double> shufflevector (<vscale x 1 x double> insertelement (<vscale x 1 x double> undef, double 5.000000e+00, i32 0), <vscale x 1 x double> undef, <vscale x 1 x i32> zeroinitializer), <vscale x 1 x double*> [[GEP_OPT12]], i32 8, <vscale x 1 x i1> shufflevector (<vscale x 1 x i1> insertelement (<vscale x 1 x i1> undef, i1 true, i32 0), <vscale x 1 x i1> undef, <vscale x 1 x i32> zeroinitializer), i32 [[TMP3]]), [[TBAA9]], !llvm.access.group !8
; CHECK-NEXT:    [[TMP8:%.*]] = or i64 [[IDX_EXT]], 1
; CHECK-NEXT:    [[TMP9:%.*]] = add nsw i64 [[TMP8]], [[IDX_EXT]]
; CHECK-NEXT:    [[BASE_PTR7:%.*]] = getelementptr inbounds double, double* [[OUT]], i64 [[TMP9]]
; CHECK-NEXT:    [[GEP_OPT8:%.*]] = getelementptr inbounds double, double* [[BASE_PTR7]], <vscale x 1 x i64> [[VP_OP_LOAD]]
; CHECK-NEXT:    call void @llvm.vp.scatter.nxv1f64.nxv1p0f64(<vscale x 1 x double> shufflevector (<vscale x 1 x double> insertelement (<vscale x 1 x double> undef, double 6.000000e+00, i32 0), <vscale x 1 x double> undef, <vscale x 1 x i32> zeroinitializer), <vscale x 1 x double*> [[GEP_OPT8]], i32 8, <vscale x 1 x i1> shufflevector (<vscale x 1 x i1> insertelement (<vscale x 1 x i1> undef, i1 true, i32 0), <vscale x 1 x i1> undef, <vscale x 1 x i32> zeroinitializer), i32 [[TMP3]]), [[TBAA9]], !llvm.access.group !8
; CHECK-NEXT:    [[TMP10:%.*]] = and i64 [[TMP2]], 4294967295
; CHECK-NEXT:    [[INDEX_NEXT]] = add i64 [[INDEX]], [[TMP10]]
; CHECK-NEXT:    [[TMP11:%.*]] = icmp eq i64 [[INDEX_NEXT]], [[WIDE_TRIP_COUNT]]
; CHECK-NEXT:    br i1 [[TMP11]], label [[FOR_COND_CLEANUP]], label [[VECTOR_BODY]], [[LOOP11:!llvm.loop !.*]]
; CHECK:       for.cond.cleanup:
; CHECK-NEXT:    ret void
;
entry:
  %cmp23 = icmp sgt i32 %N, 0
  br i1 %cmp23, label %for.body.lr.ph, label %for.cond.cleanup

for.body.lr.ph:                                   ; preds = %entry
  %mul = shl nsw i32 %s, 1
  %idx.ext = sext i32 %mul to i64
  %wide.trip.count = zext i32 %N to i64
  br label %vector.body

vector.body:                                      ; preds = %vector.body, %for.body.lr.ph
  %index = phi i64 [ 0, %for.body.lr.ph ], [ %index.next, %vector.body ]
  %0 = getelementptr inbounds i64, i64* %indexes, i64 %index
  %1 = sub i64 %wide.trip.count, %index
  %2 = call i64 @llvm.epi.vsetvl(i64 %1, i64 3, i64 0)
  %3 = trunc i64 %2 to i32
  %4 = bitcast i64* %0 to <vscale x 1 x i64>*
  %vp.op.load = call <vscale x 1 x i64> @llvm.vp.load.nxv1i64.p0nxv1i64(<vscale x 1 x i64>* %4, i32 8, <vscale x 1 x i1> shufflevector (<vscale x 1 x i1> insertelement (<vscale x 1 x i1> undef, i1 true, i32 0), <vscale x 1 x i1> undef, <vscale x 1 x i32> zeroinitializer), i32 %3), !tbaa !4, !llvm.access.group !8
  %5 = getelementptr inbounds double, double* %OUT, <vscale x 1 x i64> %vp.op.load
  call void @llvm.vp.scatter.nxv1f64.nxv1p0f64(<vscale x 1 x double> shufflevector (<vscale x 1 x double> insertelement (<vscale x 1 x double> undef, double 1.000000e+00, i32 0), <vscale x 1 x double> undef, <vscale x 1 x i32> zeroinitializer), <vscale x 1 x double*> %5, i32 8, <vscale x 1 x i1> shufflevector (<vscale x 1 x i1> insertelement (<vscale x 1 x i1> undef, i1 true, i32 0), <vscale x 1 x i1> undef, <vscale x 1 x i32> zeroinitializer), i32 %3), !tbaa !9, !llvm.access.group !8
  %6 = getelementptr inbounds double, <vscale x 1 x double*> %5, i64 1
  call void @llvm.vp.scatter.nxv1f64.nxv1p0f64(<vscale x 1 x double> shufflevector (<vscale x 1 x double> insertelement (<vscale x 1 x double> undef, double 2.000000e+00, i32 0), <vscale x 1 x double> undef, <vscale x 1 x i32> zeroinitializer), <vscale x 1 x double*> %6, i32 8, <vscale x 1 x i1> shufflevector (<vscale x 1 x i1> insertelement (<vscale x 1 x i1> undef, i1 true, i32 0), <vscale x 1 x i1> undef, <vscale x 1 x i32> zeroinitializer), i32 %3), !tbaa !9, !llvm.access.group !8
  %7 = getelementptr inbounds double, <vscale x 1 x double*> %5, i64 %idx.ext
  call void @llvm.vp.scatter.nxv1f64.nxv1p0f64(<vscale x 1 x double> shufflevector (<vscale x 1 x double> insertelement (<vscale x 1 x double> undef, double 3.000000e+00, i32 0), <vscale x 1 x double> undef, <vscale x 1 x i32> zeroinitializer), <vscale x 1 x double*> %7, i32 8, <vscale x 1 x i1> shufflevector (<vscale x 1 x i1> insertelement (<vscale x 1 x i1> undef, i1 true, i32 0), <vscale x 1 x i1> undef, <vscale x 1 x i32> zeroinitializer), i32 %3), !tbaa !9, !llvm.access.group !8
  %8 = getelementptr inbounds double, <vscale x 1 x double*> %7, i64 1
  call void @llvm.vp.scatter.nxv1f64.nxv1p0f64(<vscale x 1 x double> shufflevector (<vscale x 1 x double> insertelement (<vscale x 1 x double> undef, double 4.000000e+00, i32 0), <vscale x 1 x double> undef, <vscale x 1 x i32> zeroinitializer), <vscale x 1 x double*> %8, i32 8, <vscale x 1 x i1> shufflevector (<vscale x 1 x i1> insertelement (<vscale x 1 x i1> undef, i1 true, i32 0), <vscale x 1 x i1> undef, <vscale x 1 x i32> zeroinitializer), i32 %3), !tbaa !9, !llvm.access.group !8
  %9 = getelementptr inbounds double, <vscale x 1 x double*> %7, i64 %idx.ext
  call void @llvm.vp.scatter.nxv1f64.nxv1p0f64(<vscale x 1 x double> shufflevector (<vscale x 1 x double> insertelement (<vscale x 1 x double> undef, double 5.000000e+00, i32 0), <vscale x 1 x double> undef, <vscale x 1 x i32> zeroinitializer), <vscale x 1 x double*> %9, i32 8, <vscale x 1 x i1> shufflevector (<vscale x 1 x i1> insertelement (<vscale x 1 x i1> undef, i1 true, i32 0), <vscale x 1 x i1> undef, <vscale x 1 x i32> zeroinitializer), i32 %3), !tbaa !9, !llvm.access.group !8
  %10 = getelementptr inbounds double, <vscale x 1 x double*> %9, i64 1
  call void @llvm.vp.scatter.nxv1f64.nxv1p0f64(<vscale x 1 x double> shufflevector (<vscale x 1 x double> insertelement (<vscale x 1 x double> undef, double 6.000000e+00, i32 0), <vscale x 1 x double> undef, <vscale x 1 x i32> zeroinitializer), <vscale x 1 x double*> %10, i32 8, <vscale x 1 x i1> shufflevector (<vscale x 1 x i1> insertelement (<vscale x 1 x i1> undef, i1 true, i32 0), <vscale x 1 x i1> undef, <vscale x 1 x i32> zeroinitializer), i32 %3), !tbaa !9, !llvm.access.group !8
  %11 = and i64 %2, 4294967295
  %index.next = add i64 %index, %11
  %12 = icmp eq i64 %index.next, %wide.trip.count
  br i1 %12, label %for.cond.cleanup, label %vector.body, !llvm.loop !11

for.cond.cleanup:                                 ; preds = %vector.body, %entry
  ret void
}

; Function Attrs: nounwind readnone
declare i64 @llvm.epi.vsetvl(i64, i64, i64) #1

; Function Attrs: argmemonly nosync nounwind readonly willreturn
declare <vscale x 1 x i64> @llvm.vp.load.nxv1i64.p0nxv1i64(<vscale x 1 x i64>* nocapture, i32 immarg, <vscale x 1 x i1>, i32) #2

; Function Attrs: argmemonly nosync nounwind willreturn writeonly
declare void @llvm.vp.scatter.nxv1f64.nxv1p0f64(<vscale x 1 x double>, <vscale x 1 x double*>, i32 immarg, <vscale x 1 x i1>, i32) #3

attributes #0 = { nofree norecurse nounwind "disable-tail-calls"="false" "frame-pointer"="none" "less-precise-fpmad"="false" "min-legal-vector-width"="0" "no-infs-fp-math"="false" "no-jump-tables"="false" "no-nans-fp-math"="false" "no-signed-zeros-fp-math"="false" "no-trapping-math"="true" "stack-protector-buffer-size"="8" "target-features"="+a,+c,+d,+experimental-v,+experimental-zvlsseg,+f,+m,-relax,-save-restore" "unsafe-fp-math"="false" "use-soft-float"="false" }
attributes #1 = { nounwind readnone }
attributes #2 = { argmemonly nosync nounwind readonly willreturn }
attributes #3 = { argmemonly nosync nounwind willreturn writeonly }

!llvm.module.flags = !{!0, !1, !2}
!llvm.ident = !{!3}

!0 = !{i32 1, !"wchar_size", i32 4}
!1 = !{i32 1, !"target-abi", !"lp64d"}
!2 = !{i32 1, !"SmallDataLimit", i32 8}
!3 = !{!"clang version 12.0.0"}
!4 = !{!5, !5, i64 0}
!5 = !{!"long", !6, i64 0}
!6 = !{!"omnipotent char", !7, i64 0}
!7 = !{!"Simple C/C++ TBAA"}
!8 = distinct !{}
!9 = !{!10, !10, i64 0}
!10 = !{!"double", !6, i64 0}
!11 = distinct !{!11, !12, !13, !14}
!12 = !{!"llvm.loop.mustprogress"}
!13 = !{!"llvm.loop.parallel_accesses", !8}
!14 = !{!"llvm.loop.isvectorized", i32 1}
