; NOTE: Assertions have been autogenerated by utils/update_llc_test_checks.py
; RUN: llc -mtriple=riscv32 -target-abi ilp32d -mattr=+f,+d < %s \
; RUN:    | FileCheck %s
; RUN: llc -mtriple=riscv64 -target-abi lp64d -mattr=+f,+d < %s \
; RUN:    | FileCheck %s

define dso_local float @powf32(float %a, float %b) nounwind {
; CHECK-LABEL: powf32:
; CHECK:    call powf
entry:
  %p = call float @llvm.pow.f32(float %a, float %b)
  ret float  %p
}

define dso_local double @powf64(double %a, double %b) nounwind {
; CHECK-LABEL: powf64:
; CHECK:    call pow
ntry:
  %p = call double @llvm.pow.f64(double %a, double %b)
  ret double  %p
}

declare float @llvm.pow.f32(float %Val, float %Power)
declare double @llvm.pow.f64(double %Val, double %Power)
