; NOTE: Tests autogenerated by utils/EPI/generate-intrinsic-tests.py
; RUN: llc -mtriple=riscv64 -mattr=+m,+f,+d,+a,+c,+experimental-v \
; RUN:    -verify-machineinstrs --riscv-no-aliases < %s | FileCheck %s

define void @test(i8* %spa, i8* %spb, i8* %spc) {
; CHECK: Begin function test
  %pa = bitcast i8*  %spa to float8_152*
  %pb = bitcast i8*  %spb to float8_152*
  %pc = bitcast i8*  %spc to float8_152*

; CHECK: call    __extendjfsf2
; CHECK: call    __extendjfsf2
  %a = load float8_152, float8_152* %pa
  %b = load float8_152, float8_152* %pb

  %d = fadd float8_152 %a, %b

; CHECK:   call    __truncsfjf2
  store float8_152 %d, float8_152* %pc

  ret void
}

