; NOTE: Assertions have been autogenerated by utils/update_llc_test_checks.py
; RUN: llc -mtriple=riscv64 -mattr=+m,+f,+d,+c,+experimental-v < %s | \
; RUN:     FileCheck %s

define <vscale x 2 x i32> @fptosi.i32.f32(<vscale x 2 x float> %a, i32 %gvl)
; CHECK-LABEL: fptosi.i32.f32:
; CHECK:       # %bb.0:
; CHECK-NEXT:    vsetvli zero, a0, e32,m1
; CHECK-NEXT:    vfcvt.x.f.v v16, v16
; CHECK-NEXT:    ret
{
  %b = call <vscale x 2 x i32> @llvm.vp.fptosi.nxv2i32.nxv2f32(<vscale x 2 x float> %a,
            metadata !"fpexcept.ignore",
            <vscale x 2 x i1> shufflevector (<vscale x 2 x i1> insertelement (<vscale x 2 x i1> undef, i1 true, i32 0), <vscale x 2 x i1> undef, <vscale x 2 x i32> zeroinitializer),
            i32 %gvl)
  ret <vscale x 2 x i32> %b
}

define <vscale x 2 x i32> @fptosi.i32.f32.mask(<vscale x 2 x float> %a, <vscale x 2 x i1> %mask, i32 %gvl)
; CHECK-LABEL: fptosi.i32.f32.mask:
; CHECK:       # %bb.0:
; CHECK-NEXT:    vsetvli zero, a0, e32,m1
; CHECK-NEXT:    vfcvt.x.f.v v16, v16, v0.t
; CHECK-NEXT:    ret
{
  %b = call <vscale x 2 x i32> @llvm.vp.fptosi.nxv2i32.nxv2f32(
               <vscale x 2 x float> %a,
               metadata !"fpexcept.ignore",
               <vscale x 2 x i1> %mask,
               i32 %gvl)
  ret <vscale x 2 x i32> %b
}

declare <vscale x 2 x i32> @llvm.vp.fptosi.nxv2i32.nxv2f32(<vscale x 2 x float> %a, metadata, <vscale x 2 x i1> %mask, i32 %gvl)

define <vscale x 2 x i64> @fptosi.i64.f32(<vscale x 2 x float> %a, i32 %gvl)
; CHECK-LABEL: fptosi.i64.f32:
; CHECK:       # %bb.0:
; CHECK-NEXT:    vsetvli zero, a0, e32,m1
; CHECK-NEXT:    vfwcvt.x.f.v v2, v16
; CHECK-NEXT:    rdvtype t0
; CHECK-NEXT:    rdvl t1
; CHECK-NEXT:    vsetvli zero, zero, e64,m2
; CHECK-NEXT:    vmv.v.v v16, v2
; CHECK-NEXT:    vsetvl zero, t1, t0
; CHECK-NEXT:    ret
{
  %b = call <vscale x 2 x i64> @llvm.vp.fptosi.nxv2i64.nxv2f32(<vscale x 2 x float> %a,
            metadata !"fpexcept.ignore",
            <vscale x 2 x i1> shufflevector (<vscale x 2 x i1> insertelement (<vscale x 2 x i1> undef, i1 true, i32 0), <vscale x 2 x i1> undef, <vscale x 2 x i32> zeroinitializer),
            i32 %gvl)
  ret <vscale x 2 x i64> %b
}

define <vscale x 2 x i64> @fptosi.i64.f32.mask(<vscale x 2 x float> %a, <vscale x 2 x i1> %mask, i32 %gvl)
; CHECK-LABEL: fptosi.i64.f32.mask:
; CHECK:       # %bb.0:
; CHECK-NEXT:    vsetvli zero, a0, e32,m1
; CHECK-NEXT:    vfwcvt.x.f.v v2, v16, v0.t
; CHECK-NEXT:    rdvtype t0
; CHECK-NEXT:    rdvl t1
; CHECK-NEXT:    vsetvli zero, zero, e64,m2
; CHECK-NEXT:    vmv.v.v v16, v2
; CHECK-NEXT:    vsetvl zero, t1, t0
; CHECK-NEXT:    ret
{
  %b = call <vscale x 2 x i64> @llvm.vp.fptosi.nxv2i64.nxv2f32(
               <vscale x 2 x float> %a,
               metadata !"fpexcept.ignore",
               <vscale x 2 x i1> %mask,
               i32 %gvl)
  ret <vscale x 2 x i64> %b
}

declare <vscale x 2 x i64> @llvm.vp.fptosi.nxv2i64.nxv2f32(<vscale x 2 x float> %a, metadata, <vscale x 2 x i1> %mask, i32 %gvl)

define <vscale x 2 x i32> @fptosi.i32.f64(<vscale x 2 x double> %a, i32 %gvl)
; CHECK-LABEL: fptosi.i32.f64:
; CHECK:       # %bb.0:
; CHECK-NEXT:    vsetvli zero, a0, e32,m1
; CHECK-NEXT:    vfncvt.x.f.v v1, v16
; CHECK-NEXT:    rdvtype t0
; CHECK-NEXT:    rdvl t1
; CHECK-NEXT:    vsetvli zero, zero, e64,m1
; CHECK-NEXT:    vmv.v.v v16, v1
; CHECK-NEXT:    vsetvl zero, t1, t0
; CHECK-NEXT:    ret
{
  %b = call <vscale x 2 x i32> @llvm.vp.fptosi.nxv2i32.nxv2f64(<vscale x 2 x double> %a,
            metadata !"fpexcept.ignore",
            <vscale x 2 x i1> shufflevector (<vscale x 2 x i1> insertelement (<vscale x 2 x i1> undef, i1 true, i32 0), <vscale x 2 x i1> undef, <vscale x 2 x i32> zeroinitializer),
            i32 %gvl)
  ret <vscale x 2 x i32> %b
}

define <vscale x 2 x i32> @fptosi.i32.f64.mask(<vscale x 2 x double> %a, <vscale x 2 x i1> %mask, i32 %gvl)
; CHECK-LABEL: fptosi.i32.f64.mask:
; CHECK:       # %bb.0:
; CHECK-NEXT:    vsetvli zero, a0, e32,m1
; CHECK-NEXT:    vfncvt.x.f.v v1, v16, v0.t
; CHECK-NEXT:    rdvtype t0
; CHECK-NEXT:    rdvl t1
; CHECK-NEXT:    vsetvli zero, zero, e64,m1
; CHECK-NEXT:    vmv.v.v v16, v1
; CHECK-NEXT:    vsetvl zero, t1, t0
; CHECK-NEXT:    ret
{
  %b = call <vscale x 2 x i32> @llvm.vp.fptosi.nxv2i32.nxv2f64(
               <vscale x 2 x double> %a,
               metadata !"fpexcept.ignore",
               <vscale x 2 x i1> %mask,
               i32 %gvl)
  ret <vscale x 2 x i32> %b
}

declare <vscale x 2 x i32> @llvm.vp.fptosi.nxv2i32.nxv2f64(<vscale x 2 x double> %a, metadata, <vscale x 2 x i1> %mask, i32 %gvl)

define <vscale x 8 x i8> @test_vp_fptosi_nxv8i8_nxv8f32(<vscale x 8 x float> %a, i32 %evl) {
; CHECK-LABEL: test_vp_fptosi_nxv8i8_nxv8f32:
; CHECK:       # %bb.0:
; CHECK-NEXT:    vsetvli zero, a0, e16,m2
; CHECK-NEXT:    vfncvt.x.f.v v2, v16
; CHECK-NEXT:    vsetvli zero, a0, e8,m1
; CHECK-NEXT:    vnsrl.vi v16, v2, 0
; CHECK-NEXT:    ret
    %m.first = insertelement <vscale x 8 x i1> undef, i1 1, i32 0
    %m.splat = shufflevector <vscale x 8 x i1> %m.first, <vscale x 8 x i1> undef, <vscale x 8 x i32> zeroinitializer
    %x = call <vscale x 8 x i8> @llvm.vp.fptosi.nxv8i8.nxv8f32(<vscale x 8 x float> %a, metadata !"fpexcept.ignore", <vscale x 8 x i1> %m.splat, i32 %evl)
    ret <vscale x 8 x i8> %x
}

define <vscale x 8 x i8> @test_vp_fptosi_nxv8i8_nxv8f64(<vscale x 8 x double> %a, i32 %evl) {
; CHECK-LABEL: test_vp_fptosi_nxv8i8_nxv8f64:
; CHECK:       # %bb.0:
; CHECK-NEXT:    vsetvli zero, a0, e32,m4
; CHECK-NEXT:    vfncvt.x.f.v v4, v16
; CHECK-NEXT:    vsetvli zero, a0, e16,m2
; CHECK-NEXT:    vnsrl.vi v2, v4, 0
; CHECK-NEXT:    vsetvli zero, a0, e8,m1
; CHECK-NEXT:    vnsrl.vi v16, v2, 0
; CHECK-NEXT:    ret
    %m.first = insertelement <vscale x 8 x i1> undef, i1 1, i32 0
    %m.splat = shufflevector <vscale x 8 x i1> %m.first, <vscale x 8 x i1> undef, <vscale x 8 x i32> zeroinitializer
    %x = call <vscale x 8 x i8> @llvm.vp.fptosi.nxv8i8.nxv8f64(<vscale x 8 x double> %a, metadata !"fpexcept.ignore", <vscale x 8 x i1> %m.splat, i32 %evl)
    ret <vscale x 8 x i8> %x
}

define <vscale x 8 x i16> @test_vp_fptosi_nxv8i16_nxv8f64(<vscale x 8 x double> %a, i32 %evl) {
; CHECK-LABEL: test_vp_fptosi_nxv8i16_nxv8f64:
; CHECK:       # %bb.0:
; CHECK-NEXT:    vsetvli zero, a0, e32,m4
; CHECK-NEXT:    vfncvt.x.f.v v4, v16
; CHECK-NEXT:    vsetvli zero, a0, e16,m2
; CHECK-NEXT:    vnsrl.vi v16, v4, 0
; CHECK-NEXT:    ret
    %m.first = insertelement <vscale x 8 x i1> undef, i1 1, i32 0
    %m.splat = shufflevector <vscale x 8 x i1> %m.first, <vscale x 8 x i1> undef, <vscale x 8 x i32> zeroinitializer
    %x = call <vscale x 8 x i16> @llvm.vp.fptosi.nxv8i16.nxv8f64(<vscale x 8 x double> %a, metadata !"fpexcept.ignore", <vscale x 8 x i1> %m.splat, i32 %evl)
    ret <vscale x 8 x i16> %x
}

declare <vscale x 8 x i8> @llvm.vp.fptosi.nxv8i8.nxv8f32(<vscale x 8 x float> %op, metadata, <vscale x 8 x i1> %mask, i32 %evl)
declare <vscale x 8 x i8> @llvm.vp.fptosi.nxv8i8.nxv8f64(<vscale x 8 x double> %op, metadata, <vscale x 8 x i1> %mask, i32 %evl)
declare <vscale x 8 x i16> @llvm.vp.fptosi.nxv8i16.nxv8f64(<vscale x 8 x double> %op, metadata, <vscale x 8 x i1> %mask, i32 %evl)
