; NOTE: Assertions have been autogenerated by utils/update_llc_test_checks.py
; RUN: llc -mtriple=riscv64 -mattr=+m,+f,+d,+c,+experimental-v < %s | \
; RUN:     FileCheck %s

define <vscale x 2 x i32> @trunc.i32.i64(<vscale x 2 x i64> %a, i32 %gvl)
; CHECK-LABEL: trunc.i32.i64:
; CHECK:       # %bb.0:
; CHECK-NEXT:    vsetvli zero, a0, e32,m1
; CHECK-NEXT:    vnsrl.vi v1, v16, 0
; CHECK-NEXT:    rdvtype t0
; CHECK-NEXT:    rdvl t1
; CHECK-NEXT:    vsetvli zero, zero, e64,m1
; CHECK-NEXT:    vmv.v.v v16, v1
; CHECK-NEXT:    vsetvl zero, t1, t0
; CHECK-NEXT:    ret
{
  %b = call <vscale x 2 x i32> @llvm.vp.trunc.nxv2i32.nxv2i64(<vscale x 2 x i64> %a,
            <vscale x 2 x i1> shufflevector (<vscale x 2 x i1> insertelement (<vscale x 2 x i1> undef, i1 true, i32 0), <vscale x 2 x i1> undef, <vscale x 2 x i32> zeroinitializer),
            i32 %gvl)
  ret <vscale x 2 x i32> %b
}

define <vscale x 2 x i32> @trunc.i32.i64.mask(<vscale x 2 x i64> %a, <vscale x 2 x i1> %mask, i32 %gvl)
; CHECK-LABEL: trunc.i32.i64.mask:
; CHECK:       # %bb.0:
; CHECK-NEXT:    vsetvli zero, a0, e32,m1
; CHECK-NEXT:    vnsrl.vi v1, v16, 0, v0.t
; CHECK-NEXT:    rdvtype t0
; CHECK-NEXT:    rdvl t1
; CHECK-NEXT:    vsetvli zero, zero, e64,m1
; CHECK-NEXT:    vmv.v.v v16, v1
; CHECK-NEXT:    vsetvl zero, t1, t0
; CHECK-NEXT:    ret
{
  %b = call <vscale x 2 x i32> @llvm.vp.trunc.nxv2i32.nxv2i64(
               <vscale x 2 x i64> %a,
               <vscale x 2 x i1> %mask,
               i32 %gvl)
  ret <vscale x 2 x i32> %b
}

declare <vscale x 2 x i32> @llvm.vp.trunc.nxv2i32.nxv2i64(<vscale x 2 x i64>, <vscale x 2 x i1>, i32) #3

define <vscale x 8 x i8> @test_vp_trunc_nxv8i8_nxv8i32(<vscale x 8 x i32> %a, i32 %evl) {
; CHECK-LABEL: test_vp_trunc_nxv8i8_nxv8i32:
; CHECK:       # %bb.0:
; CHECK-NEXT:    vsetvli zero, a0, e16,m2
; CHECK-NEXT:    vnsrl.vi v2, v16, 0
; CHECK-NEXT:    vsetvli zero, a0, e8,m1
; CHECK-NEXT:    vnsrl.vi v16, v2, 0
; CHECK-NEXT:    ret
    %m.first = insertelement <vscale x 8 x i1> undef, i1 1, i32 0
    %m.splat = shufflevector <vscale x 8 x i1> %m.first, <vscale x 8 x i1> undef, <vscale x 8 x i32> zeroinitializer
    %x = call <vscale x 8 x i8> @llvm.vp.trunc.nxv8i8.nxv8i32(<vscale x 8 x i32> %a, <vscale x 8 x i1> %m.splat, i32 %evl)
    ret <vscale x 8 x i8> %x
}

define <vscale x 8 x i8> @test_vp_trunc_nxv8i8_nxv8i64(<vscale x 8 x i64> %a, i32 %evl) {
; CHECK-LABEL: test_vp_trunc_nxv8i8_nxv8i64:
; CHECK:       # %bb.0:
; CHECK-NEXT:    vsetvli zero, a0, e32,m4
; CHECK-NEXT:    vnsrl.vi v4, v16, 0
; CHECK-NEXT:    vsetvli zero, a0, e16,m2
; CHECK-NEXT:    vnsrl.vi v2, v4, 0
; CHECK-NEXT:    vsetvli zero, a0, e8,m1
; CHECK-NEXT:    vnsrl.vi v16, v2, 0
; CHECK-NEXT:    ret
    %m.first = insertelement <vscale x 8 x i1> undef, i1 1, i32 0
    %m.splat = shufflevector <vscale x 8 x i1> %m.first, <vscale x 8 x i1> undef, <vscale x 8 x i32> zeroinitializer
    %x = call <vscale x 8 x i8> @llvm.vp.trunc.nxv8i8.nxv8i64(<vscale x 8 x i64> %a, <vscale x 8 x i1> %m.splat, i32 %evl)
    ret <vscale x 8 x i8> %x
}

define <vscale x 8 x i16> @test_vp_trunc_nxv8i16_nxv8i64(<vscale x 8 x i64> %a, i32 %evl) {
; CHECK-LABEL: test_vp_trunc_nxv8i16_nxv8i64:
; CHECK:       # %bb.0:
; CHECK-NEXT:    vsetvli zero, a0, e32,m4
; CHECK-NEXT:    vnsrl.vi v4, v16, 0
; CHECK-NEXT:    vsetvli zero, a0, e16,m2
; CHECK-NEXT:    vnsrl.vi v16, v4, 0
; CHECK-NEXT:    ret
    %m.first = insertelement <vscale x 8 x i1> undef, i1 1, i32 0
    %m.splat = shufflevector <vscale x 8 x i1> %m.first, <vscale x 8 x i1> undef, <vscale x 8 x i32> zeroinitializer
    %x = call <vscale x 8 x i16> @llvm.vp.trunc.nxv8i16.nxv8i64(<vscale x 8 x i64> %a, <vscale x 8 x i1> %m.splat, i32 %evl)
    ret <vscale x 8 x i16> %x
}

declare <vscale x 8 x i8> @llvm.vp.trunc.nxv8i8.nxv8i32(<vscale x 8 x i32> %op, <vscale x 8 x i1> %mask, i32 %evl)
declare <vscale x 8 x i8> @llvm.vp.trunc.nxv8i8.nxv8i64(<vscale x 8 x i64> %op, <vscale x 8 x i1> %mask, i32 %evl)
declare <vscale x 8 x i16> @llvm.vp.trunc.nxv8i16.nxv8i64(<vscale x 8 x i64> %op, <vscale x 8 x i1> %mask, i32 %evl)
