; NOTE: Assertions have been autogenerated by utils/update_llc_test_checks.py
; RUN: llc -mtriple riscv64 -mattr +m,+a,+f,+d,+experimental-v -o - \
; RUN:     --verify-machineinstrs %s | FileCheck %s

; Note: Check epi-vp-logical.ll and epi-full-vector-logical.ll contain
; extensive LMUL>1 zext and trunc testcases.

define <vscale x 1 x i1> @mtrunc_1(<vscale x 1 x i64> %a, <vscale x 1 x i64> %b, i64 %gvl) nounwind
; CHECK-LABEL: mtrunc_1:
; CHECK:       # %bb.0:
; CHECK-NEXT:    vsetvli zero, a0, e64,m1
; CHECK-NEXT:    vmand.mm v0, v16, v17
; CHECK-NEXT:    ret
{
  %ma = trunc <vscale x 1 x i64> %a to <vscale x 1 x i1>
  %mb = trunc <vscale x 1 x i64> %b to <vscale x 1 x i1>

  %mc = call <vscale x 1 x i1> @llvm.epi.vmand.nxv1i1.nxv1i1(<vscale x 1 x i1> %ma, <vscale x 1 x i1> %mb, i64 %gvl)

  ret <vscale x 1 x i1> %mc
}

declare <vscale x 1 x i1> @llvm.epi.vmand.nxv1i1.nxv1i1(<vscale x 1 x i1> %a, <vscale x 1 x i1> %b, i64 %gvl)

define <vscale x 1 x i64> @mzext_1(<vscale x 1 x i1> %ma, <vscale x 1 x i1> %mb, i64 %gvl) nounwind
; CHECK-LABEL: mzext_1:
; CHECK:       # %bb.0:
; CHECK-NEXT:    vsetvli zero, zero, e64,m1
; CHECK-NEXT:    vmcpy.m v1, v0
; CHECK-NEXT:    vmcpy.m v2, v16
; CHECK-NEXT:    vsetvli zero, a0, e64,m1
; CHECK-NEXT:    vand.vv v16, v1, v2
; CHECK-NEXT:    ret
{
  %a = zext <vscale x 1 x i1> %ma to <vscale x 1 x i64>
  %b = zext <vscale x 1 x i1> %mb to <vscale x 1 x i64>

  %c = call <vscale x 1 x i64> @llvm.epi.vand.nxv1i64.nxv1i64(<vscale x 1 x i64> %a, <vscale x 1 x i64> %b, i64 %gvl)

  ret <vscale x 1 x i64> %c
}

declare <vscale x 1 x i64> @llvm.epi.vand.nxv1i64.nxv1i64(<vscale x 1 x i64> %a, <vscale x 1 x i64> %b, i64 %gvl)

define <vscale x 2 x i1> @mtrunc_2(<vscale x 2 x i64> %a, <vscale x 2 x i64> %b, i64 %gvl) nounwind
; CHECK-LABEL: mtrunc_2:
; CHECK:       # %bb.0:
; CHECK-NEXT:    vsetvli zero, zero, e64,m2
; CHECK-NEXT:    vand.vi v2, v16, 1
; CHECK-NEXT:    vmv.v.i v4, 0
; CHECK-NEXT:    vmsne.vv v1, v2, v4
; CHECK-NEXT:    vand.vi v2, v18, 1
; CHECK-NEXT:    vmsne.vv v2, v2, v4
; CHECK-NEXT:    vsetvli zero, a0, e32,m1
; CHECK-NEXT:    vmand.mm v0, v1, v2
; CHECK-NEXT:    ret
{
  %ma = trunc <vscale x 2 x i64> %a to <vscale x 2 x i1>
  %mb = trunc <vscale x 2 x i64> %b to <vscale x 2 x i1>

  %mc = call <vscale x 2 x i1> @llvm.epi.vmand.nxv2i1.nxv2i1(<vscale x 2 x i1> %ma, <vscale x 2 x i1> %mb, i64 %gvl)

  ret <vscale x 2 x i1> %mc
}

declare <vscale x 2 x i1> @llvm.epi.vmand.nxv2i1.nxv2i1(<vscale x 2 x i1> %a, <vscale x 2 x i1> %b, i64 %gvl)

define <vscale x 2 x i64> @mzext_2(<vscale x 2 x i1> %ma, <vscale x 2 x i1> %mb, i64 %gvl) nounwind
; CHECK-LABEL: mzext_2:
; CHECK:       # %bb.0:
; CHECK-NEXT:    vsetvli zero, zero, e64,m2
; CHECK-NEXT:    vmv.v.i v2, 0
; CHECK-NEXT:    vmerge.vim v4, v2, 1, v0
; CHECK-NEXT:    rdvtype t0
; CHECK-NEXT:    rdvl t1
; CHECK-NEXT:    vsetvli zero, zero, e64,m1
; CHECK-NEXT:    vmv.v.v v0, v16
; CHECK-NEXT:    vsetvl zero, t1, t0
; CHECK-NEXT:    vmerge.vim v2, v2, 1, v0
; CHECK-NEXT:    vsetvli zero, a0, e64,m2
; CHECK-NEXT:    vand.vv v16, v4, v2
; CHECK-NEXT:    ret
{
  %a = zext <vscale x 2 x i1> %ma to <vscale x 2 x i64>
  %b = zext <vscale x 2 x i1> %mb to <vscale x 2 x i64>

  %c = call <vscale x 2 x i64> @llvm.epi.vand.nxv2i64.nxv2i64(<vscale x 2 x i64> %a, <vscale x 2 x i64> %b, i64 %gvl)

  ret <vscale x 2 x i64> %c
}

declare <vscale x 2 x i64> @llvm.epi.vand.nxv2i64.nxv2i64(<vscale x 2 x i64> %a, <vscale x 2 x i64> %b, i64 %gvl)
