; NOTE: Assertions have been autogenerated by utils/update_test_checks.py
; RUN: opt -mtriple riscv64 -mattr +m,+a,+f,+d,+experimental-v \
; RUN:    -prefer-predicate-over-epilogue=predicate-dont-vectorize -S -O2 \
; RUN:    < %s -o - | FileCheck %s

define dso_local void @add_ref(i64 %N, float* nocapture %c, float* nocapture readonly %a, float* nocapture readnone %b) {
; CHECK-LABEL: @add_ref(
; CHECK-NEXT:  entry:
; CHECK-NEXT:    [[CMP6:%.*]] = icmp sgt i64 [[N:%.*]], 0
; CHECK-NEXT:    br i1 [[CMP6]], label [[FOR_BODY:%.*]], label [[FOR_END:%.*]]
; CHECK:       for.body:
; CHECK-NEXT:    [[I_07:%.*]] = phi i64 [ [[INC:%.*]], [[FOR_BODY]] ], [ 0, [[ENTRY:%.*]] ]
; CHECK-NEXT:    [[ARRAYIDX:%.*]] = getelementptr inbounds float, float* [[A:%.*]], i64 [[I_07]]
; CHECK-NEXT:    [[TMP0:%.*]] = load float, float* [[ARRAYIDX]], align 4
; CHECK-NEXT:    [[TMP1:%.*]] = tail call float @llvm.round.f32(float [[TMP0]])
; CHECK-NEXT:    [[ARRAYIDX1:%.*]] = getelementptr inbounds float, float* [[C:%.*]], i64 [[I_07]]
; CHECK-NEXT:    store float [[TMP1]], float* [[ARRAYIDX1]], align 4
; CHECK-NEXT:    [[INC]] = add nuw nsw i64 [[I_07]], 1
; CHECK-NEXT:    [[EXITCOND_NOT:%.*]] = icmp eq i64 [[INC]], [[N]]
; CHECK-NEXT:    br i1 [[EXITCOND_NOT]], label [[FOR_END]], label [[FOR_BODY]]
; CHECK:       for.end:
; CHECK-NEXT:    ret void
;
entry:
  %cmp6 = icmp sgt i64 %N, 0
  br i1 %cmp6, label %for.body.preheader, label %for.end

for.body.preheader:                               ; preds = %entry
  br label %for.body

for.body:                                         ; preds = %for.body.preheader, %for.body
  %i.07 = phi i64 [ %inc, %for.body ], [ 0, %for.body.preheader ]
  %arrayidx = getelementptr inbounds float, float* %a, i64 %i.07
  %0 = load float, float* %arrayidx, align 4
  %1 = tail call float @llvm.round.f32(float %0)
  %arrayidx1 = getelementptr inbounds float, float* %c, i64 %i.07
  store float %1, float* %arrayidx1, align 4
  %inc = add nuw nsw i64 %i.07, 1
  %exitcond.not = icmp eq i64 %inc, %N
  br i1 %exitcond.not, label %for.end.loopexit, label %for.body

for.end.loopexit:                                 ; preds = %for.body
  br label %for.end

for.end:                                          ; preds = %for.end.loopexit, %entry
  ret void
}

declare float @llvm.round.f32(float) #1

