; NOTE: Assertions have been autogenerated by utils/update_test_checks.py
; RUN: opt -mtriple riscv64 -mattr +m,+a,+f,+d,+experimental-v \
; RUN:    -prefer-predicate-over-epilogue=predicate-dont-vectorize \
; RUN:    -S -loop-vectorize -instcombine -simplifycfg < %s -o - \
; RUN:    | FileCheck --check-prefix=GATHER %s
; RUN: opt -mtriple riscv64 -mattr +m,+a,+f,+d,+experimental-v \
; RUN:    -prefer-predicate-over-epilogue=predicate-dont-vectorize \
; RUN:    -vectorizer-use-vp-strided-load-store \
; RUN:    -S -loop-vectorize -instcombine -simplifycfg < %s -o - \
; RUN:    | FileCheck --check-prefix=STRIDED %s

; Test from https://reviews.llvm.org/D107790
;
; void scatter(signed char * __restrict  A, signed char * __restrict B) {
;   for (int i = 0; i < 1024; ++i)
;       A[i * 5] += B[i];
; }

define dso_local void @scatter(i8* noalias nocapture %A, i8* noalias nocapture readonly %B) {
; GATHER-LABEL: @scatter(
; GATHER-NEXT:  entry:
; GATHER-NEXT:    br label [[FOR_BODY:%.*]]
; GATHER:       for.cond.cleanup:
; GATHER-NEXT:    ret void
; GATHER:       for.body:
; GATHER-NEXT:    [[INDVARS_IV:%.*]] = phi i64 [ 0, [[ENTRY:%.*]] ], [ [[INDVARS_IV_NEXT:%.*]], [[FOR_BODY]] ]
; GATHER-NEXT:    [[ARRAYIDX:%.*]] = getelementptr inbounds i8, i8* [[B:%.*]], i64 [[INDVARS_IV]]
; GATHER-NEXT:    [[TMP0:%.*]] = load i8, i8* [[ARRAYIDX]], align 1
; GATHER-NEXT:    [[TMP1:%.*]] = mul nuw nsw i64 [[INDVARS_IV]], 5
; GATHER-NEXT:    [[ARRAYIDX2:%.*]] = getelementptr inbounds i8, i8* [[A:%.*]], i64 [[TMP1]]
; GATHER-NEXT:    [[TMP2:%.*]] = load i8, i8* [[ARRAYIDX2]], align 1
; GATHER-NEXT:    [[ADD:%.*]] = add i8 [[TMP2]], [[TMP0]]
; GATHER-NEXT:    store i8 [[ADD]], i8* [[ARRAYIDX2]], align 1
; GATHER-NEXT:    [[INDVARS_IV_NEXT]] = add nuw nsw i64 [[INDVARS_IV]], 1
; GATHER-NEXT:    [[EXITCOND_NOT:%.*]] = icmp eq i64 [[INDVARS_IV_NEXT]], 1024
; GATHER-NEXT:    br i1 [[EXITCOND_NOT]], label [[FOR_COND_CLEANUP:%.*]], label [[FOR_BODY]]
;
; STRIDED-LABEL: @scatter(
; STRIDED-NEXT:  entry:
; STRIDED-NEXT:    br label [[VECTOR_BODY:%.*]]
; STRIDED:       vector.body:
; STRIDED-NEXT:    [[INDEX:%.*]] = phi i64 [ 0, [[ENTRY:%.*]] ], [ [[INDEX_NEXT:%.*]], [[VECTOR_BODY]] ]
; STRIDED-NEXT:    [[TMP0:%.*]] = getelementptr inbounds i8, i8* [[B:%.*]], i64 [[INDEX]]
; STRIDED-NEXT:    [[TMP1:%.*]] = sub i64 1024, [[INDEX]]
; STRIDED-NEXT:    [[TMP2:%.*]] = call i64 @llvm.epi.vsetvl(i64 [[TMP1]], i64 0, i64 0)
; STRIDED-NEXT:    [[TMP3:%.*]] = trunc i64 [[TMP2]] to i32
; STRIDED-NEXT:    [[TMP4:%.*]] = bitcast i8* [[TMP0]] to <vscale x 8 x i8>*
; STRIDED-NEXT:    [[VP_OP_LOAD:%.*]] = call <vscale x 8 x i8> @llvm.vp.load.nxv8i8.p0nxv8i8(<vscale x 8 x i8>* [[TMP4]], i32 1, <vscale x 8 x i1> shufflevector (<vscale x 8 x i1> insertelement (<vscale x 8 x i1> undef, i1 true, i32 0), <vscale x 8 x i1> undef, <vscale x 8 x i32> zeroinitializer), i32 [[TMP3]])
; STRIDED-NEXT:    [[TMP5:%.*]] = mul i64 [[INDEX]], 5
; STRIDED-NEXT:    [[TMP6:%.*]] = getelementptr i8, i8* [[A:%.*]], i64 [[TMP5]]
; STRIDED-NEXT:    [[VP_STRIDED_LOAD:%.*]] = call <vscale x 8 x i8> @llvm.vp.strided.load.nxv8i8.p0i8.i64(i8* [[TMP6]], i64 5, <vscale x 8 x i1> shufflevector (<vscale x 8 x i1> insertelement (<vscale x 8 x i1> undef, i1 true, i32 0), <vscale x 8 x i1> undef, <vscale x 8 x i32> zeroinitializer), i32 [[TMP3]])
; STRIDED-NEXT:    [[VP_OP:%.*]] = call <vscale x 8 x i8> @llvm.vp.add.nxv8i8(<vscale x 8 x i8> [[VP_STRIDED_LOAD]], <vscale x 8 x i8> [[VP_OP_LOAD]], <vscale x 8 x i1> shufflevector (<vscale x 8 x i1> insertelement (<vscale x 8 x i1> undef, i1 true, i32 0), <vscale x 8 x i1> undef, <vscale x 8 x i32> zeroinitializer), i32 [[TMP3]])
; STRIDED-NEXT:    [[TMP7:%.*]] = mul i64 [[INDEX]], 5
; STRIDED-NEXT:    [[TMP8:%.*]] = getelementptr i8, i8* [[A]], i64 [[TMP7]]
; STRIDED-NEXT:    call void @llvm.vp.strided.store.nxv8i8.p0i8.i64(<vscale x 8 x i8> [[VP_OP]], i8* [[TMP8]], i64 5, <vscale x 8 x i1> shufflevector (<vscale x 8 x i1> insertelement (<vscale x 8 x i1> undef, i1 true, i32 0), <vscale x 8 x i1> undef, <vscale x 8 x i32> zeroinitializer), i32 [[TMP3]])
; STRIDED-NEXT:    [[TMP9:%.*]] = and i64 [[TMP2]], 4294967295
; STRIDED-NEXT:    [[INDEX_NEXT]] = add i64 [[INDEX]], [[TMP9]]
; STRIDED-NEXT:    [[TMP10:%.*]] = icmp eq i64 [[INDEX_NEXT]], 1024
; STRIDED-NEXT:    br i1 [[TMP10]], label [[FOR_COND_CLEANUP:%.*]], label [[VECTOR_BODY]], [[LOOP0:!llvm.loop !.*]]
; STRIDED:       for.cond.cleanup:
; STRIDED-NEXT:    ret void
;
entry:
  br label %for.body

for.cond.cleanup:                                 ; preds = %for.body
  ret void

for.body:                                         ; preds = %entry, %for.body
  %indvars.iv = phi i64 [ 0, %entry ], [ %indvars.iv.next, %for.body ]
  %arrayidx = getelementptr inbounds i8, i8* %B, i64 %indvars.iv
  %0 = load i8, i8* %arrayidx, align 1
  %1 = mul nuw nsw i64 %indvars.iv, 5
  %arrayidx2 = getelementptr inbounds i8, i8* %A, i64 %1
  %2 = load i8, i8* %arrayidx2, align 1
  %add = add i8 %2, %0
  store i8 %add, i8* %arrayidx2, align 1
  %indvars.iv.next = add nuw nsw i64 %indvars.iv, 1
  %exitcond.not = icmp eq i64 %indvars.iv.next, 1024
  br i1 %exitcond.not, label %for.cond.cleanup, label %for.body
}
