; NOTE: Assertions have been autogenerated by utils/update_llc_test_checks.py
; RUN: llc -mtriple=riscv64 -mattr=+m,+f,+d,+experimental-v -verify-machineinstrs \
; RUN:    < %s | FileCheck --check-prefix=FOLD %s
; RUN: llc -mtriple=riscv64 -mattr=+m,+f,+d,+experimental-v -verify-machineinstrs \
; RUN:    -riscv-enable-commuting-fma < %s | FileCheck --check-prefix=FOLD-COMMUTE %s

; ModuleID = 't2.c'
source_filename = "t2.c"
target datalayout = "e-m:e-p:64:64-i64:64-i128:128-n64-S128-v128:128:128-v256:128:128-v512:128:128-v1024:128:128"
target triple = "riscv64-unknown-linux-gnu"

; Function Attrs: nofree norecurse nounwind
define dso_local void @autovec_fma(i32 signext %N, double* nocapture readonly %IN, double* nocapture %OUT) local_unnamed_addr #0 {
; FOLD-LABEL: autovec_fma:
; FOLD:       # %bb.0: # %entry
; FOLD-NEXT:    addi a3, zero, 1
; FOLD-NEXT:    blt a0, a3, .LBB0_3
; FOLD-NEXT:  # %bb.1: # %for.body.preheader
; FOLD-NEXT:    mv a3, zero
; FOLD-NEXT:    slli a0, a0, 32
; FOLD-NEXT:    srli a6, a0, 32
; FOLD-NEXT:  .LBB0_2: # %vector.body
; FOLD-NEXT:    # =>This Inner Loop Header: Depth=1
; FOLD-NEXT:    slli a4, a3, 3
; FOLD-NEXT:    add a5, a1, a4
; FOLD-NEXT:    sub a0, a6, a3
; FOLD-NEXT:    vsetvli a7, a0, e64,m1
; FOLD-NEXT:    vle.v v1, (a5)
; FOLD-NEXT:    addi t0, a4, 8
; FOLD-NEXT:    add a0, a1, t0
; FOLD-NEXT:    vle.v v2, (a0)
; FOLD-NEXT:    addi a0, a5, 16
; FOLD-NEXT:    vle.v v3, (a0)
; FOLD-NEXT:    addi a0, a5, 24
; FOLD-NEXT:    vle.v v4, (a0)
; FOLD-NEXT:    vfmul.vv v5, v4, v2
; FOLD-NEXT:    vfmsac.vv v5, v1, v3
; FOLD-NEXT:    vfmul.vv v2, v3, v2
; FOLD-NEXT:    vfmacc.vv v2, v1, v4
; FOLD-NEXT:    add a0, a2, a4
; FOLD-NEXT:    vse.v v5, (a0)
; FOLD-NEXT:    add a0, a2, t0
; FOLD-NEXT:    slli a4, a7, 32
; FOLD-NEXT:    srli a4, a4, 32
; FOLD-NEXT:    add a3, a3, a4
; FOLD-NEXT:    vse.v v2, (a0)
; FOLD-NEXT:    bne a3, a6, .LBB0_2
; FOLD-NEXT:  .LBB0_3: # %for.cond.cleanup
; FOLD-NEXT:    ret
;
; FOLD-COMMUTE-LABEL: autovec_fma:
; FOLD-COMMUTE:       # %bb.0: # %entry
; FOLD-COMMUTE-NEXT:    addi a3, zero, 1
; FOLD-COMMUTE-NEXT:    blt a0, a3, .LBB0_3
; FOLD-COMMUTE-NEXT:  # %bb.1: # %for.body.preheader
; FOLD-COMMUTE-NEXT:    mv a3, zero
; FOLD-COMMUTE-NEXT:    slli a0, a0, 32
; FOLD-COMMUTE-NEXT:    srli a6, a0, 32
; FOLD-COMMUTE-NEXT:  .LBB0_2: # %vector.body
; FOLD-COMMUTE-NEXT:    # =>This Inner Loop Header: Depth=1
; FOLD-COMMUTE-NEXT:    slli a4, a3, 3
; FOLD-COMMUTE-NEXT:    add a5, a1, a4
; FOLD-COMMUTE-NEXT:    sub a0, a6, a3
; FOLD-COMMUTE-NEXT:    vsetvli a7, a0, e64,m1
; FOLD-COMMUTE-NEXT:    vle.v v1, (a5)
; FOLD-COMMUTE-NEXT:    addi t0, a4, 8
; FOLD-COMMUTE-NEXT:    add a0, a1, t0
; FOLD-COMMUTE-NEXT:    vle.v v2, (a0)
; FOLD-COMMUTE-NEXT:    addi a0, a5, 16
; FOLD-COMMUTE-NEXT:    vle.v v3, (a0)
; FOLD-COMMUTE-NEXT:    addi a0, a5, 24
; FOLD-COMMUTE-NEXT:    vle.v v4, (a0)
; FOLD-COMMUTE-NEXT:    vfmul.vv v5, v4, v2
; FOLD-COMMUTE-NEXT:    vfmsac.vv v5, v1, v3
; FOLD-COMMUTE-NEXT:    vfmul.vv v2, v3, v2
; FOLD-COMMUTE-NEXT:    vfmacc.vv v2, v1, v4
; FOLD-COMMUTE-NEXT:    add a0, a2, a4
; FOLD-COMMUTE-NEXT:    vse.v v5, (a0)
; FOLD-COMMUTE-NEXT:    add a0, a2, t0
; FOLD-COMMUTE-NEXT:    slli a4, a7, 32
; FOLD-COMMUTE-NEXT:    srli a4, a4, 32
; FOLD-COMMUTE-NEXT:    add a3, a3, a4
; FOLD-COMMUTE-NEXT:    vse.v v2, (a0)
; FOLD-COMMUTE-NEXT:    bne a3, a6, .LBB0_2
; FOLD-COMMUTE-NEXT:  .LBB0_3: # %for.cond.cleanup
; FOLD-COMMUTE-NEXT:    ret
entry:
  %cmp40 = icmp sgt i32 %N, 0
  br i1 %cmp40, label %for.body.preheader, label %for.cond.cleanup

for.body.preheader:                               ; preds = %entry
  %wide.trip.count = zext i32 %N to i64
  br label %vector.body

vector.body:                                      ; preds = %vector.body, %for.body.preheader
  %index = phi i64 [ 0, %for.body.preheader ], [ %index.next, %vector.body ]
  %0 = getelementptr inbounds double, double* %IN, i64 %index
  %1 = sub i64 %wide.trip.count, %index
  %2 = call i64 @llvm.epi.vsetvl(i64 %1, i64 3, i64 0)
  %3 = trunc i64 %2 to i32
  %4 = bitcast double* %0 to <vscale x 1 x double>*
  %vp.op.load = call <vscale x 1 x double> @llvm.vp.load.nxv1f64.p0nxv1f64(<vscale x 1 x double>* %4, i32 8, <vscale x 1 x i1> shufflevector (<vscale x 1 x i1> insertelement (<vscale x 1 x i1> undef, i1 true, i32 0), <vscale x 1 x i1> undef, <vscale x 1 x i32> zeroinitializer), i32 %3), !tbaa !4, !llvm.access.group !8
  %5 = add nuw nsw i64 %index, 1
  %6 = getelementptr inbounds double, double* %IN, i64 %5
  %7 = bitcast double* %6 to <vscale x 1 x double>*
  %vp.op.load52 = call <vscale x 1 x double> @llvm.vp.load.nxv1f64.p0nxv1f64(<vscale x 1 x double>* %7, i32 8, <vscale x 1 x i1> shufflevector (<vscale x 1 x i1> insertelement (<vscale x 1 x i1> undef, i1 true, i32 0), <vscale x 1 x i1> undef, <vscale x 1 x i32> zeroinitializer), i32 %3), !tbaa !4, !llvm.access.group !8
  %8 = add nuw nsw i64 %index, 2
  %9 = getelementptr inbounds double, double* %IN, i64 %8
  %10 = bitcast double* %9 to <vscale x 1 x double>*
  %vp.op.load55 = call <vscale x 1 x double> @llvm.vp.load.nxv1f64.p0nxv1f64(<vscale x 1 x double>* %10, i32 8, <vscale x 1 x i1> shufflevector (<vscale x 1 x i1> insertelement (<vscale x 1 x i1> undef, i1 true, i32 0), <vscale x 1 x i1> undef, <vscale x 1 x i32> zeroinitializer), i32 %3), !tbaa !4, !llvm.access.group !8
  %11 = add nuw nsw i64 %index, 3
  %12 = getelementptr inbounds double, double* %IN, i64 %11
  %13 = bitcast double* %12 to <vscale x 1 x double>*
  %vp.op.load58 = call <vscale x 1 x double> @llvm.vp.load.nxv1f64.p0nxv1f64(<vscale x 1 x double>* %13, i32 8, <vscale x 1 x i1> shufflevector (<vscale x 1 x i1> insertelement (<vscale x 1 x i1> undef, i1 true, i32 0), <vscale x 1 x i1> undef, <vscale x 1 x i32> zeroinitializer), i32 %3), !tbaa !4, !llvm.access.group !8
  %vp.op = call fast <vscale x 1 x double> @llvm.vp.fmul.nxv1f64(<vscale x 1 x double> %vp.op.load55, <vscale x 1 x double> %vp.op.load, metadata !"round.tonearest", metadata !"fpexcept.ignore", <vscale x 1 x i1> shufflevector (<vscale x 1 x i1> insertelement (<vscale x 1 x i1> undef, i1 true, i32 0), <vscale x 1 x i1> undef, <vscale x 1 x i32> zeroinitializer), i32 %3)
  %vp.op63 = call fast <vscale x 1 x double> @llvm.vp.fmul.nxv1f64(<vscale x 1 x double> %vp.op.load58, <vscale x 1 x double> %vp.op.load52, metadata !"round.tonearest", metadata !"fpexcept.ignore", <vscale x 1 x i1> shufflevector (<vscale x 1 x i1> insertelement (<vscale x 1 x i1> undef, i1 true, i32 0), <vscale x 1 x i1> undef, <vscale x 1 x i32> zeroinitializer), i32 %3)
  %vp.op66 = call fast <vscale x 1 x double> @llvm.vp.fsub.nxv1f64(<vscale x 1 x double> %vp.op, <vscale x 1 x double> %vp.op63, metadata !"round.tonearest", metadata !"fpexcept.ignore", <vscale x 1 x i1> shufflevector (<vscale x 1 x i1> insertelement (<vscale x 1 x i1> undef, i1 true, i32 0), <vscale x 1 x i1> undef, <vscale x 1 x i32> zeroinitializer), i32 %3)
  %vp.op69 = call fast <vscale x 1 x double> @llvm.vp.fmul.nxv1f64(<vscale x 1 x double> %vp.op.load58, <vscale x 1 x double> %vp.op.load, metadata !"round.tonearest", metadata !"fpexcept.ignore", <vscale x 1 x i1> shufflevector (<vscale x 1 x i1> insertelement (<vscale x 1 x i1> undef, i1 true, i32 0), <vscale x 1 x i1> undef, <vscale x 1 x i32> zeroinitializer), i32 %3)
  %vp.op72 = call fast <vscale x 1 x double> @llvm.vp.fmul.nxv1f64(<vscale x 1 x double> %vp.op.load55, <vscale x 1 x double> %vp.op.load52, metadata !"round.tonearest", metadata !"fpexcept.ignore", <vscale x 1 x i1> shufflevector (<vscale x 1 x i1> insertelement (<vscale x 1 x i1> undef, i1 true, i32 0), <vscale x 1 x i1> undef, <vscale x 1 x i32> zeroinitializer), i32 %3)
  %vp.op75 = call fast <vscale x 1 x double> @llvm.vp.fadd.nxv1f64(<vscale x 1 x double> %vp.op69, <vscale x 1 x double> %vp.op72, metadata !"round.tonearest", metadata !"fpexcept.ignore", <vscale x 1 x i1> shufflevector (<vscale x 1 x i1> insertelement (<vscale x 1 x i1> undef, i1 true, i32 0), <vscale x 1 x i1> undef, <vscale x 1 x i32> zeroinitializer), i32 %3)
  %14 = getelementptr inbounds double, double* %OUT, i64 %index
  %15 = bitcast double* %14 to <vscale x 1 x double>*
  call void @llvm.vp.store.nxv1f64.p0nxv1f64(<vscale x 1 x double> %vp.op66, <vscale x 1 x double>* %15, i32 8, <vscale x 1 x i1> shufflevector (<vscale x 1 x i1> insertelement (<vscale x 1 x i1> undef, i1 true, i32 0), <vscale x 1 x i1> undef, <vscale x 1 x i32> zeroinitializer), i32 %3), !tbaa !4, !llvm.access.group !8
  %16 = getelementptr inbounds double, double* %OUT, i64 %5
  %17 = bitcast double* %16 to <vscale x 1 x double>*
  call void @llvm.vp.store.nxv1f64.p0nxv1f64(<vscale x 1 x double> %vp.op75, <vscale x 1 x double>* %17, i32 8, <vscale x 1 x i1> shufflevector (<vscale x 1 x i1> insertelement (<vscale x 1 x i1> undef, i1 true, i32 0), <vscale x 1 x i1> undef, <vscale x 1 x i32> zeroinitializer), i32 %3), !tbaa !4, !llvm.access.group !8
  %18 = and i64 %2, 4294967295
  %index.next = add i64 %index, %18
  %19 = icmp eq i64 %index.next, %wide.trip.count
  br i1 %19, label %for.cond.cleanup, label %vector.body, !llvm.loop !9

for.cond.cleanup:                                 ; preds = %vector.body, %entry
  ret void
}

; Function Attrs: nounwind readnone
declare i64 @llvm.epi.vsetvl(i64, i64, i64) #1

; Function Attrs: argmemonly nosync nounwind readonly willreturn
declare <vscale x 1 x double> @llvm.vp.load.nxv1f64.p0nxv1f64(<vscale x 1 x double>* nocapture, i32 immarg, <vscale x 1 x i1>, i32) #2

; Function Attrs: nounwind readnone willreturn
declare <vscale x 1 x double> @llvm.vp.fmul.nxv1f64(<vscale x 1 x double>, <vscale x 1 x double>, metadata, metadata, <vscale x 1 x i1>, i32) #3

; Function Attrs: nounwind readnone willreturn
declare <vscale x 1 x double> @llvm.vp.fsub.nxv1f64(<vscale x 1 x double>, <vscale x 1 x double>, metadata, metadata, <vscale x 1 x i1>, i32) #3

; Function Attrs: nounwind readnone willreturn
declare <vscale x 1 x double> @llvm.vp.fadd.nxv1f64(<vscale x 1 x double>, <vscale x 1 x double>, metadata, metadata, <vscale x 1 x i1>, i32) #3

; Function Attrs: argmemonly nosync nounwind willreturn writeonly
declare void @llvm.vp.store.nxv1f64.p0nxv1f64(<vscale x 1 x double>, <vscale x 1 x double>* nocapture, i32 immarg, <vscale x 1 x i1>, i32) #4

attributes #0 = { nofree norecurse nounwind "disable-tail-calls"="false" "frame-pointer"="none" "less-precise-fpmad"="false" "min-legal-vector-width"="0" "no-infs-fp-math"="true" "no-jump-tables"="false" "no-nans-fp-math"="true" "no-signed-zeros-fp-math"="true" "no-trapping-math"="true" "stack-protector-buffer-size"="8" "target-features"="+a,+c,+d,+experimental-v,+experimental-zvlsseg,+f,+m,-relax,-save-restore" "unsafe-fp-math"="true" "use-soft-float"="false" }
attributes #1 = { nounwind readnone }
attributes #2 = { argmemonly nosync nounwind readonly willreturn }
attributes #3 = { nounwind readnone willreturn }
attributes #4 = { argmemonly nosync nounwind willreturn writeonly }

!llvm.module.flags = !{!0, !1, !2}
!llvm.ident = !{!3}

!0 = !{i32 1, !"wchar_size", i32 4}
!1 = !{i32 1, !"target-abi", !"lp64d"}
!2 = !{i32 1, !"SmallDataLimit", i32 8}
!3 = !{!"clang version 12.0.0"}
!4 = !{!5, !5, i64 0}
!5 = !{!"double", !6, i64 0}
!6 = !{!"omnipotent char", !7, i64 0}
!7 = !{!"Simple C/C++ TBAA"}
!8 = distinct !{}
!9 = distinct !{!9, !10, !11, !12}
!10 = !{!"llvm.loop.mustprogress"}
!11 = !{!"llvm.loop.parallel_accesses", !8}
!12 = !{!"llvm.loop.isvectorized", i32 1}
