; NOTE: Assertions have been autogenerated by utils/update_llc_test_checks.py
; RUN: llc -mtriple=riscv64 -mattr=+m,+f,+d,+a,+c,+experimental-v,+only-lmul1 \
; RUN:    -target-abi lp64d -verify-machineinstrs < %s | FileCheck %s

define void @foo(<vscale x 2 x i8> %vec, i8* %ptr, <vscale x 2 x i1> %mask, i64 %stride, i32 %evl) {
; CHECK-LABEL: foo:
; CHECK:       # %bb.0:
; CHECK-NEXT:    # kill: def $v0 killed $v0 def $v0m2
; CHECK-NEXT:    vsetvli a3, zero, e32,m1
; CHECK-NEXT:    vsetvli zero, a3, e16,m1
; CHECK-NEXT:    vnsrl.vi v2, v0, 0
; CHECK-NEXT:    vsetvli zero, a3, e8,m1
; CHECK-NEXT:    vnsrl.vi v0, v2, 0
; CHECK-NEXT:    vsetvli zero, a2, e8,m1
; CHECK-NEXT:    vsse.v v16, (a0), a1, v0.t
; CHECK-NEXT:    ret
  call void @llvm.vp.strided.store.nxv2i8.p0i8.i64(<vscale x 2 x i8> %vec, i8* %ptr, i64 %stride, <vscale x 2 x i1> %mask, i32 %evl)
  ret void
}

declare void @llvm.vp.strided.store.nxv2i8.p0i8.i64(<vscale x 2 x i8>, i8* nocapture, i64, <vscale x 2 x i1>, i32) #5
