; NOTE: Assertions have been autogenerated by utils/update_llc_test_checks.py
; RUN: llc -mtriple=riscv64 -mattr=+experimental-v -verify-machineinstrs -O0 \
; RUN:    < %s | FileCheck --check-prefix=CHECK-O0 %s
; RUN: llc -mtriple=riscv64 -mattr=+experimental-v -verify-machineinstrs -O2 \
; RUN:    < %s | FileCheck --check-prefix=CHECK-O2 %s

@scratch = global i8 0, align 16

define void @test_vp_logical(<vscale x 1 x i64>* %a0, <vscale x 1 x i64>* %a1, i32 %n) nounwind {
; CHECK-O0-LABEL: test_vp_logical:
; CHECK-O0:       # %bb.0:
; CHECK-O0-NEXT:    mv a3, a0
; CHECK-O0-NEXT:    # kill: def $x10 killed $x12
; CHECK-O0-NEXT:    lui a0, %hi(scratch)
; CHECK-O0-NEXT:    addi a0, a0, %lo(scratch)
; CHECK-O0-NEXT:    # implicit-def: $v1
; CHECK-O0-NEXT:    vsetvli zero, a2, e64,m1
; CHECK-O0-NEXT:    vle.v v1, (a3)
; CHECK-O0-NEXT:    # implicit-def: $v4
; CHECK-O0-NEXT:    vle.v v4, (a1)
; CHECK-O0-NEXT:    vmand.mm v3, v1, v4
; CHECK-O0-NEXT:    vmor.mm v2, v1, v4
; CHECK-O0-NEXT:    vmxor.mm v1, v1, v4
; CHECK-O0-NEXT:    vsetvli zero, zero, e64,m1
; CHECK-O0-NEXT:    vmcpy.m v3, v3
; CHECK-O0-NEXT:    vmcpy.m v2, v2
; CHECK-O0-NEXT:    vmcpy.m v1, v1
; CHECK-O0-NEXT:    vsetvli zero, a2, e64,m1
; CHECK-O0-NEXT:    vse.v v3, (a0)
; CHECK-O0-NEXT:    vse.v v2, (a0)
; CHECK-O0-NEXT:    vse.v v1, (a0)
; CHECK-O0-NEXT:    ret
;
; CHECK-O2-LABEL: test_vp_logical:
; CHECK-O2:       # %bb.0:
; CHECK-O2-NEXT:    vsetvli zero, a2, e64,m1
; CHECK-O2-NEXT:    vle.v v1, (a0)
; CHECK-O2-NEXT:    vle.v v2, (a1)
; CHECK-O2-NEXT:    lui a0, %hi(scratch)
; CHECK-O2-NEXT:    addi a0, a0, %lo(scratch)
; CHECK-O2-NEXT:    vmand.mm v3, v1, v2
; CHECK-O2-NEXT:    vmor.mm v4, v1, v2
; CHECK-O2-NEXT:    vmxor.mm v1, v1, v2
; CHECK-O2-NEXT:    vsetvli zero, zero, e64,m1
; CHECK-O2-NEXT:    vmcpy.m v2, v3
; CHECK-O2-NEXT:    vmcpy.m v3, v4
; CHECK-O2-NEXT:    vmcpy.m v1, v1
; CHECK-O2-NEXT:    vsetvli zero, a2, e64,m1
; CHECK-O2-NEXT:    vse.v v2, (a0)
; CHECK-O2-NEXT:    vse.v v3, (a0)
; CHECK-O2-NEXT:    vse.v v1, (a0)
; CHECK-O2-NEXT:    ret
  %head = insertelement <vscale x 1 x i1> undef, i1 1, i32 0
  %allones = shufflevector <vscale x 1 x i1> %head, <vscale x 1 x i1> undef, <vscale x 1 x i32> zeroinitializer

  %store_addr = bitcast i8* @scratch to <vscale x 1 x i64>*

  %i0 = call <vscale x 1 x i64> @llvm.vp.load.nxv1i64(<vscale x 1 x i64>* %a0, i32 8, <vscale x 1 x i1> %allones, i32 %n)
  %i1 = call <vscale x 1 x i64> @llvm.vp.load.nxv1i64(<vscale x 1 x i64>* %a1, i32 8, <vscale x 1 x i1> %allones, i32 %n)

  %trunc_i0 = trunc <vscale x 1 x i64> %i0 to <vscale x 1 x i1>
  %trunc_i1 = trunc <vscale x 1 x i64> %i1 to <vscale x 1 x i1>

  %r0 = call <vscale x 1 x i1> @llvm.vp.and.nxv1i1(<vscale x 1 x i1> %trunc_i0, <vscale x 1 x i1> %trunc_i1, <vscale x 1 x i1> %allones, i32 %n)
  %r1 = call <vscale x 1 x i1> @llvm.vp.or.nxv1i1(<vscale x 1 x i1> %trunc_i0, <vscale x 1 x i1> %trunc_i1, <vscale x 1 x i1> %allones, i32 %n)
  %r2 = call <vscale x 1 x i1> @llvm.vp.xor.nxv1i1(<vscale x 1 x i1> %trunc_i0, <vscale x 1 x i1> %trunc_i1, <vscale x 1 x i1> %allones, i32 %n)

  %zext_r0 = zext <vscale x 1 x i1> %r0 to <vscale x 1 x i64>
  %zext_r1 = zext <vscale x 1 x i1> %r1 to <vscale x 1 x i64>
  %zext_r2 = zext <vscale x 1 x i1> %r2 to <vscale x 1 x i64>

  call void @llvm.vp.store.nxv1i64(<vscale x 1 x i64> %zext_r0, <vscale x 1 x i64>* %store_addr, i32 1, <vscale x 1 x i1> %allones, i32 %n)
  call void @llvm.vp.store.nxv1i64(<vscale x 1 x i64> %zext_r1, <vscale x 1 x i64>* %store_addr, i32 1, <vscale x 1 x i1> %allones, i32 %n)
  call void @llvm.vp.store.nxv1i64(<vscale x 1 x i64> %zext_r2, <vscale x 1 x i64>* %store_addr, i32 1, <vscale x 1 x i1> %allones, i32 %n)

  ret void
}

define void @test_vp_logical_2(<vscale x 2 x i32>* %a0, <vscale x 2 x i32>* %a1, i32 %n) nounwind {
; CHECK-O0-LABEL: test_vp_logical_2:
; CHECK-O0:       # %bb.0:
; CHECK-O0-NEXT:    mv a3, a0
; CHECK-O0-NEXT:    # kill: def $x10 killed $x12
; CHECK-O0-NEXT:    lui a0, %hi(scratch)
; CHECK-O0-NEXT:    addi a0, a0, %lo(scratch)
; CHECK-O0-NEXT:    # implicit-def: $v1
; CHECK-O0-NEXT:    vsetvli zero, a2, e32,m1
; CHECK-O0-NEXT:    vle.v v1, (a3)
; CHECK-O0-NEXT:    # implicit-def: $v4
; CHECK-O0-NEXT:    vle.v v4, (a1)
; CHECK-O0-NEXT:    vmand.mm v3, v1, v4
; CHECK-O0-NEXT:    vmor.mm v2, v1, v4
; CHECK-O0-NEXT:    vmxor.mm v1, v1, v4
; CHECK-O0-NEXT:    vsetvli zero, zero, e32,m1
; CHECK-O0-NEXT:    vmcpy.m v3, v3
; CHECK-O0-NEXT:    vmcpy.m v2, v2
; CHECK-O0-NEXT:    vmcpy.m v1, v1
; CHECK-O0-NEXT:    vsetvli zero, a2, e32,m1
; CHECK-O0-NEXT:    vse.v v3, (a0)
; CHECK-O0-NEXT:    vse.v v2, (a0)
; CHECK-O0-NEXT:    vse.v v1, (a0)
; CHECK-O0-NEXT:    ret
;
; CHECK-O2-LABEL: test_vp_logical_2:
; CHECK-O2:       # %bb.0:
; CHECK-O2-NEXT:    vsetvli zero, a2, e32,m1
; CHECK-O2-NEXT:    vle.v v1, (a0)
; CHECK-O2-NEXT:    vle.v v2, (a1)
; CHECK-O2-NEXT:    lui a0, %hi(scratch)
; CHECK-O2-NEXT:    addi a0, a0, %lo(scratch)
; CHECK-O2-NEXT:    vmand.mm v3, v1, v2
; CHECK-O2-NEXT:    vmor.mm v4, v1, v2
; CHECK-O2-NEXT:    vmxor.mm v1, v1, v2
; CHECK-O2-NEXT:    vsetvli zero, zero, e32,m1
; CHECK-O2-NEXT:    vmcpy.m v2, v3
; CHECK-O2-NEXT:    vmcpy.m v3, v4
; CHECK-O2-NEXT:    vmcpy.m v1, v1
; CHECK-O2-NEXT:    vsetvli zero, a2, e32,m1
; CHECK-O2-NEXT:    vse.v v2, (a0)
; CHECK-O2-NEXT:    vse.v v3, (a0)
; CHECK-O2-NEXT:    vse.v v1, (a0)
; CHECK-O2-NEXT:    ret
  %head = insertelement <vscale x 2 x i1> undef, i1 1, i32 0
  %allones = shufflevector <vscale x 2 x i1> %head, <vscale x 2 x i1> undef, <vscale x 2 x i32> zeroinitializer

  %store_addr = bitcast i8* @scratch to <vscale x 2 x i32>*

  %i0 = call <vscale x 2 x i32> @llvm.vp.load.nxv2i32(<vscale x 2 x i32>* %a0, i32 8, <vscale x 2 x i1> %allones, i32 %n)
  %i1 = call <vscale x 2 x i32> @llvm.vp.load.nxv2i32(<vscale x 2 x i32>* %a1, i32 8, <vscale x 2 x i1> %allones, i32 %n)

  %trunc_i0 = trunc <vscale x 2 x i32> %i0 to <vscale x 2 x i1>
  %trunc_i1 = trunc <vscale x 2 x i32> %i1 to <vscale x 2 x i1>

  %r0 = call <vscale x 2 x i1> @llvm.vp.and.nxv2i1(<vscale x 2 x i1> %trunc_i0, <vscale x 2 x i1> %trunc_i1, <vscale x 2 x i1> %allones, i32 %n)
  %r1 = call <vscale x 2 x i1> @llvm.vp.or.nxv2i1(<vscale x 2 x i1> %trunc_i0, <vscale x 2 x i1> %trunc_i1, <vscale x 2 x i1> %allones, i32 %n)
  %r2 = call <vscale x 2 x i1> @llvm.vp.xor.nxv2i1(<vscale x 2 x i1> %trunc_i0, <vscale x 2 x i1> %trunc_i1, <vscale x 2 x i1> %allones, i32 %n)

  %zext_r0 = zext <vscale x 2 x i1> %r0 to <vscale x 2 x i32>
  %zext_r1 = zext <vscale x 2 x i1> %r1 to <vscale x 2 x i32>
  %zext_r2 = zext <vscale x 2 x i1> %r2 to <vscale x 2 x i32>

  call void @llvm.vp.store.nxv2i32(<vscale x 2 x i32> %zext_r0, <vscale x 2 x i32>* %store_addr, i32 2, <vscale x 2 x i1> %allones, i32 %n)
  call void @llvm.vp.store.nxv2i32(<vscale x 2 x i32> %zext_r1, <vscale x 2 x i32>* %store_addr, i32 2, <vscale x 2 x i1> %allones, i32 %n)
  call void @llvm.vp.store.nxv2i32(<vscale x 2 x i32> %zext_r2, <vscale x 2 x i32>* %store_addr, i32 2, <vscale x 2 x i1> %allones, i32 %n)

  ret void
}

define void @test_vp_logical_3(<vscale x 4 x i16>* %a0, <vscale x 4 x i16>* %a1, i32 %n) nounwind {
; CHECK-O0-LABEL: test_vp_logical_3:
; CHECK-O0:       # %bb.0:
; CHECK-O0-NEXT:    mv a3, a0
; CHECK-O0-NEXT:    # kill: def $x10 killed $x12
; CHECK-O0-NEXT:    lui a0, %hi(scratch)
; CHECK-O0-NEXT:    addi a0, a0, %lo(scratch)
; CHECK-O0-NEXT:    # implicit-def: $v1
; CHECK-O0-NEXT:    vsetvli zero, a2, e16,m1
; CHECK-O0-NEXT:    vle.v v1, (a3)
; CHECK-O0-NEXT:    # implicit-def: $v4
; CHECK-O0-NEXT:    vle.v v4, (a1)
; CHECK-O0-NEXT:    vmand.mm v3, v1, v4
; CHECK-O0-NEXT:    vmor.mm v2, v1, v4
; CHECK-O0-NEXT:    vmxor.mm v1, v1, v4
; CHECK-O0-NEXT:    vsetvli zero, zero, e16,m1
; CHECK-O0-NEXT:    vmcpy.m v3, v3
; CHECK-O0-NEXT:    vmcpy.m v2, v2
; CHECK-O0-NEXT:    vmcpy.m v1, v1
; CHECK-O0-NEXT:    vsetvli zero, a2, e16,m1
; CHECK-O0-NEXT:    vse.v v3, (a0)
; CHECK-O0-NEXT:    vse.v v2, (a0)
; CHECK-O0-NEXT:    vse.v v1, (a0)
; CHECK-O0-NEXT:    ret
;
; CHECK-O2-LABEL: test_vp_logical_3:
; CHECK-O2:       # %bb.0:
; CHECK-O2-NEXT:    vsetvli zero, a2, e16,m1
; CHECK-O2-NEXT:    vle.v v1, (a0)
; CHECK-O2-NEXT:    vle.v v2, (a1)
; CHECK-O2-NEXT:    lui a0, %hi(scratch)
; CHECK-O2-NEXT:    addi a0, a0, %lo(scratch)
; CHECK-O2-NEXT:    vmand.mm v3, v1, v2
; CHECK-O2-NEXT:    vmor.mm v4, v1, v2
; CHECK-O2-NEXT:    vmxor.mm v1, v1, v2
; CHECK-O2-NEXT:    vsetvli zero, zero, e16,m1
; CHECK-O2-NEXT:    vmcpy.m v2, v3
; CHECK-O2-NEXT:    vmcpy.m v3, v4
; CHECK-O2-NEXT:    vmcpy.m v1, v1
; CHECK-O2-NEXT:    vsetvli zero, a2, e16,m1
; CHECK-O2-NEXT:    vse.v v2, (a0)
; CHECK-O2-NEXT:    vse.v v3, (a0)
; CHECK-O2-NEXT:    vse.v v1, (a0)
; CHECK-O2-NEXT:    ret
  %head = insertelement <vscale x 4 x i1> undef, i1 1, i32 0
  %allones = shufflevector <vscale x 4 x i1> %head, <vscale x 4 x i1> undef, <vscale x 4 x i32> zeroinitializer

  %store_addr = bitcast i8* @scratch to <vscale x 4 x i16>*

  %i0 = call <vscale x 4 x i16> @llvm.vp.load.nxv4i16(<vscale x 4 x i16>* %a0, i32 1, <vscale x 4 x i1> %allones, i32 %n)
  %i1 = call <vscale x 4 x i16> @llvm.vp.load.nxv4i16(<vscale x 4 x i16>* %a1, i32 1, <vscale x 4 x i1> %allones, i32 %n)

  %trunc_i0 = trunc <vscale x 4 x i16> %i0 to <vscale x 4 x i1>
  %trunc_i1 = trunc <vscale x 4 x i16> %i1 to <vscale x 4 x i1>

  %r0 = call <vscale x 4 x i1> @llvm.vp.and.nxv4i1(<vscale x 4 x i1> %trunc_i0, <vscale x 4 x i1> %trunc_i1, <vscale x 4 x i1> %allones, i32 %n)
  %r1 = call <vscale x 4 x i1> @llvm.vp.or.nxv4i1(<vscale x 4 x i1> %trunc_i0, <vscale x 4 x i1> %trunc_i1, <vscale x 4 x i1> %allones, i32 %n)
  %r2 = call <vscale x 4 x i1> @llvm.vp.xor.nxv4i1(<vscale x 4 x i1> %trunc_i0, <vscale x 4 x i1> %trunc_i1, <vscale x 4 x i1> %allones, i32 %n)

  %zext_r0 = zext <vscale x 4 x i1> %r0 to <vscale x 4 x i16>
  %zext_r1 = zext <vscale x 4 x i1> %r1 to <vscale x 4 x i16>
  %zext_r2 = zext <vscale x 4 x i1> %r2 to <vscale x 4 x i16>

  call void @llvm.vp.store.nxv4i16(<vscale x 4 x i16> %zext_r0, <vscale x 4 x i16>* %store_addr, i32 1, <vscale x 4 x i1> %allones, i32 %n)
  call void @llvm.vp.store.nxv4i16(<vscale x 4 x i16> %zext_r1, <vscale x 4 x i16>* %store_addr, i32 1, <vscale x 4 x i1> %allones, i32 %n)
  call void @llvm.vp.store.nxv4i16(<vscale x 4 x i16> %zext_r2, <vscale x 4 x i16>* %store_addr, i32 1, <vscale x 4 x i1> %allones, i32 %n)

  ret void
}

define void @test_vp_logical_4(<vscale x 8 x i8>* %a0, <vscale x 8 x i8>* %a1, i32 %n) nounwind {
; CHECK-O0-LABEL: test_vp_logical_4:
; CHECK-O0:       # %bb.0:
; CHECK-O0-NEXT:    mv a3, a0
; CHECK-O0-NEXT:    # kill: def $x10 killed $x12
; CHECK-O0-NEXT:    lui a0, %hi(scratch)
; CHECK-O0-NEXT:    addi a0, a0, %lo(scratch)
; CHECK-O0-NEXT:    # implicit-def: $v1
; CHECK-O0-NEXT:    vsetvli zero, a2, e8,m1
; CHECK-O0-NEXT:    vle.v v1, (a3)
; CHECK-O0-NEXT:    # implicit-def: $v4
; CHECK-O0-NEXT:    vle.v v4, (a1)
; CHECK-O0-NEXT:    vmand.mm v3, v1, v4
; CHECK-O0-NEXT:    vmor.mm v2, v1, v4
; CHECK-O0-NEXT:    vmxor.mm v1, v1, v4
; CHECK-O0-NEXT:    vsetvli zero, zero, e8,m1
; CHECK-O0-NEXT:    vmcpy.m v3, v3
; CHECK-O0-NEXT:    vmcpy.m v2, v2
; CHECK-O0-NEXT:    vmcpy.m v1, v1
; CHECK-O0-NEXT:    vsetvli zero, a2, e8,m1
; CHECK-O0-NEXT:    vse.v v3, (a0)
; CHECK-O0-NEXT:    vse.v v2, (a0)
; CHECK-O0-NEXT:    vse.v v1, (a0)
; CHECK-O0-NEXT:    ret
;
; CHECK-O2-LABEL: test_vp_logical_4:
; CHECK-O2:       # %bb.0:
; CHECK-O2-NEXT:    vsetvli zero, a2, e8,m1
; CHECK-O2-NEXT:    vle.v v1, (a0)
; CHECK-O2-NEXT:    vle.v v2, (a1)
; CHECK-O2-NEXT:    lui a0, %hi(scratch)
; CHECK-O2-NEXT:    addi a0, a0, %lo(scratch)
; CHECK-O2-NEXT:    vmand.mm v3, v1, v2
; CHECK-O2-NEXT:    vmor.mm v4, v1, v2
; CHECK-O2-NEXT:    vmxor.mm v1, v1, v2
; CHECK-O2-NEXT:    vsetvli zero, zero, e8,m1
; CHECK-O2-NEXT:    vmcpy.m v2, v3
; CHECK-O2-NEXT:    vmcpy.m v3, v4
; CHECK-O2-NEXT:    vmcpy.m v1, v1
; CHECK-O2-NEXT:    vsetvli zero, a2, e8,m1
; CHECK-O2-NEXT:    vse.v v2, (a0)
; CHECK-O2-NEXT:    vse.v v3, (a0)
; CHECK-O2-NEXT:    vse.v v1, (a0)
; CHECK-O2-NEXT:    ret
  %head = insertelement <vscale x 8 x i1> undef, i1 1, i32 0
  %allones = shufflevector <vscale x 8 x i1> %head, <vscale x 8 x i1> undef, <vscale x 8 x i32> zeroinitializer

  %store_addr = bitcast i8* @scratch to <vscale x 8 x i8>*

  %i0 = call <vscale x 8 x i8> @llvm.vp.load.nxv8i8(<vscale x 8 x i8>* %a0, i32 1, <vscale x 8 x i1> %allones, i32 %n)
  %i1 = call <vscale x 8 x i8> @llvm.vp.load.nxv8i8(<vscale x 8 x i8>* %a1, i32 1, <vscale x 8 x i1> %allones, i32 %n)

  %trunc_i0 = trunc <vscale x 8 x i8> %i0 to <vscale x 8 x i1>
  %trunc_i1 = trunc <vscale x 8 x i8> %i1 to <vscale x 8 x i1>

  %r0 = call <vscale x 8 x i1> @llvm.vp.and.nxv8i1(<vscale x 8 x i1> %trunc_i0, <vscale x 8 x i1> %trunc_i1, <vscale x 8 x i1> %allones, i32 %n)
  %r1 = call <vscale x 8 x i1> @llvm.vp.or.nxv8i1(<vscale x 8 x i1> %trunc_i0, <vscale x 8 x i1> %trunc_i1, <vscale x 8 x i1> %allones, i32 %n)
  %r2 = call <vscale x 8 x i1> @llvm.vp.xor.nxv8i1(<vscale x 8 x i1> %trunc_i0, <vscale x 8 x i1> %trunc_i1, <vscale x 8 x i1> %allones, i32 %n)

  %zext_r0 = zext <vscale x 8 x i1> %r0 to <vscale x 8 x i8>
  %zext_r1 = zext <vscale x 8 x i1> %r1 to <vscale x 8 x i8>
  %zext_r2 = zext <vscale x 8 x i1> %r2 to <vscale x 8 x i8>

  call void @llvm.vp.store.nxv8i8(<vscale x 8 x i8> %zext_r0, <vscale x 8 x i8>* %store_addr, i32 1, <vscale x 8 x i1> %allones, i32 %n)
  call void @llvm.vp.store.nxv8i8(<vscale x 8 x i8> %zext_r1, <vscale x 8 x i8>* %store_addr, i32 1, <vscale x 8 x i1> %allones, i32 %n)
  call void @llvm.vp.store.nxv8i8(<vscale x 8 x i8> %zext_r2, <vscale x 8 x i8>* %store_addr, i32 1, <vscale x 8 x i1> %allones, i32 %n)

  ret void
}

define void @test_vp_logical_5(<vscale x 16 x i8>* %a0, <vscale x 16 x i8>* %a1, i32 %n) nounwind {
; CHECK-O0-LABEL: test_vp_logical_5:
; CHECK-O0:       # %bb.0:
; CHECK-O0-NEXT:    addi sp, sp, -64
; CHECK-O0-NEXT:    sd ra, 56(sp) # 8-byte Folded Spill
; CHECK-O0-NEXT:    sd s0, 48(sp) # 8-byte Folded Spill
; CHECK-O0-NEXT:    addi s0, sp, 64
; CHECK-O0-NEXT:    rdvtype ra
; CHECK-O0-NEXT:    rdvl t0
; CHECK-O0-NEXT:    vsetvli a3, zero, e8,m1
; CHECK-O0-NEXT:    vsetvl zero, t0, ra
; CHECK-O0-NEXT:    sub sp, sp, a3
; CHECK-O0-NEXT:    sd sp, -56(s0)
; CHECK-O0-NEXT:    sub sp, sp, a3
; CHECK-O0-NEXT:    sd sp, -64(s0)
; CHECK-O0-NEXT:    mv a3, a0
; CHECK-O0-NEXT:    # kill: def $x10 killed $x12
; CHECK-O0-NEXT:    lui a0, %hi(scratch)
; CHECK-O0-NEXT:    addi a0, a0, %lo(scratch)
; CHECK-O0-NEXT:    # implicit-def: $v2m2
; CHECK-O0-NEXT:    vsetvli zero, a2, e8,m2
; CHECK-O0-NEXT:    vle.v v2, (a3)
; CHECK-O0-NEXT:    # implicit-def: $v4m2
; CHECK-O0-NEXT:    vle.v v4, (a1)
; CHECK-O0-NEXT:    # implicit-def: $v6m2
; CHECK-O0-NEXT:    vsetvli zero, zero, e8,m2
; CHECK-O0-NEXT:    vand.vi v6, v2, 1
; CHECK-O0-NEXT:    vmv.v.i v2, 0
; CHECK-O0-NEXT:    # implicit-def: $v1
; CHECK-O0-NEXT:    vmsne.vv v1, v6, v2
; CHECK-O0-NEXT:    # implicit-def: $v6m2
; CHECK-O0-NEXT:    vand.vi v6, v4, 1
; CHECK-O0-NEXT:    # implicit-def: $v4
; CHECK-O0-NEXT:    vmsne.vv v4, v6, v2
; CHECK-O0-NEXT:    vsetvli zero, a2, e8,m2
; CHECK-O0-NEXT:    vmand.mm v0, v1, v4
; CHECK-O0-NEXT:    vmor.mm v5, v1, v4
; CHECK-O0-NEXT:    ld a4, -64(s0)
; CHECK-O0-NEXT:    rdvtype a3
; CHECK-O0-NEXT:    rdvl a1
; CHECK-O0-NEXT:    vsetvli zero, zero, e64,m1
; CHECK-O0-NEXT:    vse.v v5, (a4)
; CHECK-O0-NEXT:    vsetvl zero, a1, a3
; CHECK-O0-NEXT:    vmxor.mm v1, v1, v4
; CHECK-O0-NEXT:    ld a4, -56(s0)
; CHECK-O0-NEXT:    rdvtype a3
; CHECK-O0-NEXT:    rdvl a1
; CHECK-O0-NEXT:    vsetvli zero, zero, e64,m1
; CHECK-O0-NEXT:    vse.v v1, (a4)
; CHECK-O0-NEXT:    vsetvl zero, a1, a3
; CHECK-O0-NEXT:    vsetvli zero, zero, e8,m2
; CHECK-O0-NEXT:    vmerge.vim v6, v2, 1, v0
; CHECK-O0-NEXT:    ld a4, -64(s0)
; CHECK-O0-NEXT:    rdvtype a3
; CHECK-O0-NEXT:    rdvl a1
; CHECK-O0-NEXT:    vsetvli zero, zero, e64,m1
; CHECK-O0-NEXT:    # implicit-def: $v0
; CHECK-O0-NEXT:    vle.v v0, (a4)
; CHECK-O0-NEXT:    vsetvl zero, a1, a3
; CHECK-O0-NEXT:    vmerge.vim v4, v2, 1, v0
; CHECK-O0-NEXT:    ld a4, -56(s0)
; CHECK-O0-NEXT:    rdvtype a3
; CHECK-O0-NEXT:    rdvl a1
; CHECK-O0-NEXT:    vsetvli zero, zero, e64,m1
; CHECK-O0-NEXT:    # implicit-def: $v0
; CHECK-O0-NEXT:    vle.v v0, (a4)
; CHECK-O0-NEXT:    vsetvl zero, a1, a3
; CHECK-O0-NEXT:    vmerge.vim v2, v2, 1, v0
; CHECK-O0-NEXT:    vsetvli zero, a2, e8,m2
; CHECK-O0-NEXT:    vse.v v6, (a0)
; CHECK-O0-NEXT:    vse.v v4, (a0)
; CHECK-O0-NEXT:    vse.v v2, (a0)
; CHECK-O0-NEXT:    addi sp, s0, -64
; CHECK-O0-NEXT:    ld s0, 48(sp) # 8-byte Folded Reload
; CHECK-O0-NEXT:    ld ra, 56(sp) # 8-byte Folded Reload
; CHECK-O0-NEXT:    addi sp, sp, 64
; CHECK-O0-NEXT:    ret
;
; CHECK-O2-LABEL: test_vp_logical_5:
; CHECK-O2:       # %bb.0:
; CHECK-O2-NEXT:    lui a3, %hi(scratch)
; CHECK-O2-NEXT:    vsetvli zero, a2, e8,m2
; CHECK-O2-NEXT:    vle.v v2, (a0)
; CHECK-O2-NEXT:    addi a0, a3, %lo(scratch)
; CHECK-O2-NEXT:    vle.v v4, (a1)
; CHECK-O2-NEXT:    vsetvli zero, zero, e8,m2
; CHECK-O2-NEXT:    vand.vi v2, v2, 1
; CHECK-O2-NEXT:    vmv.v.i v6, 0
; CHECK-O2-NEXT:    vmsne.vv v2, v2, v6
; CHECK-O2-NEXT:    vand.vi v4, v4, 1
; CHECK-O2-NEXT:    vmsne.vv v3, v4, v6
; CHECK-O2-NEXT:    vsetvli zero, a2, e8,m2
; CHECK-O2-NEXT:    vmand.mm v0, v2, v3
; CHECK-O2-NEXT:    vmor.mm v1, v2, v3
; CHECK-O2-NEXT:    vmxor.mm v2, v2, v3
; CHECK-O2-NEXT:    vsetvli zero, zero, e8,m2
; CHECK-O2-NEXT:    vmerge.vim v4, v6, 1, v0
; CHECK-O2-NEXT:    rdvtype t0
; CHECK-O2-NEXT:    rdvl t1
; CHECK-O2-NEXT:    vsetvli zero, zero, e64,m1
; CHECK-O2-NEXT:    vmv.v.v v0, v1
; CHECK-O2-NEXT:    vsetvl zero, t1, t0
; CHECK-O2-NEXT:    vmerge.vim v16, v6, 1, v0
; CHECK-O2-NEXT:    rdvtype t0
; CHECK-O2-NEXT:    rdvl t1
; CHECK-O2-NEXT:    vsetvli zero, zero, e64,m1
; CHECK-O2-NEXT:    vmv.v.v v0, v2
; CHECK-O2-NEXT:    vsetvl zero, t1, t0
; CHECK-O2-NEXT:    vmerge.vim v2, v6, 1, v0
; CHECK-O2-NEXT:    vsetvli zero, a2, e8,m2
; CHECK-O2-NEXT:    vse.v v4, (a0)
; CHECK-O2-NEXT:    vse.v v16, (a0)
; CHECK-O2-NEXT:    vse.v v2, (a0)
; CHECK-O2-NEXT:    ret
  %head = insertelement <vscale x 16 x i1> undef, i1 1, i32 0
  %allones = shufflevector <vscale x 16 x i1> %head, <vscale x 16 x i1> undef, <vscale x 16 x i32> zeroinitializer

  %store_addr = bitcast i8* @scratch to <vscale x 16 x i8>*

  %i0 = call <vscale x 16 x i8> @llvm.vp.load.nxv16i8(<vscale x 16 x i8>* %a0, i32 1, <vscale x 16 x i1> %allones, i32 %n)
  %i1 = call <vscale x 16 x i8> @llvm.vp.load.nxv16i8(<vscale x 16 x i8>* %a1, i32 1, <vscale x 16 x i1> %allones, i32 %n)

  %trunc_i0 = trunc <vscale x 16 x i8> %i0 to <vscale x 16 x i1>
  %trunc_i1 = trunc <vscale x 16 x i8> %i1 to <vscale x 16 x i1>

  %r0 = call <vscale x 16 x i1> @llvm.vp.and.nxv16i1(<vscale x 16 x i1> %trunc_i0, <vscale x 16 x i1> %trunc_i1, <vscale x 16 x i1> %allones, i32 %n)
  %r1 = call <vscale x 16 x i1> @llvm.vp.or.nxv16i1(<vscale x 16 x i1> %trunc_i0, <vscale x 16 x i1> %trunc_i1, <vscale x 16 x i1> %allones, i32 %n)
  %r2 = call <vscale x 16 x i1> @llvm.vp.xor.nxv16i1(<vscale x 16 x i1> %trunc_i0, <vscale x 16 x i1> %trunc_i1, <vscale x 16 x i1> %allones, i32 %n)

  %zext_r0 = zext <vscale x 16 x i1> %r0 to <vscale x 16 x i8>
  %zext_r1 = zext <vscale x 16 x i1> %r1 to <vscale x 16 x i8>
  %zext_r2 = zext <vscale x 16 x i1> %r2 to <vscale x 16 x i8>

  call void @llvm.vp.store.nxv16i8(<vscale x 16 x i8> %zext_r0, <vscale x 16 x i8>* %store_addr, i32 1, <vscale x 16 x i1> %allones, i32 %n)
  call void @llvm.vp.store.nxv16i8(<vscale x 16 x i8> %zext_r1, <vscale x 16 x i8>* %store_addr, i32 1, <vscale x 16 x i1> %allones, i32 %n)
  call void @llvm.vp.store.nxv16i8(<vscale x 16 x i8> %zext_r2, <vscale x 16 x i8>* %store_addr, i32 1, <vscale x 16 x i1> %allones, i32 %n)

  ret void
}

define void @test_vp_logical_6(<vscale x 32 x i8>* %a0, <vscale x 32 x i8>* %a1, i32 %n) nounwind {
; CHECK-O0-LABEL: test_vp_logical_6:
; CHECK-O0:       # %bb.0:
; CHECK-O0-NEXT:    addi sp, sp, -64
; CHECK-O0-NEXT:    sd ra, 56(sp) # 8-byte Folded Spill
; CHECK-O0-NEXT:    sd s0, 48(sp) # 8-byte Folded Spill
; CHECK-O0-NEXT:    addi s0, sp, 64
; CHECK-O0-NEXT:    rdvtype ra
; CHECK-O0-NEXT:    rdvl t0
; CHECK-O0-NEXT:    vsetvli a3, zero, e8,m1
; CHECK-O0-NEXT:    vsetvl zero, t0, ra
; CHECK-O0-NEXT:    sub sp, sp, a3
; CHECK-O0-NEXT:    sd sp, -56(s0)
; CHECK-O0-NEXT:    sub sp, sp, a3
; CHECK-O0-NEXT:    sd sp, -64(s0)
; CHECK-O0-NEXT:    mv a3, a0
; CHECK-O0-NEXT:    # kill: def $x10 killed $x12
; CHECK-O0-NEXT:    lui a0, %hi(scratch)
; CHECK-O0-NEXT:    addi a0, a0, %lo(scratch)
; CHECK-O0-NEXT:    # implicit-def: $v4m4
; CHECK-O0-NEXT:    vsetvli zero, a2, e8,m4
; CHECK-O0-NEXT:    vle.v v4, (a3)
; CHECK-O0-NEXT:    # implicit-def: $v20m4
; CHECK-O0-NEXT:    vle.v v20, (a1)
; CHECK-O0-NEXT:    # implicit-def: $v16m4
; CHECK-O0-NEXT:    vsetvli zero, zero, e8,m4
; CHECK-O0-NEXT:    vand.vi v16, v4, 1
; CHECK-O0-NEXT:    vmv.v.i v4, 0
; CHECK-O0-NEXT:    # implicit-def: $v1
; CHECK-O0-NEXT:    vmsne.vv v1, v16, v4
; CHECK-O0-NEXT:    # implicit-def: $v16m4
; CHECK-O0-NEXT:    vand.vi v16, v20, 1
; CHECK-O0-NEXT:    # implicit-def: $v2
; CHECK-O0-NEXT:    vmsne.vv v2, v16, v4
; CHECK-O0-NEXT:    vsetvli zero, a2, e8,m4
; CHECK-O0-NEXT:    vmand.mm v0, v1, v2
; CHECK-O0-NEXT:    vmor.mm v3, v1, v2
; CHECK-O0-NEXT:    ld a4, -64(s0)
; CHECK-O0-NEXT:    rdvtype a3
; CHECK-O0-NEXT:    rdvl a1
; CHECK-O0-NEXT:    vsetvli zero, zero, e64,m1
; CHECK-O0-NEXT:    vse.v v3, (a4)
; CHECK-O0-NEXT:    vsetvl zero, a1, a3
; CHECK-O0-NEXT:    vmxor.mm v1, v1, v2
; CHECK-O0-NEXT:    ld a4, -56(s0)
; CHECK-O0-NEXT:    rdvtype a3
; CHECK-O0-NEXT:    rdvl a1
; CHECK-O0-NEXT:    vsetvli zero, zero, e64,m1
; CHECK-O0-NEXT:    vse.v v1, (a4)
; CHECK-O0-NEXT:    vsetvl zero, a1, a3
; CHECK-O0-NEXT:    vsetvli zero, zero, e8,m4
; CHECK-O0-NEXT:    vmerge.vim v20, v4, 1, v0
; CHECK-O0-NEXT:    ld a4, -64(s0)
; CHECK-O0-NEXT:    rdvtype a3
; CHECK-O0-NEXT:    rdvl a1
; CHECK-O0-NEXT:    vsetvli zero, zero, e64,m1
; CHECK-O0-NEXT:    # implicit-def: $v0
; CHECK-O0-NEXT:    vle.v v0, (a4)
; CHECK-O0-NEXT:    vsetvl zero, a1, a3
; CHECK-O0-NEXT:    vmerge.vim v16, v4, 1, v0
; CHECK-O0-NEXT:    ld a4, -56(s0)
; CHECK-O0-NEXT:    rdvtype a3
; CHECK-O0-NEXT:    rdvl a1
; CHECK-O0-NEXT:    vsetvli zero, zero, e64,m1
; CHECK-O0-NEXT:    # implicit-def: $v0
; CHECK-O0-NEXT:    vle.v v0, (a4)
; CHECK-O0-NEXT:    vsetvl zero, a1, a3
; CHECK-O0-NEXT:    vmerge.vim v4, v4, 1, v0
; CHECK-O0-NEXT:    vsetvli zero, a2, e8,m4
; CHECK-O0-NEXT:    vse.v v20, (a0)
; CHECK-O0-NEXT:    vse.v v16, (a0)
; CHECK-O0-NEXT:    vse.v v4, (a0)
; CHECK-O0-NEXT:    addi sp, s0, -64
; CHECK-O0-NEXT:    ld s0, 48(sp) # 8-byte Folded Reload
; CHECK-O0-NEXT:    ld ra, 56(sp) # 8-byte Folded Reload
; CHECK-O0-NEXT:    addi sp, sp, 64
; CHECK-O0-NEXT:    ret
;
; CHECK-O2-LABEL: test_vp_logical_6:
; CHECK-O2:       # %bb.0:
; CHECK-O2-NEXT:    lui a3, %hi(scratch)
; CHECK-O2-NEXT:    vsetvli zero, a2, e8,m4
; CHECK-O2-NEXT:    vle.v v4, (a0)
; CHECK-O2-NEXT:    addi a0, a3, %lo(scratch)
; CHECK-O2-NEXT:    vle.v v16, (a1)
; CHECK-O2-NEXT:    vsetvli zero, zero, e8,m4
; CHECK-O2-NEXT:    vand.vi v4, v4, 1
; CHECK-O2-NEXT:    vmv.v.i v20, 0
; CHECK-O2-NEXT:    vmsne.vv v2, v4, v20
; CHECK-O2-NEXT:    vand.vi v4, v16, 1
; CHECK-O2-NEXT:    vmsne.vv v3, v4, v20
; CHECK-O2-NEXT:    vsetvli zero, a2, e8,m4
; CHECK-O2-NEXT:    vmand.mm v0, v2, v3
; CHECK-O2-NEXT:    vmor.mm v1, v2, v3
; CHECK-O2-NEXT:    vmxor.mm v2, v2, v3
; CHECK-O2-NEXT:    vsetvli zero, zero, e8,m4
; CHECK-O2-NEXT:    vmerge.vim v4, v20, 1, v0
; CHECK-O2-NEXT:    rdvtype t0
; CHECK-O2-NEXT:    rdvl t1
; CHECK-O2-NEXT:    vsetvli zero, zero, e64,m1
; CHECK-O2-NEXT:    vmv.v.v v0, v1
; CHECK-O2-NEXT:    vsetvl zero, t1, t0
; CHECK-O2-NEXT:    vmerge.vim v16, v20, 1, v0
; CHECK-O2-NEXT:    rdvtype t0
; CHECK-O2-NEXT:    rdvl t1
; CHECK-O2-NEXT:    vsetvli zero, zero, e64,m1
; CHECK-O2-NEXT:    vmv.v.v v0, v2
; CHECK-O2-NEXT:    vsetvl zero, t1, t0
; CHECK-O2-NEXT:    vmerge.vim v20, v20, 1, v0
; CHECK-O2-NEXT:    vsetvli zero, a2, e8,m4
; CHECK-O2-NEXT:    vse.v v4, (a0)
; CHECK-O2-NEXT:    vse.v v16, (a0)
; CHECK-O2-NEXT:    vse.v v20, (a0)
; CHECK-O2-NEXT:    ret
  %head = insertelement <vscale x 32 x i1> undef, i1 1, i32 0
  %allones = shufflevector <vscale x 32 x i1> %head, <vscale x 32 x i1> undef, <vscale x 32 x i32> zeroinitializer

  %store_addr = bitcast i8* @scratch to <vscale x 32 x i8>*

  %i0 = call <vscale x 32 x i8> @llvm.vp.load.nxv32i8(<vscale x 32 x i8>* %a0, i32 1, <vscale x 32 x i1> %allones, i32 %n)
  %i1 = call <vscale x 32 x i8> @llvm.vp.load.nxv32i8(<vscale x 32 x i8>* %a1, i32 1, <vscale x 32 x i1> %allones, i32 %n)

  %trunc_i0 = trunc <vscale x 32 x i8> %i0 to <vscale x 32 x i1>
  %trunc_i1 = trunc <vscale x 32 x i8> %i1 to <vscale x 32 x i1>

  %r0 = call <vscale x 32 x i1> @llvm.vp.and.nxv32i1(<vscale x 32 x i1> %trunc_i0, <vscale x 32 x i1> %trunc_i1, <vscale x 32 x i1> %allones, i32 %n)
  %r1 = call <vscale x 32 x i1> @llvm.vp.or.nxv32i1(<vscale x 32 x i1> %trunc_i0, <vscale x 32 x i1> %trunc_i1, <vscale x 32 x i1> %allones, i32 %n)
  %r2 = call <vscale x 32 x i1> @llvm.vp.xor.nxv32i1(<vscale x 32 x i1> %trunc_i0, <vscale x 32 x i1> %trunc_i1, <vscale x 32 x i1> %allones, i32 %n)

  %zext_r0 = zext <vscale x 32 x i1> %r0 to <vscale x 32 x i8>
  %zext_r1 = zext <vscale x 32 x i1> %r1 to <vscale x 32 x i8>
  %zext_r2 = zext <vscale x 32 x i1> %r2 to <vscale x 32 x i8>

  call void @llvm.vp.store.nxv32i8(<vscale x 32 x i8> %zext_r0, <vscale x 32 x i8>* %store_addr, i32 1, <vscale x 32 x i1> %allones, i32 %n)
  call void @llvm.vp.store.nxv32i8(<vscale x 32 x i8> %zext_r1, <vscale x 32 x i8>* %store_addr, i32 1, <vscale x 32 x i1> %allones, i32 %n)
  call void @llvm.vp.store.nxv32i8(<vscale x 32 x i8> %zext_r2, <vscale x 32 x i8>* %store_addr, i32 1, <vscale x 32 x i1> %allones, i32 %n)

  ret void
}

; FIXME: Enable when nxv64i8 is supported.
;define void @test_vp_logical_7(<vscale x 64 x i8>* %a0, <vscale x 64 x i8>* %a1, i32 %n) nounwind {
;  %head = insertelement <vscale x 64 x i1> undef, i1 1, i32 0
;  %allones = shufflevector <vscale x 64 x i1> %head, <vscale x 64 x i1> undef, <vscale x 64 x i32> zeroinitializer
;
;  %store_addr = bitcast i8* @scratch to <vscale x 64 x i8>*
;
;  %i0 = call <vscale x 64 x i8> @llvm.vp.load.nxv64i8(<vscale x 64 x i8>* %a0, i32 1, <vscale x 64 x i1> %allones, i32 %n)
;  %i1 = call <vscale x 64 x i8> @llvm.vp.load.nxv64i8(<vscale x 64 x i8>* %a1, i32 1, <vscale x 64 x i1> %allones, i32 %n)
;
;  %trunc_i0 = trunc <vscale x 64 x i8> %i0 to <vscale x 64 x i1>
;  %trunc_i1 = trunc <vscale x 64 x i8> %i1 to <vscale x 64 x i1>
;
;  %r0 = call <vscale x 64 x i1> @llvm.vp.and.nxv64i1(<vscale x 64 x i1> %trunc_i0, <vscale x 64 x i1> %trunc_i1, <vscale x 64 x i1> %allones, i32 %n)
;  %r1 = call <vscale x 64 x i1> @llvm.vp.or.nxv64i1(<vscale x 64 x i1> %trunc_i0, <vscale x 64 x i1> %trunc_i1, <vscale x 64 x i1> %allones, i32 %n)
;  %r2 = call <vscale x 64 x i1> @llvm.vp.xor.nxv64i1(<vscale x 64 x i1> %trunc_i0, <vscale x 64 x i1> %trunc_i1, <vscale x 64 x i1> %allones, i32 %n)
;
;  %zext_r0 = zext <vscale x 64 x i1> %r0 to <vscale x 64 x i8>
;  %zext_r1 = zext <vscale x 64 x i1> %r1 to <vscale x 64 x i8>
;  %zext_r2 = zext <vscale x 64 x i1> %r2 to <vscale x 64 x i8>
;
;  call void @llvm.vp.store.nxv64i8(<vscale x 64 x i8> %zext_r0, <vscale x 64 x i8>* %store_addr, i32 1, <vscale x 64 x i1> %allones, i32 %n)
;  call void @llvm.vp.store.nxv64i8(<vscale x 64 x i8> %zext_r1, <vscale x 64 x i8>* %store_addr, i32 1, <vscale x 64 x i1> %allones, i32 %n)
;  call void @llvm.vp.store.nxv64i8(<vscale x 64 x i8> %zext_r2, <vscale x 64 x i8>* %store_addr, i32 1, <vscale x 64 x i1> %allones, i32 %n)
;
;  ret void
;}

declare <vscale x 1 x i64> @llvm.vp.load.nxv1i64(<vscale x 1 x i64>*, i32, <vscale x 1 x i1>, i32)
declare <vscale x 2 x i32> @llvm.vp.load.nxv2i32(<vscale x 2 x i32>*, i32, <vscale x 2 x i1>, i32)
declare <vscale x 4 x i16> @llvm.vp.load.nxv4i16(<vscale x 4 x i16>*, i32, <vscale x 4 x i1>, i32)
declare <vscale x 8 x i8> @llvm.vp.load.nxv8i8(<vscale x 8 x i8>*, i32, <vscale x 8 x i1>, i32)
declare <vscale x 16 x i8> @llvm.vp.load.nxv16i8(<vscale x 16 x i8>*, i32, <vscale x 16 x i1>, i32)
declare <vscale x 32 x i8> @llvm.vp.load.nxv32i8(<vscale x 32 x i8>*, i32, <vscale x 32 x i1>, i32)
declare <vscale x 64 x i8> @llvm.vp.load.nxv64i8(<vscale x 64 x i8>*, i32, <vscale x 64 x i1>, i32)

declare void @llvm.vp.store.nxv1i64(<vscale x 1 x i64>, <vscale x 1 x i64>*, i32, <vscale x 1 x i1>, i32)
declare void @llvm.vp.store.nxv2i32(<vscale x 2 x i32>, <vscale x 2 x i32>*, i32, <vscale x 2 x i1>, i32)
declare void @llvm.vp.store.nxv4i16(<vscale x 4 x i16>, <vscale x 4 x i16>*, i32, <vscale x 4 x i1>, i32)
declare void @llvm.vp.store.nxv8i8(<vscale x 8 x i8>, <vscale x 8 x i8>*, i32, <vscale x 8 x i1>, i32)
declare void @llvm.vp.store.nxv16i8(<vscale x 16 x i8>, <vscale x 16 x i8>*, i32, <vscale x 16 x i1>, i32)
declare void @llvm.vp.store.nxv32i8(<vscale x 32 x i8>, <vscale x 32 x i8>*, i32, <vscale x 32 x i1>, i32)
declare void @llvm.vp.store.nxv64i8(<vscale x 64 x i8>, <vscale x 64 x i8>*, i32, <vscale x 64 x i1>, i32)

declare <vscale x 1 x i1> @llvm.vp.and.nxv1i1(<vscale x 1 x i1>, <vscale x 1 x i1>, <vscale x 1 x i1>, i32)
declare <vscale x 1 x i1> @llvm.vp.or.nxv1i1(<vscale x 1 x i1>, <vscale x 1 x i1>, <vscale x 1 x i1>, i32)
declare <vscale x 1 x i1> @llvm.vp.xor.nxv1i1(<vscale x 1 x i1>, <vscale x 1 x i1>, <vscale x 1 x i1>, i32)

declare <vscale x 2 x i1> @llvm.vp.and.nxv2i1(<vscale x 2 x i1>, <vscale x 2 x i1>, <vscale x 2 x i1>, i32)
declare <vscale x 2 x i1> @llvm.vp.or.nxv2i1(<vscale x 2 x i1>, <vscale x 2 x i1>, <vscale x 2 x i1>, i32)
declare <vscale x 2 x i1> @llvm.vp.xor.nxv2i1(<vscale x 2 x i1>, <vscale x 2 x i1>, <vscale x 2 x i1>, i32)

declare <vscale x 4 x i1> @llvm.vp.and.nxv4i1(<vscale x 4 x i1>, <vscale x 4 x i1>, <vscale x 4 x i1>, i32)
declare <vscale x 4 x i1> @llvm.vp.or.nxv4i1(<vscale x 4 x i1>, <vscale x 4 x i1>, <vscale x 4 x i1>, i32)
declare <vscale x 4 x i1> @llvm.vp.xor.nxv4i1(<vscale x 4 x i1>, <vscale x 4 x i1>, <vscale x 4 x i1>, i32)

declare <vscale x 8 x i1> @llvm.vp.and.nxv8i1(<vscale x 8 x i1>, <vscale x 8 x i1>, <vscale x 8 x i1>, i32)
declare <vscale x 8 x i1> @llvm.vp.or.nxv8i1(<vscale x 8 x i1>, <vscale x 8 x i1>, <vscale x 8 x i1>, i32)
declare <vscale x 8 x i1> @llvm.vp.xor.nxv8i1(<vscale x 8 x i1>, <vscale x 8 x i1>, <vscale x 8 x i1>, i32)

declare <vscale x 16 x i1> @llvm.vp.and.nxv16i1(<vscale x 16 x i1>, <vscale x 16 x i1>, <vscale x 16 x i1>, i32)
declare <vscale x 16 x i1> @llvm.vp.or.nxv16i1(<vscale x 16 x i1>, <vscale x 16 x i1>, <vscale x 16 x i1>, i32)
declare <vscale x 16 x i1> @llvm.vp.xor.nxv16i1(<vscale x 16 x i1>, <vscale x 16 x i1>, <vscale x 16 x i1>, i32)

declare <vscale x 32 x i1> @llvm.vp.and.nxv32i1(<vscale x 32 x i1>, <vscale x 32 x i1>, <vscale x 32 x i1>, i32)
declare <vscale x 32 x i1> @llvm.vp.or.nxv32i1(<vscale x 32 x i1>, <vscale x 32 x i1>, <vscale x 32 x i1>, i32)
declare <vscale x 32 x i1> @llvm.vp.xor.nxv32i1(<vscale x 32 x i1>, <vscale x 32 x i1>, <vscale x 32 x i1>, i32)

declare <vscale x 64 x i1> @llvm.vp.and.nxv64i1(<vscale x 64 x i1>, <vscale x 64 x i1>, <vscale x 64 x i1>, i32)
declare <vscale x 64 x i1> @llvm.vp.or.nxv64i1(<vscale x 64 x i1>, <vscale x 64 x i1>, <vscale x 64 x i1>, i32)
declare <vscale x 64 x i1> @llvm.vp.xor.nxv64i1(<vscale x 64 x i1>, <vscale x 64 x i1>, <vscale x 64 x i1>, i32)
