; NOTE: Assertions have been autogenerated by utils/update_test_checks.py
; RUN: opt -S --passes='loop-mssa(licm),instsimplify' -o - < %s | FileCheck %s

; ModuleID = 'custom/LICM/vp_fdiv-to-vp_fmul.c'
source_filename = "custom/LICM/vp_fdiv-to-vp_fmul.c"
target datalayout = "e-m:e-p:64:64-i64:64-i128:128-n32:64-S128"
target triple = "riscv64-unknown-linux-gnu"

; Function Attrs: nofree norecurse nosync nounwind memory(argmem: readwrite) uwtable vscale_range(1,1024)
define dso_local void @foo1(i32 noundef signext %N, double* nocapture noundef readonly %A, <vscale x 1 x double>* nocapture noundef %B) local_unnamed_addr #0 {
; CHECK-LABEL: @foo1(
; CHECK-NEXT:  entry:
; CHECK-NEXT:    [[CMP4:%.*]] = icmp sgt i32 [[N:%.*]], 0
; CHECK-NEXT:    br i1 [[CMP4]], label [[FOR_BODY_PREHEADER:%.*]], label [[FOR_COND_CLEANUP:%.*]]
; CHECK:       for.body.preheader:
; CHECK-NEXT:    [[WIDE_TRIP_COUNT:%.*]] = zext i32 [[N]] to i64
; CHECK-NEXT:    [[TMP0:%.*]] = load double, double* [[A:%.*]], align 8, [[TBAA0:!tbaa !.*]]
; CHECK-NEXT:    [[TMP1:%.*]] = fdiv fast double 1.000000e+00, [[TMP0]]
; CHECK-NEXT:    [[TMP2:%.*]] = insertelement <vscale x 1 x double> poison, double [[TMP1]], i64 0
; CHECK-NEXT:    [[TMP3:%.*]] = shufflevector <vscale x 1 x double> [[TMP2]], <vscale x 1 x double> poison, <vscale x 1 x i32> zeroinitializer
; CHECK-NEXT:    br label [[VECTOR_BODY:%.*]]
; CHECK:       vector.body:
; CHECK-NEXT:    [[INDEX:%.*]] = phi i64 [ 0, [[FOR_BODY_PREHEADER]] ], [ [[INDEX_NEXT:%.*]], [[VECTOR_BODY]] ]
; CHECK-NEXT:    [[TMP4:%.*]] = sub i64 [[WIDE_TRIP_COUNT]], [[INDEX]]
; CHECK-NEXT:    [[TMP5:%.*]] = call i64 @llvm.epi.vsetvl(i64 [[TMP4]], i64 3, i64 0)
; CHECK-NEXT:    [[TMP6:%.*]] = trunc i64 [[TMP5]] to i32
; CHECK-NEXT:    [[TMP7:%.*]] = getelementptr inbounds <vscale x 1 x double>, <vscale x 1 x double>* [[B:%.*]], i64 [[INDEX]]
; CHECK-NEXT:    [[VP_OP_LOAD:%.*]] = call <vscale x 1 x double> @llvm.vp.load.nxv1f64.p0nxv1f64(<vscale x 1 x double>* [[TMP7]], i32 8, <vscale x 1 x i1> shufflevector (<vscale x 1 x i1> insertelement (<vscale x 1 x i1> undef, i1 true, i64 0), <vscale x 1 x i1> undef, <vscale x 1 x i32> zeroinitializer), i32 [[TMP6]]), [[TBAA0]]
; CHECK-NEXT:    [[VP_OP1:%.*]] = call fast <vscale x 1 x double> @llvm.vp.fmul.nxv1f64(<vscale x 1 x double> [[VP_OP_LOAD]], <vscale x 1 x double> [[TMP3]], metadata !"", metadata !"", <vscale x 1 x i1> shufflevector (<vscale x 1 x i1> insertelement (<vscale x 1 x i1> undef, i1 true, i64 0), <vscale x 1 x i1> undef, <vscale x 1 x i32> zeroinitializer), i32 [[TMP6]])
; CHECK-NEXT:    call void @llvm.vp.store.nxv1f64.p0nxv1f64(<vscale x 1 x double> [[VP_OP1]], <vscale x 1 x double>* [[TMP7]], i32 8, <vscale x 1 x i1> shufflevector (<vscale x 1 x i1> insertelement (<vscale x 1 x i1> undef, i1 true, i64 0), <vscale x 1 x i1> undef, <vscale x 1 x i32> zeroinitializer), i32 [[TMP6]]), [[TBAA0]]
; CHECK-NEXT:    [[TMP8:%.*]] = and i64 [[TMP5]], 4294967295
; CHECK-NEXT:    [[INDEX_NEXT]] = add i64 [[INDEX]], [[TMP8]]
; CHECK-NEXT:    [[TMP9:%.*]] = icmp eq i64 [[INDEX_NEXT]], [[WIDE_TRIP_COUNT]]
; CHECK-NEXT:    br i1 [[TMP9]], label [[FOR_COND_CLEANUP_LOOPEXIT:%.*]], label [[VECTOR_BODY]], [[LOOP4:!llvm.loop !.*]]
; CHECK:       for.cond.cleanup.loopexit:
; CHECK-NEXT:    br label [[FOR_COND_CLEANUP]]
; CHECK:       for.cond.cleanup:
; CHECK-NEXT:    ret void
;
entry:
  %cmp4 = icmp sgt i32 %N, 0
  br i1 %cmp4, label %for.body.preheader, label %for.cond.cleanup

for.body.preheader:                               ; preds = %entry
  %wide.trip.count = zext i32 %N to i64
  %0 = load double, double* %A, align 8, !tbaa !7
  %broadcast.splatinsert8 = insertelement <vscale x 1 x double> undef, double %0, i64 0
  %broadcast.splat9 = shufflevector <vscale x 1 x double> %broadcast.splatinsert8, <vscale x 1 x double> undef, <vscale x 1 x i32> zeroinitializer
  br label %vector.body

vector.body:                                      ; preds = %vector.body, %for.body.preheader
  %index = phi i64 [ 0, %for.body.preheader ], [ %index.next, %vector.body ]
  %1 = sub i64 %wide.trip.count, %index
  %2 = call i64 @llvm.epi.vsetvl(i64 %1, i64 3, i64 0)
  %3 = trunc i64 %2 to i32
  %4 = getelementptr inbounds <vscale x 1 x double>, <vscale x 1 x double>* %B, i64 %index
  %vp.op.load = call <vscale x 1 x double> @llvm.vp.load.nxv1f64(<vscale x 1 x double>* %4, i32 8, <vscale x 1 x i1> shufflevector (<vscale x 1 x i1> insertelement (<vscale x 1 x i1> undef, i1 true, i64 0), <vscale x 1 x i1> undef, <vscale x 1 x i32> zeroinitializer), i32 %3), !tbaa !7
  %vp.op = call fast <vscale x 1 x double> @llvm.vp.fdiv.nxv1f64(<vscale x 1 x double> %vp.op.load, <vscale x 1 x double> %broadcast.splat9, metadata !"", metadata !"", <vscale x 1 x i1> shufflevector (<vscale x 1 x i1> insertelement (<vscale x 1 x i1> undef, i1 true, i64 0), <vscale x 1 x i1> undef, <vscale x 1 x i32> zeroinitializer), i32 %3)
  call void @llvm.vp.store.nxv1f64(<vscale x 1 x double> %vp.op, <vscale x 1 x double>* %4, i32 8, <vscale x 1 x i1> shufflevector (<vscale x 1 x i1> insertelement (<vscale x 1 x i1> undef, i1 true, i64 0), <vscale x 1 x i1> undef, <vscale x 1 x i32> zeroinitializer), i32 %3), !tbaa !7
  %5 = and i64 %2, 4294967295
  %index.next = add i64 %index, %5
  %6 = icmp eq i64 %index.next, %wide.trip.count
  br i1 %6, label %for.cond.cleanup.loopexit, label %vector.body, !llvm.loop !11

for.cond.cleanup.loopexit:                        ; preds = %vector.body
  br label %for.cond.cleanup

for.cond.cleanup:                                 ; preds = %for.cond.cleanup.loopexit, %entry
  ret void
}

; Function Attrs: nofree norecurse nosync nounwind memory(argmem: readwrite) uwtable vscale_range(1,1024)
define dso_local void @foo2(i32 noundef signext %N, <vscale x 1 x double>* nocapture noundef %A) local_unnamed_addr #0 {
; CHECK-LABEL: @foo2(
; CHECK-NEXT:  entry:
; CHECK-NEXT:    [[CMP9:%.*]] = icmp sgt i32 [[N:%.*]], 0
; CHECK-NEXT:    br i1 [[CMP9]], label [[FOR_BODY_PREHEADER:%.*]], label [[FOR_COND_CLEANUP:%.*]]
; CHECK:       for.body.preheader:
; CHECK-NEXT:    [[WIDE_TRIP_COUNT:%.*]] = zext i32 [[N]] to i64
; CHECK-NEXT:    [[TMP0:%.*]] = load <vscale x 1 x double>, <vscale x 1 x double>* [[A:%.*]], align 8
; CHECK-NEXT:    [[TMP1:%.*]] = fdiv fast <vscale x 1 x double> shufflevector (<vscale x 1 x double> insertelement (<vscale x 1 x double> undef, double 1.000000e+00, i32 0), <vscale x 1 x double> undef, <vscale x 1 x i32> zeroinitializer), [[TMP0]]
; CHECK-NEXT:    br label [[VECTOR_BODY:%.*]]
; CHECK:       vector.body:
; CHECK-NEXT:    [[INDEX:%.*]] = phi i64 [ 0, [[FOR_BODY_PREHEADER]] ], [ [[INDEX_NEXT:%.*]], [[VECTOR_BODY]] ]
; CHECK-NEXT:    [[TMP2:%.*]] = sub i64 [[WIDE_TRIP_COUNT]], [[INDEX]]
; CHECK-NEXT:    [[TMP3:%.*]] = call i64 @llvm.epi.vsetvl(i64 [[TMP2]], i64 3, i64 0)
; CHECK-NEXT:    [[TMP4:%.*]] = trunc i64 [[TMP3]] to i32
; CHECK-NEXT:    [[TMP5:%.*]] = getelementptr inbounds <vscale x 1 x double>, <vscale x 1 x double>* [[A]], i64 [[INDEX]]
; CHECK-NEXT:    [[VP_OP_LOAD:%.*]] = call <vscale x 1 x double> @llvm.vp.load.nxv1f64.p0nxv1f64(<vscale x 1 x double>* [[TMP5]], i32 8, <vscale x 1 x i1> shufflevector (<vscale x 1 x i1> insertelement (<vscale x 1 x i1> undef, i1 true, i64 0), <vscale x 1 x i1> undef, <vscale x 1 x i32> zeroinitializer), i32 [[TMP4]]), [[TBAA0]]
; CHECK-NEXT:    [[VP_OP1:%.*]] = call fast <vscale x 1 x double> @llvm.vp.fmul.nxv1f64(<vscale x 1 x double> [[VP_OP_LOAD]], <vscale x 1 x double> [[TMP1]], metadata !"", metadata !"", <vscale x 1 x i1> shufflevector (<vscale x 1 x i1> insertelement (<vscale x 1 x i1> undef, i1 true, i64 0), <vscale x 1 x i1> undef, <vscale x 1 x i32> zeroinitializer), i32 [[TMP4]])
; CHECK-NEXT:    call void @llvm.vp.store.nxv1f64.p0nxv1f64(<vscale x 1 x double> [[VP_OP1]], <vscale x 1 x double>* [[TMP5]], i32 8, <vscale x 1 x i1> shufflevector (<vscale x 1 x i1> insertelement (<vscale x 1 x i1> undef, i1 true, i64 0), <vscale x 1 x i1> undef, <vscale x 1 x i32> zeroinitializer), i32 [[TMP4]]), [[TBAA0]]
; CHECK-NEXT:    [[TMP6:%.*]] = and i64 [[TMP3]], 4294967295
; CHECK-NEXT:    [[INDEX_NEXT]] = add i64 [[INDEX]], [[TMP6]]
; CHECK-NEXT:    [[TMP7:%.*]] = icmp eq i64 [[INDEX_NEXT]], [[WIDE_TRIP_COUNT]]
; CHECK-NEXT:    br i1 [[TMP7]], label [[FOR_COND_CLEANUP_LOOPEXIT:%.*]], label [[VECTOR_BODY]], [[LOOP4]]
; CHECK:       for.cond.cleanup.loopexit:
; CHECK-NEXT:    br label [[FOR_COND_CLEANUP]]
; CHECK:       for.cond.cleanup:
; CHECK-NEXT:    ret void
;
entry:
  %cmp9 = icmp sgt i32 %N, 0
  br i1 %cmp9, label %for.body.preheader, label %for.cond.cleanup

for.body.preheader:                               ; preds = %entry
  %wide.trip.count = zext i32 %N to i64
  %0 = load <vscale x 1 x double>, <vscale x 1 x double>* %A
  br label %vector.body

vector.body:                                      ; preds = %vector.body, %for.body.preheader
  %index = phi i64 [ 0, %for.body.preheader ], [ %index.next, %vector.body ]
  %1 = sub i64 %wide.trip.count, %index
  %2 = call i64 @llvm.epi.vsetvl(i64 %1, i64 3, i64 0)
  %3 = trunc i64 %2 to i32
  %4 = getelementptr inbounds <vscale x 1 x double>, <vscale x 1 x double>* %A, i64 %index
  %vp.op.load = call <vscale x 1 x double> @llvm.vp.load.nxv1f64(<vscale x 1 x double>* %4, i32 8, <vscale x 1 x i1> shufflevector (<vscale x 1 x i1> insertelement (<vscale x 1 x i1> undef, i1 true, i64 0), <vscale x 1 x i1> undef, <vscale x 1 x i32> zeroinitializer), i32 %3), !tbaa !7
  %vp.op = call fast <vscale x 1 x double> @llvm.vp.fdiv.nxv1f64(<vscale x 1 x double> %vp.op.load, <vscale x 1 x double> %0, metadata !"", metadata !"", <vscale x 1 x i1> shufflevector (<vscale x 1 x i1> insertelement (<vscale x 1 x i1> undef, i1 true, i64 0), <vscale x 1 x i1> undef, <vscale x 1 x i32> zeroinitializer), i32 %3)
  call void @llvm.vp.store.nxv1f64(<vscale x 1 x double> %vp.op, <vscale x 1 x double>* %4, i32 8, <vscale x 1 x i1> shufflevector (<vscale x 1 x i1> insertelement (<vscale x 1 x i1> undef, i1 true, i64 0), <vscale x 1 x i1> undef, <vscale x 1 x i32> zeroinitializer), i32 %3), !tbaa !7
  %5 = and i64 %2, 4294967295
  %index.next = add i64 %index, %5
  %6 = icmp eq i64 %index.next, %wide.trip.count
  br i1 %6, label %for.cond.cleanup.loopexit, label %vector.body, !llvm.loop !11

for.cond.cleanup.loopexit:                        ; preds = %vector.body
  br label %for.cond.cleanup

for.cond.cleanup:                                 ; preds = %for.cond.cleanup.loopexit, %entry
  ret void
}

; Function Attrs: nocallback nofree nosync nounwind willreturn memory(none)
declare i64 @llvm.epi.vsetvl(i64, i64, i64) #1

; Function Attrs: nocallback nofree nosync nounwind willreturn memory(none)
declare <vscale x 1 x i64> @llvm.experimental.vp.stepvector.nxv1i64(<vscale x 1 x i1>, i32) #1

; Function Attrs: nocallback nofree nosync nounwind willreturn memory(none)
declare <vscale x 1 x i1> @llvm.vp.icmp.nxv1i64(<vscale x 1 x i64>, <vscale x 1 x i64>, metadata, <vscale x 1 x i1>, i32) #1

; Function Attrs: nocallback nofree nosync nounwind willreturn memory(argmem: read)
declare <vscale x 1 x double> @llvm.vp.load.nxv1f64(<vscale x 1 x double>* nocapture, i32, <vscale x 1 x i1>, i32) #2

; Function Attrs: nocallback nofree nosync nounwind willreturn memory(none)
declare <vscale x 1 x double> @llvm.vp.fdiv.nxv1f64(<vscale x 1 x double>, <vscale x 1 x double>, metadata, metadata, <vscale x 1 x i1>, i32) #1

; Function Attrs: nocallback nofree nosync nounwind willreturn memory(argmem: write)
declare void @llvm.vp.store.nxv1f64(<vscale x 1 x double>, <vscale x 1 x double>* nocapture, i32, <vscale x 1 x i1>, i32) #3

!7 = !{!8, !8, i64 0}
!8 = !{!"double", !9, i64 0}
!9 = !{!"omnipotent char", !10, i64 0}
!10 = !{!"Simple C/C++ TBAA"}
!11 = distinct !{!11, !12, !13, !14}
!12 = !{!"llvm.loop.mustprogress"}
!13 = !{!"llvm.loop.isvectorized", i32 1}
!14 = !{!"llvm.loop.unroll.runtime.disable"}
