; NOTE: Assertions have been autogenerated by utils/update_llc_test_checks.py
; RUN: llc -mtriple=riscv64 -verify-machineinstrs \
; RUN:    < %s | FileCheck %s

; ModuleID = 't.c'
source_filename = "t.c"
target datalayout = "e-m:e-p:64:64-i64:64-i128:128-n64-S128-v128:128:128-v256:128:128-v512:128:128-v1024:128:128"
target triple = "riscv64-unknown-linux-gnu"

; Function Attrs: nofree norecurse nounwind
define dso_local void @add_ref(i64 %N, double* nocapture %c, float* nocapture readonly %a, double* nocapture readonly %b) local_unnamed_addr #0 {
; CHECK-LABEL: add_ref:
; CHECK:       # %bb.0: # %entry
; CHECK-NEXT:    addi a4, zero, 1
; CHECK-NEXT:    blt a0, a4, .LBB0_5
; CHECK-NEXT:  # %bb.1: # %vector.memcheck
; CHECK-NEXT:    addi a7, zero, 24
; CHECK-NEXT:    mul a4, a0, a7
; CHECK-NEXT:    slli a5, a0, 3
; CHECK-NEXT:    add a4, a4, a1
; CHECK-NEXT:    add a5, a5, a3
; CHECK-NEXT:    addi a4, a4, -16
; CHECK-NEXT:    sltu a5, a1, a5
; CHECK-NEXT:    sltu a4, a3, a4
; CHECK-NEXT:    xori a5, a5, 1
; CHECK-NEXT:    xori a4, a4, 1
; CHECK-NEXT:    or a4, a4, a5
; CHECK-NEXT:    bnez a4, .LBB0_3
; CHECK-NEXT:  .LBB0_2: # %for.body
; CHECK-NEXT:    # =>This Inner Loop Header: Depth=1
; CHECK-NEXT:    flw ft0, 0(a2)
; CHECK-NEXT:    fcvt.d.s ft0, ft0
; CHECK-NEXT:    fld ft1, 0(a3)
; CHECK-NEXT:    fadd.d ft0, ft1, ft0
; CHECK-NEXT:    addi a0, a0, -1
; CHECK-NEXT:    fsd ft0, 0(a1)
; CHECK-NEXT:    addi a1, a1, 24
; CHECK-NEXT:    addi a3, a3, 8
; CHECK-NEXT:    addi a2, a2, 8
; CHECK-NEXT:    bnez a0, .LBB0_2
; CHECK-NEXT:    j .LBB0_5
; CHECK-NEXT:  .LBB0_3: # %vector.ph
; CHECK-NEXT:    mv a5, zero
; CHECK-NEXT:    addi a6, zero, 8
; CHECK-NEXT:    vsetvli zero, zero, e64,m1
; CHECK-NEXT:    vid.v v1
; CHECK-NEXT:    vsetvli t0, zero, e64,m1
; CHECK-NEXT:  .LBB0_4: # %vector.body
; CHECK-NEXT:    # =>This Inner Loop Header: Depth=1
; CHECK-NEXT:    slli t1, a5, 3
; CHECK-NEXT:    sub t3, a0, a5
; CHECK-NEXT:    add t1, t1, a2
; CHECK-NEXT:    vsetvli t2, t3, e64,m1
; CHECK-NEXT:    vsetvli zero, t2, e32,m1
; CHECK-NEXT:    vlse.v v2, (t1), a6
; CHECK-NEXT:    vfwcvt.f.f.v v4, v2
; CHECK-NEXT:    vsetvli zero, zero, e64,m1
; CHECK-NEXT:    vmv.x.s a4, v1
; CHECK-NEXT:    slli a4, a4, 3
; CHECK-NEXT:    add a4, a4, a3
; CHECK-NEXT:    vsetvli zero, t3, e64,m1
; CHECK-NEXT:    vle.v v2, (a4)
; CHECK-NEXT:    vfadd.vv v2, v2, v4
; CHECK-NEXT:    mul a4, a5, a7
; CHECK-NEXT:    add a4, a4, a1
; CHECK-NEXT:    vsse.v v2, (a4), a7
; CHECK-NEXT:    add a5, a5, t2
; CHECK-NEXT:    vsetvli zero, zero, e64,m1
; CHECK-NEXT:    vadd.vx v1, v1, t0
; CHECK-NEXT:    bne a5, a0, .LBB0_4
; CHECK-NEXT:  .LBB0_5: # %for.end
; CHECK-NEXT:    ret
entry:
  %cmp9 = icmp sgt i64 %N, 0
  br i1 %cmp9, label %vector.memcheck, label %for.end

vector.memcheck:                                  ; preds = %entry
  %0 = mul i64 %N, 3
  %1 = add i64 %0, -2
  %scevgep = getelementptr double, double* %c, i64 %1
  %scevgep14 = getelementptr double, double* %b, i64 %N
  %bound0 = icmp ugt double* %scevgep14, %c
  %bound1 = icmp ugt double* %scevgep, %b
  %found.conflict = and i1 %bound0, %bound1
  br i1 %found.conflict, label %for.body, label %vector.ph

vector.ph:                                        ; preds = %vector.memcheck
  %2 = call <vscale x 1 x i64> @llvm.experimental.vector.stepvector.nxv1i64()
  %3 = call i64 @llvm.vscale.i64()
  %.splatinsert20 = insertelement <vscale x 1 x i64> undef, i64 %3, i32 0
  %.splat21 = shufflevector <vscale x 1 x i64> %.splatinsert20, <vscale x 1 x i64> undef, <vscale x 1 x i32> zeroinitializer
  br label %vector.body

vector.body:                                      ; preds = %vector.body, %vector.ph
  %index = phi i64 [ 0, %vector.ph ], [ %index.next, %vector.body ]
  %vec.ind = phi <vscale x 1 x i64> [ %2, %vector.ph ], [ %vec.ind.next, %vector.body ]
  %4 = sub i64 %N, %index
  %5 = call i64 @llvm.epi.vsetvl(i64 %4, i64 3, i64 0)
  %6 = trunc i64 %5 to i32
  %7 = shl i64 %index, 1
  %8 = getelementptr float, float* %a, i64 %7
  %vp.strided.load = call <vscale x 1 x float> @llvm.vp.strided.load.nxv1f32.p0f32.i64(float* %8, i64 8, <vscale x 1 x i1> shufflevector (<vscale x 1 x i1> insertelement (<vscale x 1 x i1> undef, i1 true, i32 0), <vscale x 1 x i1> undef, <vscale x 1 x i32> zeroinitializer), i32 %6)
  %9 = trunc i64 %5 to i32
  %vp.cast = call <vscale x 1 x double> @llvm.vp.fpext.nxv1f64.nxv1f32(<vscale x 1 x float> %vp.strided.load, metadata !"fpexcept.ignore", <vscale x 1 x i1> shufflevector (<vscale x 1 x i1> insertelement (<vscale x 1 x i1> undef, i1 true, i32 0), <vscale x 1 x i1> undef, <vscale x 1 x i32> zeroinitializer), i32 %9)
  %10 = extractelement <vscale x 1 x i64> %vec.ind, i32 0
  %11 = getelementptr inbounds double, double* %b, i64 %10
  %12 = bitcast double* %11 to <vscale x 1 x double>*
  %13 = trunc i64 %5 to i32
  %vp.op.load = call <vscale x 1 x double> @llvm.vp.load.nxv1f64.p0nxv1f64(<vscale x 1 x double>* %12, i32 8, <vscale x 1 x i1> shufflevector (<vscale x 1 x i1> insertelement (<vscale x 1 x i1> undef, i1 true, i32 0), <vscale x 1 x i1> undef, <vscale x 1 x i32> zeroinitializer), i32 %13), !tbaa !4, !alias.scope !8
  %14 = trunc i64 %5 to i32
  %vp.op34 = call <vscale x 1 x double> @llvm.vp.fadd.nxv1f64(<vscale x 1 x double> %vp.op.load, <vscale x 1 x double> %vp.cast, metadata !"round.tonearest", metadata !"fpexcept.ignore", <vscale x 1 x i1> shufflevector (<vscale x 1 x i1> insertelement (<vscale x 1 x i1> undef, i1 true, i32 0), <vscale x 1 x i1> undef, <vscale x 1 x i32> zeroinitializer), i32 %14)
  %15 = trunc i64 %5 to i32
  %16 = mul i64 %index, 3
  %17 = getelementptr double, double* %c, i64 %16
  call void @llvm.vp.strided.store.nxv1f64.p0f64.i64(<vscale x 1 x double> %vp.op34, double* %17, i64 24, <vscale x 1 x i1> shufflevector (<vscale x 1 x i1> insertelement (<vscale x 1 x i1> undef, i1 true, i32 0), <vscale x 1 x i1> undef, <vscale x 1 x i32> zeroinitializer), i32 %15), !tbaa !4, !alias.scope !11, !noalias !8
  %index.next = add i64 %index, %5
  %vec.ind.next = add <vscale x 1 x i64> %vec.ind, %.splat21
  %18 = icmp eq i64 %index.next, %N
  br i1 %18, label %for.end, label %vector.body, !llvm.loop !13

for.body:                                         ; preds = %vector.memcheck, %for.body
  %i.010 = phi i64 [ %inc, %for.body ], [ 0, %vector.memcheck ]
  %mul = shl nuw nsw i64 %i.010, 1
  %arrayidx = getelementptr inbounds float, float* %a, i64 %mul
  %19 = load float, float* %arrayidx, align 4, !tbaa !16
  %conv = fpext float %19 to double
  %arrayidx1 = getelementptr inbounds double, double* %b, i64 %i.010
  %20 = load double, double* %arrayidx1, align 8, !tbaa !4
  %add = fadd double %20, %conv
  %mul2 = mul nuw nsw i64 %i.010, 3
  %arrayidx3 = getelementptr inbounds double, double* %c, i64 %mul2
  store double %add, double* %arrayidx3, align 8, !tbaa !4
  %inc = add nuw nsw i64 %i.010, 1
  %exitcond.not = icmp eq i64 %inc, %N
  br i1 %exitcond.not, label %for.end, label %for.body, !llvm.loop !18

for.end:                                          ; preds = %vector.body, %for.body, %entry
  ret void
}

; Function Attrs: nounwind readnone
declare <vscale x 1 x i64> @llvm.experimental.vector.stepvector.nxv1i64() #1

; Function Attrs: nofree nosync nounwind readnone willreturn
declare i64 @llvm.vscale.i64() #2

; Function Attrs: nounwind readnone
declare i64 @llvm.epi.vsetvl(i64, i64, i64) #1

; Function Attrs: argmemonly nofree nosync nounwind readonly willreturn
declare <vscale x 1 x float> @llvm.vp.strided.load.nxv1f32.p0f32.i64(float* nocapture, i64, <vscale x 1 x i1>, i32) #3

; Function Attrs: nounwind readnone willreturn
declare <vscale x 1 x double> @llvm.vp.fpext.nxv1f64.nxv1f32(<vscale x 1 x float>, metadata, <vscale x 1 x i1>, i32) #4

; Function Attrs: argmemonly nosync nounwind readonly willreturn
declare <vscale x 1 x double> @llvm.vp.load.nxv1f64.p0nxv1f64(<vscale x 1 x double>* nocapture, i32 immarg, <vscale x 1 x i1>, i32) #5

; Function Attrs: nounwind readnone willreturn
declare <vscale x 1 x double> @llvm.vp.fadd.nxv1f64(<vscale x 1 x double>, <vscale x 1 x double>, metadata, metadata, <vscale x 1 x i1>, i32) #4

; Function Attrs: argmemonly nofree nosync nounwind willreturn writeonly
declare void @llvm.vp.strided.store.nxv1f64.p0f64.i64(<vscale x 1 x double>, double* nocapture, i64, <vscale x 1 x i1>, i32) #6

attributes #0 = { nofree norecurse nounwind "disable-tail-calls"="false" "frame-pointer"="none" "less-precise-fpmad"="false" "min-legal-vector-width"="0" "no-infs-fp-math"="false" "no-jump-tables"="false" "no-nans-fp-math"="false" "no-signed-zeros-fp-math"="false" "no-trapping-math"="true" "stack-protector-buffer-size"="8" "target-cpu"="avispado" "target-features"="+64bit,+a,+c,+d,+experimental-v,+experimental-zvlsseg,+f,+m,-relax,-save-restore" "unsafe-fp-math"="false" "use-soft-float"="false" }
attributes #1 = { nounwind readnone }
attributes #2 = { nofree nosync nounwind readnone willreturn }
attributes #3 = { argmemonly nofree nosync nounwind readonly willreturn }
attributes #4 = { nounwind readnone willreturn }
attributes #5 = { argmemonly nosync nounwind readonly willreturn }
attributes #6 = { argmemonly nofree nosync nounwind willreturn writeonly }

!llvm.module.flags = !{!0, !1, !2}
!llvm.ident = !{!3}

!0 = !{i32 1, !"wchar_size", i32 4}
!1 = !{i32 1, !"target-abi", !"lp64d"}
!2 = !{i32 1, !"SmallDataLimit", i32 8}
!3 = !{!"clang version 12.0.0"}
!4 = !{!5, !5, i64 0}
!5 = !{!"double", !6, i64 0}
!6 = !{!"omnipotent char", !7, i64 0}
!7 = !{!"Simple C/C++ TBAA"}
!8 = !{!9}
!9 = distinct !{!9, !10}
!10 = distinct !{!10, !"LVerDomain"}
!11 = !{!12}
!12 = distinct !{!12, !10}
!13 = distinct !{!13, !14, !15}
!14 = !{!"llvm.loop.mustprogress"}
!15 = !{!"llvm.loop.isvectorized", i32 1}
!16 = !{!17, !17, i64 0}
!17 = !{!"float", !6, i64 0}
!18 = distinct !{!18, !14, !15}
