; NOTE: Assertions have been autogenerated by utils/update_llc_test_checks.py
; RUN: llc -mtriple=riscv64 -mattr=+experimental-v \
; RUN:    -verify-machineinstrs < %s | FileCheck %s

define <vscale x 1 x i1> @splat_mask1i1(i64 %a) {
; CHECK-LABEL: splat_mask1i1:
; CHECK:       # %bb.0:
; CHECK-NEXT:    slli a0, a0, 63
; CHECK-NEXT:    srai a0, a0, 63
; CHECK-NEXT:    vsetvli zero, zero, e64,m1
; CHECK-NEXT:    vmv.v.x v1, a0
; CHECK-NEXT:    vmset.m v2
; CHECK-NEXT:    vmand.mm v0, v2, v1
; CHECK-NEXT:    ret
    %t = trunc i64 %a to i1
    %x = insertelement <vscale x 1 x i1>  undef, i1 %t, i32 0
    %s = shufflevector <vscale x 1 x i1> %x, <vscale x 1 x i1> undef, <vscale x 1 x i32> zeroinitializer
    ret <vscale x 1 x i1> %s
}

define <vscale x 2 x i1> @splat_mask2i1(i64 %a) {
; CHECK-LABEL: splat_mask2i1:
; CHECK:       # %bb.0:
; CHECK-NEXT:    slli a0, a0, 63
; CHECK-NEXT:    srai a0, a0, 63
; CHECK-NEXT:    vsetvli zero, zero, e32,m1
; CHECK-NEXT:    vmv.v.x v1, a0
; CHECK-NEXT:    vmset.m v2
; CHECK-NEXT:    vmand.mm v0, v2, v1
; CHECK-NEXT:    ret
    %t = trunc i64 %a to i1
    %x = insertelement <vscale x 2 x i1>  undef, i1 %t, i32 0
    %s = shufflevector <vscale x 2 x i1> %x, <vscale x 2 x i1> undef, <vscale x 2 x i32> zeroinitializer
    ret <vscale x 2 x i1> %s
}

define <vscale x 4 x i1> @splat_mask4i1(i64 %a) {
; CHECK-LABEL: splat_mask4i1:
; CHECK:       # %bb.0:
; CHECK-NEXT:    slli a0, a0, 63
; CHECK-NEXT:    srai a0, a0, 63
; CHECK-NEXT:    vsetvli zero, zero, e16,m1
; CHECK-NEXT:    vmv.v.x v1, a0
; CHECK-NEXT:    vmset.m v2
; CHECK-NEXT:    vmand.mm v0, v2, v1
; CHECK-NEXT:    ret
    %t = trunc i64 %a to i1
    %x = insertelement <vscale x 4 x i1>  undef, i1 %t, i32 0
    %s = shufflevector <vscale x 4 x i1> %x, <vscale x 4 x i1> undef, <vscale x 4 x i32> zeroinitializer
    ret <vscale x 4 x i1> %s
}

define <vscale x 8 x i1> @splat_mask8i1(i64 %a) {
; CHECK-LABEL: splat_mask8i1:
; CHECK:       # %bb.0:
; CHECK-NEXT:    slli a0, a0, 63
; CHECK-NEXT:    srai a0, a0, 63
; CHECK-NEXT:    vsetvli zero, zero, e8,m1
; CHECK-NEXT:    vmv.v.x v1, a0
; CHECK-NEXT:    vmset.m v2
; CHECK-NEXT:    vmand.mm v0, v2, v1
; CHECK-NEXT:    ret
    %t = trunc i64 %a to i1
    %x = insertelement <vscale x 8 x i1>  undef, i1 %t, i32 0
    %s = shufflevector <vscale x 8 x i1> %x, <vscale x 8 x i1> undef, <vscale x 8 x i32> zeroinitializer
    ret <vscale x 8 x i1> %s
}

define <vscale x 16 x i1> @splat_mask16i1(i64 %a) {
; CHECK-LABEL: splat_mask16i1:
; CHECK:       # %bb.0:
; CHECK-NEXT:    slli a0, a0, 63
; CHECK-NEXT:    srai a0, a0, 63
; CHECK-NEXT:    vsetvli zero, zero, e8,m1
; CHECK-NEXT:    vmv.v.x v1, a0
; CHECK-NEXT:    vmset.m v2
; CHECK-NEXT:    vsetvli zero, zero, e8,m2
; CHECK-NEXT:    vmand.mm v0, v2, v1
; CHECK-NEXT:    ret
    %t = trunc i64 %a to i1
    %x = insertelement <vscale x 16 x i1>  undef, i1 %t, i32 0
    %s = shufflevector <vscale x 16 x i1> %x, <vscale x 16 x i1> undef, <vscale x 16 x i32> zeroinitializer
    ret <vscale x 16 x i1> %s
}

define <vscale x 32 x i1> @splat_mask32i1(i64 %a) {
; CHECK-LABEL: splat_mask32i1:
; CHECK:       # %bb.0:
; CHECK-NEXT:    slli a0, a0, 63
; CHECK-NEXT:    srai a0, a0, 63
; CHECK-NEXT:    vsetvli zero, zero, e8,m1
; CHECK-NEXT:    vmv.v.x v1, a0
; CHECK-NEXT:    vmset.m v2
; CHECK-NEXT:    vsetvli zero, zero, e8,m4
; CHECK-NEXT:    vmand.mm v0, v2, v1
; CHECK-NEXT:    ret
    %t = trunc i64 %a to i1
    %x = insertelement <vscale x 32 x i1>  undef, i1 %t, i32 0
    %s = shufflevector <vscale x 32 x i1> %x, <vscale x 32 x i1> undef, <vscale x 32 x i32> zeroinitializer
    ret <vscale x 32 x i1> %s
}

define <vscale x 64 x i1> @splat_mask64i1(i64 %a) {
; CHECK-LABEL: splat_mask64i1:
; CHECK:       # %bb.0:
; CHECK-NEXT:    slli a0, a0, 63
; CHECK-NEXT:    srai a0, a0, 63
; CHECK-NEXT:    vsetvli zero, zero, e8,m1
; CHECK-NEXT:    vmv.v.x v1, a0
; CHECK-NEXT:    vmset.m v2
; CHECK-NEXT:    vsetvli zero, zero, e8,m8
; CHECK-NEXT:    vmand.mm v0, v2, v1
; CHECK-NEXT:    ret
    %t = trunc i64 %a to i1
    %x = insertelement <vscale x 64 x i1>  undef, i1 %t, i32 0
    %s = shufflevector <vscale x 64 x i1> %x, <vscale x 64 x i1> undef, <vscale x 64 x i32> zeroinitializer
    ret <vscale x 64 x i1> %s
}
