; NOTE: Assertions have been autogenerated by utils/update_llc_test_checks.py
; RUN: llc -mtriple riscv64 -mattr=+d,+experimental-v < %s | FileCheck %s

define <vscale x 1 x double> @test_vp_frem_nxv1f64(<vscale x 1 x double> %f0, <vscale x 1 x double> %f1, <vscale x 1 x i1> %m, i32 zeroext %n) nounwind {
; CHECK-LABEL: test_vp_frem_nxv1f64:
; CHECK:       # %bb.0:
; CHECK-NEXT:    addi sp, sp, -16
; CHECK-NEXT:    sd ra, 8(sp) # 8-byte Folded Spill
; CHECK-NEXT:    call __epi_vp_fmod_nxv1f64
; CHECK-NEXT:    ld ra, 8(sp) # 8-byte Folded Reload
; CHECK-NEXT:    addi sp, sp, 16
; CHECK-NEXT:    ret
  %r0 = call <vscale x 1 x double> @llvm.vp.frem.nxv1f64(<vscale x 1 x double> %f0, <vscale x 1 x double> %f1, metadata !"", metadata !"", <vscale x 1 x i1> %m, i32 %n)
  ret <vscale x 1 x double> %r0
}
declare <vscale x 1 x double> @llvm.vp.frem.nxv1f64(<vscale x 1 x double>, <vscale x 1 x double>, metadata, metadata, <vscale x 1 x i1>, i32)

define <vscale x 2 x double> @test_vp_frem_nxv2f64(<vscale x 2 x double> %f0, <vscale x 2 x double> %f1, <vscale x 2 x i1> %m, i32 zeroext %n) nounwind {
; CHECK-LABEL: test_vp_frem_nxv2f64:
; CHECK:       # %bb.0:
; CHECK-NEXT:    addi sp, sp, -16
; CHECK-NEXT:    sd ra, 8(sp) # 8-byte Folded Spill
; CHECK-NEXT:    call __epi_vp_fmod_nxv2f64
; CHECK-NEXT:    ld ra, 8(sp) # 8-byte Folded Reload
; CHECK-NEXT:    addi sp, sp, 16
; CHECK-NEXT:    ret
  %r0 = call <vscale x 2 x double> @llvm.vp.frem.nxv2f64(<vscale x 2 x double> %f0, <vscale x 2 x double> %f1, metadata !"", metadata !"", <vscale x 2 x i1> %m, i32 %n)
  ret <vscale x 2 x double> %r0
}
declare <vscale x 2 x double> @llvm.vp.frem.nxv2f64(<vscale x 2 x double>, <vscale x 2 x double>, metadata, metadata, <vscale x 2 x i1>, i32)

define <vscale x 4 x double> @test_vp_frem_nxv4f64(<vscale x 4 x double> %f0, <vscale x 4 x double> %f1, <vscale x 4 x i1> %m, i32 zeroext %n) nounwind {
; CHECK-LABEL: test_vp_frem_nxv4f64:
; CHECK:       # %bb.0:
; CHECK-NEXT:    addi sp, sp, -16
; CHECK-NEXT:    sd ra, 8(sp) # 8-byte Folded Spill
; CHECK-NEXT:    call __epi_vp_fmod_nxv4f64
; CHECK-NEXT:    ld ra, 8(sp) # 8-byte Folded Reload
; CHECK-NEXT:    addi sp, sp, 16
; CHECK-NEXT:    ret
  %r0 = call <vscale x 4 x double> @llvm.vp.frem.nxv4f64(<vscale x 4 x double> %f0, <vscale x 4 x double> %f1, metadata !"", metadata !"", <vscale x 4 x i1> %m, i32 %n)
  ret <vscale x 4 x double> %r0
}
declare <vscale x 4 x double> @llvm.vp.frem.nxv4f64(<vscale x 4 x double>, <vscale x 4 x double>, metadata, metadata, <vscale x 4 x i1>, i32)

define <vscale x 8 x double> @test_vp_frem_nxv8f64(<vscale x 8 x double> %f0, <vscale x 8 x double> %f1, <vscale x 8 x i1> %m, i32 zeroext %n) nounwind {
; CHECK-LABEL: test_vp_frem_nxv8f64:
; CHECK:       # %bb.0:
; CHECK-NEXT:    addi sp, sp, -64
; CHECK-NEXT:    sd ra, 56(sp) # 8-byte Folded Spill
; CHECK-NEXT:    sd s0, 48(sp) # 8-byte Folded Spill
; CHECK-NEXT:    addi s0, sp, 64
; CHECK-NEXT:    rdvtype ra
; CHECK-NEXT:    rdvl t0
; CHECK-NEXT:    vsetvli a2, zero, e8,m1
; CHECK-NEXT:    vsetvl zero, t0, ra
; CHECK-NEXT:    slli a2, a2, 3
; CHECK-NEXT:    sub sp, sp, a2
; CHECK-NEXT:    sd sp, -56(s0)
; CHECK-NEXT:    vsetvli zero, zero, e64,m8
; CHECK-NEXT:    vle.v v8, (a0)
; CHECK-NEXT:    ld a0, -56(s0)
; CHECK-NEXT:    vse.v v8, (a0)
; CHECK-NEXT:    call __epi_vp_fmod_nxv8f64
; CHECK-NEXT:    addi sp, s0, -64
; CHECK-NEXT:    ld s0, 48(sp) # 8-byte Folded Reload
; CHECK-NEXT:    ld ra, 56(sp) # 8-byte Folded Reload
; CHECK-NEXT:    addi sp, sp, 64
; CHECK-NEXT:    ret
  %r0 = call <vscale x 8 x double> @llvm.vp.frem.nxv8f64(<vscale x 8 x double> %f0, <vscale x 8 x double> %f1, metadata !"", metadata !"", <vscale x 8 x i1> %m, i32 %n)
  ret <vscale x 8 x double> %r0
}
declare <vscale x 8 x double> @llvm.vp.frem.nxv8f64(<vscale x 8 x double>, <vscale x 8 x double>, metadata, metadata, <vscale x 8 x i1>, i32)

;define <vscale x 1 x float> @test_vp_frem_nxv1f32(<vscale x 1 x float> %f0, <vscale x 1 x float> %f1, <vscale x 1 x i1> %m, i32 zeroext %n) nounwind {
;  %r0 = call <vscale x 1 x float> @llvm.vp.frem.nxv1f32(<vscale x 1 x float> %f0, <vscale x 1 x float> %f1, <vscale x 1 x i1> %m, i32 %n)
;  ret <vscale x 1 x float> %r0
;}
;declare <vscale x 1 x float> @llvm.vp.frem.nxv1f32(<vscale x 1 x float>, <vscale x 1 x float>, <vscale x 1 x i1>, i32)

define <vscale x 2 x float> @test_vp_frem_nxv2f32(<vscale x 2 x float> %f0, <vscale x 2 x float> %f1, <vscale x 2 x i1> %m, i32 zeroext %n) nounwind {
; CHECK-LABEL: test_vp_frem_nxv2f32:
; CHECK:       # %bb.0:
; CHECK-NEXT:    addi sp, sp, -16
; CHECK-NEXT:    sd ra, 8(sp) # 8-byte Folded Spill
; CHECK-NEXT:    call __epi_vp_fmod_nxv2f32
; CHECK-NEXT:    ld ra, 8(sp) # 8-byte Folded Reload
; CHECK-NEXT:    addi sp, sp, 16
; CHECK-NEXT:    ret
  %r0 = call <vscale x 2 x float> @llvm.vp.frem.nxv2f32(<vscale x 2 x float> %f0, <vscale x 2 x float> %f1, metadata !"", metadata !"", <vscale x 2 x i1> %m, i32 %n)
  ret <vscale x 2 x float> %r0
}
declare <vscale x 2 x float> @llvm.vp.frem.nxv2f32(<vscale x 2 x float>, <vscale x 2 x float>, metadata, metadata, <vscale x 2 x i1>, i32)

define <vscale x 4 x float> @test_vp_frem_nxv4f32(<vscale x 4 x float> %f0, <vscale x 4 x float> %f1, <vscale x 4 x i1> %m, i32 zeroext %n) nounwind {
; CHECK-LABEL: test_vp_frem_nxv4f32:
; CHECK:       # %bb.0:
; CHECK-NEXT:    addi sp, sp, -16
; CHECK-NEXT:    sd ra, 8(sp) # 8-byte Folded Spill
; CHECK-NEXT:    call __epi_vp_fmod_nxv4f32
; CHECK-NEXT:    ld ra, 8(sp) # 8-byte Folded Reload
; CHECK-NEXT:    addi sp, sp, 16
; CHECK-NEXT:    ret
  %r0 = call <vscale x 4 x float> @llvm.vp.frem.nxv4f32(<vscale x 4 x float> %f0, <vscale x 4 x float> %f1, metadata !"", metadata !"", <vscale x 4 x i1> %m, i32 %n)
  ret <vscale x 4 x float> %r0
}
declare <vscale x 4 x float> @llvm.vp.frem.nxv4f32(<vscale x 4 x float>, <vscale x 4 x float>, metadata, metadata, <vscale x 4 x i1>, i32)

define <vscale x 8 x float> @test_vp_frem_nxv8f32(<vscale x 8 x float> %f0, <vscale x 8 x float> %f1, <vscale x 8 x i1> %m, i32 zeroext %n) nounwind {
; CHECK-LABEL: test_vp_frem_nxv8f32:
; CHECK:       # %bb.0:
; CHECK-NEXT:    addi sp, sp, -16
; CHECK-NEXT:    sd ra, 8(sp) # 8-byte Folded Spill
; CHECK-NEXT:    call __epi_vp_fmod_nxv8f32
; CHECK-NEXT:    ld ra, 8(sp) # 8-byte Folded Reload
; CHECK-NEXT:    addi sp, sp, 16
; CHECK-NEXT:    ret
  %r0 = call <vscale x 8 x float> @llvm.vp.frem.nxv8f32(<vscale x 8 x float> %f0, <vscale x 8 x float> %f1, metadata !"", metadata !"", <vscale x 8 x i1> %m, i32 %n)
  ret <vscale x 8 x float> %r0
}
declare <vscale x 8 x float> @llvm.vp.frem.nxv8f32(<vscale x 8 x float>, <vscale x 8 x float>, metadata, metadata, <vscale x 8 x i1>, i32)

define <vscale x 16 x float> @test_vp_frem_nxv16f32(<vscale x 16 x float> %f0, <vscale x 16 x float> %f1, <vscale x 16 x i1> %m, i32 zeroext %n) nounwind {
; CHECK-LABEL: test_vp_frem_nxv16f32:
; CHECK:       # %bb.0:
; CHECK-NEXT:    addi sp, sp, -64
; CHECK-NEXT:    sd ra, 56(sp) # 8-byte Folded Spill
; CHECK-NEXT:    sd s0, 48(sp) # 8-byte Folded Spill
; CHECK-NEXT:    addi s0, sp, 64
; CHECK-NEXT:    rdvtype ra
; CHECK-NEXT:    rdvl t0
; CHECK-NEXT:    vsetvli a2, zero, e8,m1
; CHECK-NEXT:    vsetvl zero, t0, ra
; CHECK-NEXT:    slli a2, a2, 3
; CHECK-NEXT:    sub sp, sp, a2
; CHECK-NEXT:    sd sp, -56(s0)
; CHECK-NEXT:    vsetvli zero, zero, e32,m8
; CHECK-NEXT:    vle.v v8, (a0)
; CHECK-NEXT:    ld a0, -56(s0)
; CHECK-NEXT:    vse.v v8, (a0)
; CHECK-NEXT:    call __epi_vp_fmod_nxv16f32
; CHECK-NEXT:    addi sp, s0, -64
; CHECK-NEXT:    ld s0, 48(sp) # 8-byte Folded Reload
; CHECK-NEXT:    ld ra, 56(sp) # 8-byte Folded Reload
; CHECK-NEXT:    addi sp, sp, 64
; CHECK-NEXT:    ret
  %r0 = call <vscale x 16 x float> @llvm.vp.frem.nxv16f32(<vscale x 16 x float> %f0, <vscale x 16 x float> %f1, metadata !"", metadata !"", <vscale x 16 x i1> %m, i32 %n)
  ret <vscale x 16 x float> %r0
}
declare <vscale x 16 x float> @llvm.vp.frem.nxv16f32(<vscale x 16 x float>, <vscale x 16 x float>, metadata, metadata, <vscale x 16 x i1>, i32)
