; NOTE: Assertions have been autogenerated by utils/update_llc_test_checks.py
; RUN: llc -mtriple=riscv64 -mattr=+m,+f,+d,+a,+c,+experimental-v,+only-lmul1 \
; RUN:    -target-abi lp64d -verify-machineinstrs < %s | FileCheck %s
define void @foo(<vscale x 2 x i32>* %px, <vscale x 2 x i64>* %pz, i32 %evl) {
; CHECK-LABEL: foo:
; CHECK:       # %bb.0:
; CHECK-NEXT:    sext.w a5, a2
; CHECK-NEXT:    vsetvli a3, zero, e64,m1
; CHECK-NEXT:    sext.w a4, a3
; CHECK-NEXT:    bltu a4, a5, .LBB0_2
; CHECK-NEXT:  # %bb.1:
; CHECK-NEXT:    add a4, zero, a5
; CHECK-NEXT:  .LBB0_2:
; CHECK-NEXT:    vsetvli zero, a2, e32,m1
; CHECK-NEXT:    vle.v v1, (a0)
; CHECK-NEXT:    subw a0, a2, a4
; CHECK-NEXT:    slli a2, a3, 1
; CHECK-NEXT:    vsetvli zero, a2, e32,m1
; CHECK-NEXT:    vslidedown.vx v2, v1, a3
; CHECK-NEXT:    vsetvli zero, a0, e32,m1
; CHECK-NEXT:    vwcvt.x.x.v v4, v2
; CHECK-NEXT:    vsetvli zero, a4, e32,m1
; CHECK-NEXT:    vwcvt.x.x.v v2, v1
; CHECK-NEXT:    vsetvli zero, a4, e64,m1
; CHECK-NEXT:    vse.v v2, (a1)
; CHECK-NEXT:    slli a2, a3, 3
; CHECK-NEXT:    add a1, a1, a2
; CHECK-NEXT:    vsetvli zero, a0, e64,m1
; CHECK-NEXT:    vse.v v4, (a1)
; CHECK-NEXT:    ret
  %allones.1 = insertelement <vscale x 2 x i1> undef, i1 1, i32 0
  %allones = shufflevector <vscale x 2 x i1> %allones.1, <vscale x 2 x i1> undef, <vscale x 2 x i32> zeroinitializer

  %x = call <vscale x 2 x i32> @llvm.vp.load.nxv2i32(<vscale x 2 x i32>* %px, i32 8, <vscale x 2 x i1> %allones, i32 %evl)
  %z = call <vscale x 2 x i64> @llvm.vp.sext.nxv2i64.nxv2i32(<vscale x 2 x i32> %x, <vscale x 2 x i1> %allones, i32 %evl)

  call void @llvm.vp.store.nxv2i64(<vscale x 2 x i64> %z,  <vscale x 2 x i64>* %pz, i32 8, <vscale x 2 x i1> %allones, i32 %evl)
  ret void
}

declare <vscale x 2 x i32> @llvm.vp.load.nxv2i32(<vscale x 2 x i32>* %px, i32 %align, <vscale x 2 x i1> %mask, i32 %evl)
declare <vscale x 2 x i64> @llvm.vp.sext.nxv2i64.nxv2i32(<vscale x 2 x i32> %a, <vscale x 2 x i1> %mask, i32 %evl)
declare void @llvm.vp.store.nxv2i64(<vscale x 2 x i64> %z, <vscale x 2 x i64>* %pz, i32 %align, <vscale x 2 x i1> %mask, i32 %evl)
