; NOTE: Assertions have been autogenerated by utils/update_llc_test_checks.py
; RUN: llc -mtriple riscv64 -mattr=+f,+d,+experimental-v < %s | FileCheck %s

define <vscale x 1 x double> @sin_nxv1f64(<vscale x 1 x double> %a, <vscale x 1 x double> %b) nounwind {
; CHECK-LABEL: sin_nxv1f64:
; CHECK:       # %bb.0:
; CHECK-NEXT:    addi sp, sp, -16
; CHECK-NEXT:    sd ra, 8(sp) # 8-byte Folded Spill
; CHECK-NEXT:    rdvtype ra
; CHECK-NEXT:    rdvl t0
; CHECK-NEXT:    vsetvli zero, zero, e64,m1
; CHECK-NEXT:    vmv.v.v v16, v17
; CHECK-NEXT:    vsetvl zero, t0, ra
; CHECK-NEXT:    call __epi_sin_nxv1f64
; CHECK-NEXT:    ld ra, 8(sp) # 8-byte Folded Reload
; CHECK-NEXT:    addi sp, sp, 16
; CHECK-NEXT:    ret
  %1 = call <vscale x 1 x double> @llvm.sin.nxv1f64(<vscale x 1 x double> %b)
  ret <vscale x 1 x double> %1
}

define <vscale x 2 x double> @sin_nxv2f64(<vscale x 2 x double> %a, <vscale x 2 x double> %b) nounwind {
; CHECK-LABEL: sin_nxv2f64:
; CHECK:       # %bb.0:
; CHECK-NEXT:    addi sp, sp, -16
; CHECK-NEXT:    sd ra, 8(sp) # 8-byte Folded Spill
; CHECK-NEXT:    rdvtype ra
; CHECK-NEXT:    rdvl t0
; CHECK-NEXT:    vsetvli zero, zero, e64,m2
; CHECK-NEXT:    vmv.v.v v16, v18
; CHECK-NEXT:    vsetvl zero, t0, ra
; CHECK-NEXT:    call __epi_sin_nxv2f64
; CHECK-NEXT:    ld ra, 8(sp) # 8-byte Folded Reload
; CHECK-NEXT:    addi sp, sp, 16
; CHECK-NEXT:    ret
  %1 = call <vscale x 2 x double> @llvm.sin.nxv2f64(<vscale x 2 x double> %b)
  ret <vscale x 2 x double> %1
}

define <vscale x 4 x double> @sin_nxv4f64(<vscale x 4 x double> %a, <vscale x 4 x double> %b) nounwind {
; CHECK-LABEL: sin_nxv4f64:
; CHECK:       # %bb.0:
; CHECK-NEXT:    addi sp, sp, -16
; CHECK-NEXT:    sd ra, 8(sp) # 8-byte Folded Spill
; CHECK-NEXT:    rdvtype ra
; CHECK-NEXT:    rdvl t0
; CHECK-NEXT:    vsetvli zero, zero, e64,m4
; CHECK-NEXT:    vmv.v.v v16, v20
; CHECK-NEXT:    vsetvl zero, t0, ra
; CHECK-NEXT:    call __epi_sin_nxv4f64
; CHECK-NEXT:    ld ra, 8(sp) # 8-byte Folded Reload
; CHECK-NEXT:    addi sp, sp, 16
; CHECK-NEXT:    ret
  %1 = call <vscale x 4 x double> @llvm.sin.nxv4f64(<vscale x 4 x double> %b)
  ret <vscale x 4 x double> %1
}

define <vscale x 8 x double> @sin_nxv8f64(<vscale x 8 x double> %a, <vscale x 8 x double> %b) nounwind {
; CHECK-LABEL: sin_nxv8f64:
; CHECK:       # %bb.0:
; CHECK-NEXT:    addi sp, sp, -16
; CHECK-NEXT:    sd ra, 8(sp) # 8-byte Folded Spill
; CHECK-NEXT:    vsetvli zero, zero, e64,m8
; CHECK-NEXT:    vle.v v16, (a0)
; CHECK-NEXT:    call __epi_sin_nxv8f64
; CHECK-NEXT:    ld ra, 8(sp) # 8-byte Folded Reload
; CHECK-NEXT:    addi sp, sp, 16
; CHECK-NEXT:    ret
  %1 = call <vscale x 8 x double> @llvm.sin.nxv8f64(<vscale x 8 x double> %b)
  ret <vscale x 8 x double> %1
}

define <vscale x 2 x float> @sin_nxv2f32(<vscale x 2 x float> %a, <vscale x 2 x float> %b) nounwind {
; CHECK-LABEL: sin_nxv2f32:
; CHECK:       # %bb.0:
; CHECK-NEXT:    addi sp, sp, -16
; CHECK-NEXT:    sd ra, 8(sp) # 8-byte Folded Spill
; CHECK-NEXT:    rdvtype ra
; CHECK-NEXT:    rdvl t0
; CHECK-NEXT:    vsetvli zero, zero, e64,m1
; CHECK-NEXT:    vmv.v.v v16, v17
; CHECK-NEXT:    vsetvl zero, t0, ra
; CHECK-NEXT:    call __epi_sin_nxv2f32
; CHECK-NEXT:    ld ra, 8(sp) # 8-byte Folded Reload
; CHECK-NEXT:    addi sp, sp, 16
; CHECK-NEXT:    ret
  %1 = call <vscale x 2 x float> @llvm.sin.nxv2f32(<vscale x 2 x float> %b)
  ret <vscale x 2 x float> %1
}

define <vscale x 4 x float> @sin_nxv4f32(<vscale x 4 x float> %a, <vscale x 4 x float> %b) nounwind {
; CHECK-LABEL: sin_nxv4f32:
; CHECK:       # %bb.0:
; CHECK-NEXT:    addi sp, sp, -16
; CHECK-NEXT:    sd ra, 8(sp) # 8-byte Folded Spill
; CHECK-NEXT:    rdvtype ra
; CHECK-NEXT:    rdvl t0
; CHECK-NEXT:    vsetvli zero, zero, e64,m2
; CHECK-NEXT:    vmv.v.v v16, v18
; CHECK-NEXT:    vsetvl zero, t0, ra
; CHECK-NEXT:    call __epi_sin_nxv4f32
; CHECK-NEXT:    ld ra, 8(sp) # 8-byte Folded Reload
; CHECK-NEXT:    addi sp, sp, 16
; CHECK-NEXT:    ret
  %1 = call <vscale x 4 x float> @llvm.sin.nxv4f32(<vscale x 4 x float> %b)
  ret <vscale x 4 x float> %1
}

define <vscale x 8 x float> @sin_nxv8f32(<vscale x 8 x float> %a, <vscale x 8 x float> %b) nounwind {
; CHECK-LABEL: sin_nxv8f32:
; CHECK:       # %bb.0:
; CHECK-NEXT:    addi sp, sp, -16
; CHECK-NEXT:    sd ra, 8(sp) # 8-byte Folded Spill
; CHECK-NEXT:    rdvtype ra
; CHECK-NEXT:    rdvl t0
; CHECK-NEXT:    vsetvli zero, zero, e64,m4
; CHECK-NEXT:    vmv.v.v v16, v20
; CHECK-NEXT:    vsetvl zero, t0, ra
; CHECK-NEXT:    call __epi_sin_nxv8f32
; CHECK-NEXT:    ld ra, 8(sp) # 8-byte Folded Reload
; CHECK-NEXT:    addi sp, sp, 16
; CHECK-NEXT:    ret
  %1 = call <vscale x 8 x float> @llvm.sin.nxv8f32(<vscale x 8 x float> %b)
  ret <vscale x 8 x float> %1
}

define <vscale x 16 x float> @sin_nxv16f32(<vscale x 16 x float> %a, <vscale x 16 x float> %b) nounwind {
; CHECK-LABEL: sin_nxv16f32:
; CHECK:       # %bb.0:
; CHECK-NEXT:    addi sp, sp, -16
; CHECK-NEXT:    sd ra, 8(sp) # 8-byte Folded Spill
; CHECK-NEXT:    vsetvli zero, zero, e32,m8
; CHECK-NEXT:    vle.v v16, (a0)
; CHECK-NEXT:    call __epi_sin_nxv16f32
; CHECK-NEXT:    ld ra, 8(sp) # 8-byte Folded Reload
; CHECK-NEXT:    addi sp, sp, 16
; CHECK-NEXT:    ret
  %1 = call <vscale x 16 x float> @llvm.sin.nxv16f32(<vscale x 16 x float> %b)
  ret <vscale x 16 x float> %1
}

declare <vscale x 1 x double> @llvm.sin.nxv1f64(<vscale x 1 x double>)
declare <vscale x 2 x double> @llvm.sin.nxv2f64(<vscale x 2 x double>)
declare <vscale x 4 x double> @llvm.sin.nxv4f64(<vscale x 4 x double>)
declare <vscale x 8 x double> @llvm.sin.nxv8f64(<vscale x 8 x double>)
declare <vscale x 2 x float> @llvm.sin.nxv2f32(<vscale x 2 x float>)
declare <vscale x 4 x float> @llvm.sin.nxv4f32(<vscale x 4 x float>)
declare <vscale x 8 x float> @llvm.sin.nxv8f32(<vscale x 8 x float>)
declare <vscale x 16 x float> @llvm.sin.nxv16f32(<vscale x 16 x float>)
