; NOTE: Assertions have been autogenerated by utils/update_llc_test_checks.py
; RUN: llc -mtriple=riscv64 -mattr=+m,+f,+d,+a,+c,+experimental-v,+only-lmul1 \
; RUN:    -target-abi lp64d -verify-machineinstrs < %s | FileCheck %s
define void @foo(<vscale x 2 x i64>* %px, <vscale x 2 x i32>* %pz, i32 %evl) {
; CHECK-LABEL: foo:
; CHECK:       # %bb.0:
; CHECK-NEXT:    sext.w a5, a2
; CHECK-NEXT:    vsetvli a3, zero, e64,m1
; CHECK-NEXT:    sext.w a4, a3
; CHECK-NEXT:    bltu a4, a5, .LBB0_2
; CHECK-NEXT:  # %bb.1:
; CHECK-NEXT:    add a4, zero, a5
; CHECK-NEXT:  .LBB0_2:
; CHECK-NEXT:    subw a6, a2, a4
; CHECK-NEXT:    slli a5, a3, 3
; CHECK-NEXT:    add a5, a5, a0
; CHECK-NEXT:    vsetvli zero, a6, e64,m1
; CHECK-NEXT:    vle.v v2, (a5)
; CHECK-NEXT:    vsetvli zero, a4, e64,m1
; CHECK-NEXT:    vle.v v4, (a0)
; CHECK-NEXT:    vsetvli zero, a4, e32,m1
; CHECK-NEXT:    vnsrl.vi v1, v4, 0
; CHECK-NEXT:    vsetvli zero, a6, e32,m1
; CHECK-NEXT:    vnsrl.vi v4, v2, 0
; CHECK-NEXT:    slli a0, a3, 1
; CHECK-NEXT:    vsetvli zero, a0, e32,m1
; CHECK-NEXT:    vslideup.vx v1, v4, a3
; CHECK-NEXT:    vsetvli zero, a2, e32,m1
; CHECK-NEXT:    vse.v v1, (a1)
; CHECK-NEXT:    ret
  %allones.1 = insertelement <vscale x 2 x i1> undef, i1 1, i32 0
  %allones = shufflevector <vscale x 2 x i1> %allones.1, <vscale x 2 x i1> undef, <vscale x 2 x i32> zeroinitializer

  %x = call <vscale x 2 x i64> @llvm.vp.load.nxv2i64(<vscale x 2 x i64>* %px, i32 8, <vscale x 2 x i1> %allones, i32 %evl)
  %z = call <vscale x 2 x i32> @llvm.vp.trunc.nxv2i32.nxv2i64(<vscale x 2 x i64> %x, <vscale x 2 x i1> %allones, i32 %evl)

  call void @llvm.vp.store.nxv2i32(<vscale x 2 x i32> %z,  <vscale x 2 x i32>* %pz, i32 8, <vscale x 2 x i1> %allones, i32 %evl)
  ret void
}

declare <vscale x 2 x i64> @llvm.vp.load.nxv2i64(<vscale x 2 x i64>* %px, i32 %align, <vscale x 2 x i1> %mask, i32 %evl)
declare <vscale x 2 x i32> @llvm.vp.trunc.nxv2i32.nxv2i64(<vscale x 2 x i64> %a, <vscale x 2 x i1> %mask, i32 %evl)
declare void @llvm.vp.store.nxv2i32(<vscale x 2 x i32> %z, <vscale x 2 x i32>* %pz, i32 %align, <vscale x 2 x i1> %mask, i32 %evl)
