; NOTE: Assertions have been autogenerated by utils/update_llc_test_checks.py
; RUN: llc -mtriple riscv64 < %s | FileCheck %s

@y = dso_local thread_local(localexec) global i32 42, align 4

define dso_local void @foo() nounwind {
; CHECK-LABEL: foo:
; CHECK:       # %bb.0: # %entry
; CHECK-NEXT:    lui a0, %tprel_hi(y)
; CHECK-NEXT:    add a0, a0, tp, %tprel_add(y)
; CHECK-NEXT:    lw a1, %tprel_lo(y)(a0)
; CHECK-NEXT:    addi a1, a1, 1
; CHECK-NEXT:    sw a1, %tprel_lo(y)(a0)
; CHECK-NEXT:    ret
entry:
  %0 = load i32, i32* @y, align 4
  %inc = add nsw i32 %0, 1
  store i32 %inc, i32* @y, align 4
  ret void
}

