; NOTE: Assertions have been autogenerated by utils/update_llc_test_checks.py
; RUN: llc -mtriple=riscv64 -mattr=+experimental-v -verify-machineinstrs -O0 \
; RUN:    < %s | FileCheck --check-prefix=CHECK-O0 %s
; RUN: llc -mtriple=riscv64 -mattr=+experimental-v -verify-machineinstrs -O2 \
; RUN:    < %s | FileCheck --check-prefix=CHECK-O2 %s

@scratch = global i8 0, align 16

define void @test_vp_fp(<vscale x 1 x double>* %a0, <vscale x 1 x double>* %a1, <vscale x 1 x double>* %a2, <vscale x 1 x i64>* %a3, <vscale x 1 x i1> %m, i32 %n) nounwind {
; CHECK-O0-LABEL: test_vp_fp:
; CHECK-O0:       # %bb.0:
; CHECK-O0-NEXT:    addi sp, sp, -64
; CHECK-O0-NEXT:    sd ra, 56(sp) # 8-byte Folded Spill
; CHECK-O0-NEXT:    sd s0, 48(sp) # 8-byte Folded Spill
; CHECK-O0-NEXT:    addi s0, sp, 64
; CHECK-O0-NEXT:    rdvtype ra
; CHECK-O0-NEXT:    rdvl t0
; CHECK-O0-NEXT:    vsetvli a5, zero, e8,m1
; CHECK-O0-NEXT:    vsetvl zero, t0, ra
; CHECK-O0-NEXT:    sub sp, sp, a5
; CHECK-O0-NEXT:    sd sp, -56(s0)
; CHECK-O0-NEXT:    mv a5, a4
; CHECK-O0-NEXT:    ld a7, -56(s0)
; CHECK-O0-NEXT:    rdvtype a6
; CHECK-O0-NEXT:    rdvl a4
; CHECK-O0-NEXT:    vsetvli zero, zero, e64,m1
; CHECK-O0-NEXT:    vse.v v0, (a7)
; CHECK-O0-NEXT:    vsetvl zero, a4, a6
; CHECK-O0-NEXT:    mv a4, a0
; CHECK-O0-NEXT:    # kill: def $x10 killed $x15
; CHECK-O0-NEXT:    lui a0, %hi(scratch)
; CHECK-O0-NEXT:    addi a0, a0, %lo(scratch)
; CHECK-O0-NEXT:    # implicit-def: $v1
; CHECK-O0-NEXT:    vsetvli zero, a5, e64,m1
; CHECK-O0-NEXT:    vle.v v1, (a4), v0.t
; CHECK-O0-NEXT:    ld a6, -56(s0)
; CHECK-O0-NEXT:    rdvtype a5
; CHECK-O0-NEXT:    rdvl a4
; CHECK-O0-NEXT:    vsetvli zero, zero, e64,m1
; CHECK-O0-NEXT:    # implicit-def: $v0
; CHECK-O0-NEXT:    vle.v v0, (a6)
; CHECK-O0-NEXT:    vsetvl zero, a4, a5
; CHECK-O0-NEXT:    # implicit-def: $v2
; CHECK-O0-NEXT:    vle.v v2, (a1), v0.t
; CHECK-O0-NEXT:    ld a5, -56(s0)
; CHECK-O0-NEXT:    rdvtype a4
; CHECK-O0-NEXT:    rdvl a1
; CHECK-O0-NEXT:    vsetvli zero, zero, e64,m1
; CHECK-O0-NEXT:    # implicit-def: $v0
; CHECK-O0-NEXT:    vle.v v0, (a5)
; CHECK-O0-NEXT:    vsetvl zero, a1, a4
; CHECK-O0-NEXT:    # implicit-def: $v17
; CHECK-O0-NEXT:    vle.v v17, (a2), v0.t
; CHECK-O0-NEXT:    ld a4, -56(s0)
; CHECK-O0-NEXT:    rdvtype a2
; CHECK-O0-NEXT:    rdvl a1
; CHECK-O0-NEXT:    vsetvli zero, zero, e64,m1
; CHECK-O0-NEXT:    # implicit-def: $v0
; CHECK-O0-NEXT:    vle.v v0, (a4)
; CHECK-O0-NEXT:    vsetvl zero, a1, a2
; CHECK-O0-NEXT:    # implicit-def: $v16
; CHECK-O0-NEXT:    vle.v v16, (a3), v0.t
; CHECK-O0-NEXT:    ld a3, -56(s0)
; CHECK-O0-NEXT:    rdvtype a2
; CHECK-O0-NEXT:    rdvl a1
; CHECK-O0-NEXT:    vsetvli zero, zero, e64,m1
; CHECK-O0-NEXT:    # implicit-def: $v0
; CHECK-O0-NEXT:    vle.v v0, (a3)
; CHECK-O0-NEXT:    vsetvl zero, a1, a2
; CHECK-O0-NEXT:    # implicit-def: $v7
; CHECK-O0-NEXT:    vfadd.vv v7, v1, v2, v0.t
; CHECK-O0-NEXT:    ld a3, -56(s0)
; CHECK-O0-NEXT:    rdvtype a2
; CHECK-O0-NEXT:    rdvl a1
; CHECK-O0-NEXT:    vsetvli zero, zero, e64,m1
; CHECK-O0-NEXT:    # implicit-def: $v0
; CHECK-O0-NEXT:    vle.v v0, (a3)
; CHECK-O0-NEXT:    vsetvl zero, a1, a2
; CHECK-O0-NEXT:    # implicit-def: $v6
; CHECK-O0-NEXT:    vfsub.vv v6, v1, v2, v0.t
; CHECK-O0-NEXT:    ld a3, -56(s0)
; CHECK-O0-NEXT:    rdvtype a2
; CHECK-O0-NEXT:    rdvl a1
; CHECK-O0-NEXT:    vsetvli zero, zero, e64,m1
; CHECK-O0-NEXT:    # implicit-def: $v0
; CHECK-O0-NEXT:    vle.v v0, (a3)
; CHECK-O0-NEXT:    vsetvl zero, a1, a2
; CHECK-O0-NEXT:    # implicit-def: $v5
; CHECK-O0-NEXT:    vfmul.vv v5, v1, v2, v0.t
; CHECK-O0-NEXT:    ld a3, -56(s0)
; CHECK-O0-NEXT:    rdvtype a2
; CHECK-O0-NEXT:    rdvl a1
; CHECK-O0-NEXT:    vsetvli zero, zero, e64,m1
; CHECK-O0-NEXT:    # implicit-def: $v0
; CHECK-O0-NEXT:    vle.v v0, (a3)
; CHECK-O0-NEXT:    vsetvl zero, a1, a2
; CHECK-O0-NEXT:    # implicit-def: $v4
; CHECK-O0-NEXT:    vfdiv.vv v4, v1, v2, v0.t
; CHECK-O0-NEXT:    ld a3, -56(s0)
; CHECK-O0-NEXT:    rdvtype a2
; CHECK-O0-NEXT:    rdvl a1
; CHECK-O0-NEXT:    vsetvli zero, zero, e64,m1
; CHECK-O0-NEXT:    # implicit-def: $v0
; CHECK-O0-NEXT:    vle.v v0, (a3)
; CHECK-O0-NEXT:    vsetvl zero, a1, a2
; CHECK-O0-NEXT:    rdvtype ra
; CHECK-O0-NEXT:    rdvl t0
; CHECK-O0-NEXT:    vsetvli zero, zero, e64,m1
; CHECK-O0-NEXT:    vmv.v.v v3, v1
; CHECK-O0-NEXT:    vsetvl zero, t0, ra
; CHECK-O0-NEXT:    vfmadd.vv v3, v2, v17, v0.t
; CHECK-O0-NEXT:    ld a3, -56(s0)
; CHECK-O0-NEXT:    rdvtype a2
; CHECK-O0-NEXT:    rdvl a1
; CHECK-O0-NEXT:    vsetvli zero, zero, e64,m1
; CHECK-O0-NEXT:    # implicit-def: $v0
; CHECK-O0-NEXT:    vle.v v0, (a3)
; CHECK-O0-NEXT:    vsetvl zero, a1, a2
; CHECK-O0-NEXT:    # implicit-def: $v2
; CHECK-O0-NEXT:    vfsgnjn.vv v2, v1, v1, v0.t
; CHECK-O0-NEXT:    ld a3, -56(s0)
; CHECK-O0-NEXT:    rdvtype a2
; CHECK-O0-NEXT:    rdvl a1
; CHECK-O0-NEXT:    vsetvli zero, zero, e64,m1
; CHECK-O0-NEXT:    # implicit-def: $v0
; CHECK-O0-NEXT:    vle.v v0, (a3)
; CHECK-O0-NEXT:    vsetvl zero, a1, a2
; CHECK-O0-NEXT:    # implicit-def: $v1
; CHECK-O0-NEXT:    vfcvt.f.x.v v1, v16, v0.t
; CHECK-O0-NEXT:    ld a3, -56(s0)
; CHECK-O0-NEXT:    rdvtype a2
; CHECK-O0-NEXT:    rdvl a1
; CHECK-O0-NEXT:    vsetvli zero, zero, e64,m1
; CHECK-O0-NEXT:    # implicit-def: $v0
; CHECK-O0-NEXT:    vle.v v0, (a3)
; CHECK-O0-NEXT:    vsetvl zero, a1, a2
; CHECK-O0-NEXT:    vse.v v7, (a0), v0.t
; CHECK-O0-NEXT:    ld a3, -56(s0)
; CHECK-O0-NEXT:    rdvtype a2
; CHECK-O0-NEXT:    rdvl a1
; CHECK-O0-NEXT:    vsetvli zero, zero, e64,m1
; CHECK-O0-NEXT:    # implicit-def: $v0
; CHECK-O0-NEXT:    vle.v v0, (a3)
; CHECK-O0-NEXT:    vsetvl zero, a1, a2
; CHECK-O0-NEXT:    vse.v v6, (a0), v0.t
; CHECK-O0-NEXT:    ld a3, -56(s0)
; CHECK-O0-NEXT:    rdvtype a2
; CHECK-O0-NEXT:    rdvl a1
; CHECK-O0-NEXT:    vsetvli zero, zero, e64,m1
; CHECK-O0-NEXT:    # implicit-def: $v0
; CHECK-O0-NEXT:    vle.v v0, (a3)
; CHECK-O0-NEXT:    vsetvl zero, a1, a2
; CHECK-O0-NEXT:    vse.v v5, (a0), v0.t
; CHECK-O0-NEXT:    ld a3, -56(s0)
; CHECK-O0-NEXT:    rdvtype a2
; CHECK-O0-NEXT:    rdvl a1
; CHECK-O0-NEXT:    vsetvli zero, zero, e64,m1
; CHECK-O0-NEXT:    # implicit-def: $v0
; CHECK-O0-NEXT:    vle.v v0, (a3)
; CHECK-O0-NEXT:    vsetvl zero, a1, a2
; CHECK-O0-NEXT:    vse.v v4, (a0), v0.t
; CHECK-O0-NEXT:    ld a3, -56(s0)
; CHECK-O0-NEXT:    rdvtype a2
; CHECK-O0-NEXT:    rdvl a1
; CHECK-O0-NEXT:    vsetvli zero, zero, e64,m1
; CHECK-O0-NEXT:    # implicit-def: $v0
; CHECK-O0-NEXT:    vle.v v0, (a3)
; CHECK-O0-NEXT:    vsetvl zero, a1, a2
; CHECK-O0-NEXT:    vse.v v3, (a0), v0.t
; CHECK-O0-NEXT:    ld a3, -56(s0)
; CHECK-O0-NEXT:    rdvtype a2
; CHECK-O0-NEXT:    rdvl a1
; CHECK-O0-NEXT:    vsetvli zero, zero, e64,m1
; CHECK-O0-NEXT:    # implicit-def: $v0
; CHECK-O0-NEXT:    vle.v v0, (a3)
; CHECK-O0-NEXT:    vsetvl zero, a1, a2
; CHECK-O0-NEXT:    vse.v v2, (a0), v0.t
; CHECK-O0-NEXT:    ld a3, -56(s0)
; CHECK-O0-NEXT:    rdvtype a2
; CHECK-O0-NEXT:    rdvl a1
; CHECK-O0-NEXT:    vsetvli zero, zero, e64,m1
; CHECK-O0-NEXT:    # implicit-def: $v0
; CHECK-O0-NEXT:    vle.v v0, (a3)
; CHECK-O0-NEXT:    vsetvl zero, a1, a2
; CHECK-O0-NEXT:    vse.v v1, (a0), v0.t
; CHECK-O0-NEXT:    addi sp, s0, -64
; CHECK-O0-NEXT:    ld s0, 48(sp) # 8-byte Folded Reload
; CHECK-O0-NEXT:    ld ra, 56(sp) # 8-byte Folded Reload
; CHECK-O0-NEXT:    addi sp, sp, 64
; CHECK-O0-NEXT:    ret
;
; CHECK-O2-LABEL: test_vp_fp:
; CHECK-O2:       # %bb.0:
; CHECK-O2-NEXT:    lui a5, %hi(scratch)
; CHECK-O2-NEXT:    vsetvli zero, a4, e64,m1
; CHECK-O2-NEXT:    vle.v v1, (a0), v0.t
; CHECK-O2-NEXT:    vle.v v2, (a1), v0.t
; CHECK-O2-NEXT:    addi a0, a5, %lo(scratch)
; CHECK-O2-NEXT:    vle.v v3, (a2), v0.t
; CHECK-O2-NEXT:    vle.v v4, (a3), v0.t
; CHECK-O2-NEXT:    vfadd.vv v5, v1, v2, v0.t
; CHECK-O2-NEXT:    vfsub.vv v6, v1, v2, v0.t
; CHECK-O2-NEXT:    vfmul.vv v7, v1, v2, v0.t
; CHECK-O2-NEXT:    vfdiv.vv v16, v1, v2, v0.t
; CHECK-O2-NEXT:    vfmacc.vv v3, v1, v2, v0.t
; CHECK-O2-NEXT:    vfsgnjn.vv v1, v1, v1, v0.t
; CHECK-O2-NEXT:    vfcvt.f.x.v v2, v4, v0.t
; CHECK-O2-NEXT:    vse.v v5, (a0), v0.t
; CHECK-O2-NEXT:    vse.v v6, (a0), v0.t
; CHECK-O2-NEXT:    vse.v v7, (a0), v0.t
; CHECK-O2-NEXT:    vse.v v16, (a0), v0.t
; CHECK-O2-NEXT:    vse.v v3, (a0), v0.t
; CHECK-O2-NEXT:    vse.v v1, (a0), v0.t
; CHECK-O2-NEXT:    vse.v v2, (a0), v0.t
; CHECK-O2-NEXT:    ret
  %store_addr = bitcast i8* @scratch to <vscale x 1 x double>*

  %i0 = call <vscale x 1 x double> @llvm.vp.load.nxv1f64(<vscale x 1 x double>* %a0, i32 8, <vscale x 1 x i1> %m, i32 %n)
  %i1 = call <vscale x 1 x double> @llvm.vp.load.nxv1f64(<vscale x 1 x double>* %a1, i32 8, <vscale x 1 x i1> %m, i32 %n)
  %i2 = call <vscale x 1 x double> @llvm.vp.load.nxv1f64(<vscale x 1 x double>* %a2, i32 8, <vscale x 1 x i1> %m, i32 %n)
  %i3 = call <vscale x 1 x i64> @llvm.vp.load.nxv1i64(<vscale x 1 x i64>* %a3, i32 8, <vscale x 1 x i1> %m, i32 %n)

  %r0 = call <vscale x 1 x double> @llvm.vp.fadd.nxv1f64(<vscale x 1 x double> %i0, <vscale x 1 x double> %i1, metadata !"", metadata !"", <vscale x 1 x i1> %m, i32 %n)
  %r1 = call <vscale x 1 x double> @llvm.vp.fsub.nxv1f64(<vscale x 1 x double> %i0, <vscale x 1 x double> %i1, metadata !"", metadata !"", <vscale x 1 x i1> %m, i32 %n)
  %r2 = call <vscale x 1 x double> @llvm.vp.fmul.nxv1f64(<vscale x 1 x double> %i0, <vscale x 1 x double> %i1, metadata !"", metadata !"", <vscale x 1 x i1> %m, i32 %n)
  %r3 = call <vscale x 1 x double> @llvm.vp.fdiv.nxv1f64(<vscale x 1 x double> %i0, <vscale x 1 x double> %i1, metadata !"", metadata !"", <vscale x 1 x i1> %m, i32 %n)
  ;%r4 = call <vscale x 1 x double> @llvm.vp.frem.nxv1f64(<vscale x 1 x double> %i0, <vscale x 1 x double> %i1, metadata !"", metadata !"", <vscale x 1 x i1> %m, i32 %n)
  %r5 = call <vscale x 1 x double> @llvm.vp.fma.nxv1f64(<vscale x 1 x double> %i0, <vscale x 1 x double> %i1, <vscale x 1 x double> %i2, metadata !"", metadata !"", <vscale x 1 x i1> %m, i32 %n)
  %r6 = call <vscale x 1 x double> @llvm.vp.fneg.nxv1f64(<vscale x 1 x double> %i0, metadata !"", <vscale x 1 x i1> %m, i32 %n)
  %r7 = call <vscale x 1 x double> @llvm.vp.sitofp.nxv1f64.nxv1i64(<vscale x 1 x i64> %i3, metadata !"", metadata !"", <vscale x 1 x i1> %m, i32 %n)

  call void @llvm.vp.store.nxv1f64(<vscale x 1 x double> %r0, <vscale x 1 x double>* %store_addr, i32 8, <vscale x 1 x i1> %m, i32 %n)
  call void @llvm.vp.store.nxv1f64(<vscale x 1 x double> %r1, <vscale x 1 x double>* %store_addr, i32 8, <vscale x 1 x i1> %m, i32 %n)
  call void @llvm.vp.store.nxv1f64(<vscale x 1 x double> %r2, <vscale x 1 x double>* %store_addr, i32 8, <vscale x 1 x i1> %m, i32 %n)
  call void @llvm.vp.store.nxv1f64(<vscale x 1 x double> %r3, <vscale x 1 x double>* %store_addr, i32 8, <vscale x 1 x i1> %m, i32 %n)
  ;call void @llvm.vp.store.nxv1f64(<vscale x 1 x double> %r4, <vscale x 1 x double>* %store_addr, i32 8, <vscale x 1 x i1> %m, i32 %n)
  call void @llvm.vp.store.nxv1f64(<vscale x 1 x double> %r5, <vscale x 1 x double>* %store_addr, i32 8, <vscale x 1 x i1> %m, i32 %n)
  call void @llvm.vp.store.nxv1f64(<vscale x 1 x double> %r6, <vscale x 1 x double>* %store_addr, i32 8, <vscale x 1 x i1> %m, i32 %n)
  call void @llvm.vp.store.nxv1f64(<vscale x 1 x double> %r7, <vscale x 1 x double>* %store_addr, i32 8, <vscale x 1 x i1> %m, i32 %n)

  ret void
}

define void @test_vp_fp_2(<vscale x 2 x float>* %a0, <vscale x 2 x float>* %a1, <vscale x 2 x float>* %a2, <vscale x 2 x i32>* %a3, i32 %n) nounwind {
; CHECK-O0-LABEL: test_vp_fp_2:
; CHECK-O0:       # %bb.0:
; CHECK-O0-NEXT:    mv a5, a4
; CHECK-O0-NEXT:    mv a4, a0
; CHECK-O0-NEXT:    # kill: def $x10 killed $x15
; CHECK-O0-NEXT:    lui a0, %hi(scratch)
; CHECK-O0-NEXT:    addi a0, a0, %lo(scratch)
; CHECK-O0-NEXT:    # implicit-def: $v1
; CHECK-O0-NEXT:    vsetvli zero, a5, e32,m1
; CHECK-O0-NEXT:    vle.v v1, (a4)
; CHECK-O0-NEXT:    # implicit-def: $v2
; CHECK-O0-NEXT:    vle.v v2, (a1)
; CHECK-O0-NEXT:    # implicit-def: $v17
; CHECK-O0-NEXT:    vle.v v17, (a2)
; CHECK-O0-NEXT:    # implicit-def: $v16
; CHECK-O0-NEXT:    vle.v v16, (a3)
; CHECK-O0-NEXT:    # implicit-def: $v7
; CHECK-O0-NEXT:    vfadd.vv v7, v1, v2
; CHECK-O0-NEXT:    # implicit-def: $v6
; CHECK-O0-NEXT:    vfsub.vv v6, v1, v2
; CHECK-O0-NEXT:    # implicit-def: $v5
; CHECK-O0-NEXT:    vfmul.vv v5, v1, v2
; CHECK-O0-NEXT:    # implicit-def: $v4
; CHECK-O0-NEXT:    vfdiv.vv v4, v1, v2
; CHECK-O0-NEXT:    rdvtype t0
; CHECK-O0-NEXT:    rdvl t1
; CHECK-O0-NEXT:    vsetvli zero, zero, e64,m1
; CHECK-O0-NEXT:    vmv.v.v v3, v1
; CHECK-O0-NEXT:    vsetvl zero, t1, t0
; CHECK-O0-NEXT:    vfmadd.vv v3, v2, v17
; CHECK-O0-NEXT:    # implicit-def: $v2
; CHECK-O0-NEXT:    vfsgnjn.vv v2, v1, v1
; CHECK-O0-NEXT:    # implicit-def: $v1
; CHECK-O0-NEXT:    vfcvt.f.x.v v1, v16
; CHECK-O0-NEXT:    vse.v v7, (a0)
; CHECK-O0-NEXT:    vse.v v6, (a0)
; CHECK-O0-NEXT:    vse.v v5, (a0)
; CHECK-O0-NEXT:    vse.v v4, (a0)
; CHECK-O0-NEXT:    vse.v v3, (a0)
; CHECK-O0-NEXT:    vse.v v2, (a0)
; CHECK-O0-NEXT:    vse.v v1, (a0)
; CHECK-O0-NEXT:    ret
;
; CHECK-O2-LABEL: test_vp_fp_2:
; CHECK-O2:       # %bb.0:
; CHECK-O2-NEXT:    lui a5, %hi(scratch)
; CHECK-O2-NEXT:    vsetvli zero, a4, e32,m1
; CHECK-O2-NEXT:    vle.v v1, (a0)
; CHECK-O2-NEXT:    vle.v v2, (a1)
; CHECK-O2-NEXT:    addi a0, a5, %lo(scratch)
; CHECK-O2-NEXT:    vle.v v3, (a2)
; CHECK-O2-NEXT:    vle.v v4, (a3)
; CHECK-O2-NEXT:    vfadd.vv v5, v1, v2
; CHECK-O2-NEXT:    vfsub.vv v6, v1, v2
; CHECK-O2-NEXT:    vfmul.vv v7, v1, v2
; CHECK-O2-NEXT:    vfdiv.vv v16, v1, v2
; CHECK-O2-NEXT:    vfmacc.vv v3, v1, v2
; CHECK-O2-NEXT:    vfsgnjn.vv v1, v1, v1
; CHECK-O2-NEXT:    vfcvt.f.x.v v2, v4
; CHECK-O2-NEXT:    vse.v v5, (a0)
; CHECK-O2-NEXT:    vse.v v6, (a0)
; CHECK-O2-NEXT:    vse.v v7, (a0)
; CHECK-O2-NEXT:    vse.v v16, (a0)
; CHECK-O2-NEXT:    vse.v v3, (a0)
; CHECK-O2-NEXT:    vse.v v1, (a0)
; CHECK-O2-NEXT:    vse.v v2, (a0)
; CHECK-O2-NEXT:    ret
  %head = insertelement <vscale x 2 x i1> undef, i1 1, i32 0
  %allones = shufflevector <vscale x 2 x i1> %head, <vscale x 2 x i1> undef, <vscale x 2 x i32> zeroinitializer

  %store_addr = bitcast i8* @scratch to <vscale x 2 x float>*

  %i0 = call <vscale x 2 x float> @llvm.vp.load.nxv2f32(<vscale x 2 x float>* %a0, i32 8, <vscale x 2 x i1> %allones, i32 %n)
  %i1 = call <vscale x 2 x float> @llvm.vp.load.nxv2f32(<vscale x 2 x float>* %a1, i32 8, <vscale x 2 x i1> %allones, i32 %n)
  %i2 = call <vscale x 2 x float> @llvm.vp.load.nxv2f32(<vscale x 2 x float>* %a2, i32 8, <vscale x 2 x i1> %allones, i32 %n)
  %i3 = call <vscale x 2 x i32> @llvm.vp.load.nxv2i32(<vscale x 2 x i32>* %a3, i32 8, <vscale x 2 x i1> %allones, i32 %n)

  %r0 = call <vscale x 2 x float> @llvm.vp.fadd.nxv2f32(<vscale x 2 x float> %i0, <vscale x 2 x float> %i1, metadata !"", metadata !"", <vscale x 2 x i1> %allones, i32 %n)
  %r1 = call <vscale x 2 x float> @llvm.vp.fsub.nxv2f32(<vscale x 2 x float> %i0, <vscale x 2 x float> %i1, metadata !"", metadata !"", <vscale x 2 x i1> %allones, i32 %n)
  %r2 = call <vscale x 2 x float> @llvm.vp.fmul.nxv2f32(<vscale x 2 x float> %i0, <vscale x 2 x float> %i1, metadata !"", metadata !"", <vscale x 2 x i1> %allones, i32 %n)
  %r3 = call <vscale x 2 x float> @llvm.vp.fdiv.nxv2f32(<vscale x 2 x float> %i0, <vscale x 2 x float> %i1, metadata !"", metadata !"", <vscale x 2 x i1> %allones, i32 %n)
  ;%r4 = call <vscale x 2 x float> @llvm.vp.frem.nxv2f32(<vscale x 2 x float> %i0, <vscale x 2 x float> %i1, metadata !"", metadata !"", <vscale x 2 x i1> %allones, i32 %n)
  %r5 = call <vscale x 2 x float> @llvm.vp.fma.nxv2f32(<vscale x 2 x float> %i0, <vscale x 2 x float> %i1, <vscale x 2 x float> %i2, metadata !"", metadata !"", <vscale x 2 x i1> %allones, i32 %n)
  %r6 = call <vscale x 2 x float> @llvm.vp.fneg.nxv2f32(<vscale x 2 x float> %i0, metadata !"", <vscale x 2 x i1> %allones, i32 %n)
  %r7 = call <vscale x 2 x float> @llvm.vp.sitofp.nxv2f32.nxv2i32(<vscale x 2 x i32> %i3, metadata !"", metadata !"", <vscale x 2 x i1> %allones, i32 %n)

  call void @llvm.vp.store.nxv2f32(<vscale x 2 x float> %r0, <vscale x 2 x float>* %store_addr, i32 8, <vscale x 2 x i1> %allones, i32 %n)
  call void @llvm.vp.store.nxv2f32(<vscale x 2 x float> %r1, <vscale x 2 x float>* %store_addr, i32 8, <vscale x 2 x i1> %allones, i32 %n)
  call void @llvm.vp.store.nxv2f32(<vscale x 2 x float> %r2, <vscale x 2 x float>* %store_addr, i32 8, <vscale x 2 x i1> %allones, i32 %n)
  call void @llvm.vp.store.nxv2f32(<vscale x 2 x float> %r3, <vscale x 2 x float>* %store_addr, i32 8, <vscale x 2 x i1> %allones, i32 %n)
  ;call void @llvm.vp.store.nxv2f32(<vscale x 2 x float> %r4, <vscale x 2 x float>* %store_addr, i32 8, <vscale x 2 x i1> %allones, i32 %n)
  call void @llvm.vp.store.nxv2f32(<vscale x 2 x float> %r5, <vscale x 2 x float>* %store_addr, i32 8, <vscale x 2 x i1> %allones, i32 %n)
  call void @llvm.vp.store.nxv2f32(<vscale x 2 x float> %r6, <vscale x 2 x float>* %store_addr, i32 8, <vscale x 2 x i1> %allones, i32 %n)
  call void @llvm.vp.store.nxv2f32(<vscale x 2 x float> %r7, <vscale x 2 x float>* %store_addr, i32 8, <vscale x 2 x i1> %allones, i32 %n)

  ret void
}

define void @test_vp_fp_3(<vscale x 2 x double>* %a0, <vscale x 2 x double>* %a1, <vscale x 2 x double>* %a2, <vscale x 2 x i64>* %a3, <vscale x 2 x i1> %m, i32 %n) nounwind {
; CHECK-O0-LABEL: test_vp_fp_3:
; CHECK-O0:       # %bb.0:
; CHECK-O0-NEXT:    addi sp, sp, -64
; CHECK-O0-NEXT:    sd ra, 56(sp) # 8-byte Folded Spill
; CHECK-O0-NEXT:    sd s0, 48(sp) # 8-byte Folded Spill
; CHECK-O0-NEXT:    addi s0, sp, 64
; CHECK-O0-NEXT:    rdvtype ra
; CHECK-O0-NEXT:    rdvl t0
; CHECK-O0-NEXT:    vsetvli a5, zero, e8,m1
; CHECK-O0-NEXT:    vsetvl zero, t0, ra
; CHECK-O0-NEXT:    sub sp, sp, a5
; CHECK-O0-NEXT:    sd sp, -56(s0)
; CHECK-O0-NEXT:    mv a5, a4
; CHECK-O0-NEXT:    ld a7, -56(s0)
; CHECK-O0-NEXT:    rdvtype a6
; CHECK-O0-NEXT:    rdvl a4
; CHECK-O0-NEXT:    vsetvli zero, zero, e64,m1
; CHECK-O0-NEXT:    vse.v v0, (a7)
; CHECK-O0-NEXT:    vsetvl zero, a4, a6
; CHECK-O0-NEXT:    mv a4, a0
; CHECK-O0-NEXT:    # kill: def $x10 killed $x15
; CHECK-O0-NEXT:    lui a0, %hi(scratch)
; CHECK-O0-NEXT:    addi a0, a0, %lo(scratch)
; CHECK-O0-NEXT:    # implicit-def: $v2m2
; CHECK-O0-NEXT:    vsetvli zero, a5, e64,m2
; CHECK-O0-NEXT:    vle.v v2, (a4), v0.t
; CHECK-O0-NEXT:    ld a6, -56(s0)
; CHECK-O0-NEXT:    rdvtype a5
; CHECK-O0-NEXT:    rdvl a4
; CHECK-O0-NEXT:    vsetvli zero, zero, e64,m1
; CHECK-O0-NEXT:    # implicit-def: $v0
; CHECK-O0-NEXT:    vle.v v0, (a6)
; CHECK-O0-NEXT:    vsetvl zero, a4, a5
; CHECK-O0-NEXT:    # implicit-def: $v4m2
; CHECK-O0-NEXT:    vle.v v4, (a1), v0.t
; CHECK-O0-NEXT:    ld a5, -56(s0)
; CHECK-O0-NEXT:    rdvtype a4
; CHECK-O0-NEXT:    rdvl a1
; CHECK-O0-NEXT:    vsetvli zero, zero, e64,m1
; CHECK-O0-NEXT:    # implicit-def: $v0
; CHECK-O0-NEXT:    vle.v v0, (a5)
; CHECK-O0-NEXT:    vsetvl zero, a1, a4
; CHECK-O0-NEXT:    # implicit-def: $v10m2
; CHECK-O0-NEXT:    vle.v v10, (a2), v0.t
; CHECK-O0-NEXT:    ld a4, -56(s0)
; CHECK-O0-NEXT:    rdvtype a2
; CHECK-O0-NEXT:    rdvl a1
; CHECK-O0-NEXT:    vsetvli zero, zero, e64,m1
; CHECK-O0-NEXT:    # implicit-def: $v0
; CHECK-O0-NEXT:    vle.v v0, (a4)
; CHECK-O0-NEXT:    vsetvl zero, a1, a2
; CHECK-O0-NEXT:    # implicit-def: $v8m2
; CHECK-O0-NEXT:    vle.v v8, (a3), v0.t
; CHECK-O0-NEXT:    ld a3, -56(s0)
; CHECK-O0-NEXT:    rdvtype a2
; CHECK-O0-NEXT:    rdvl a1
; CHECK-O0-NEXT:    vsetvli zero, zero, e64,m1
; CHECK-O0-NEXT:    # implicit-def: $v0
; CHECK-O0-NEXT:    vle.v v0, (a3)
; CHECK-O0-NEXT:    vsetvl zero, a1, a2
; CHECK-O0-NEXT:    # implicit-def: $v22m2
; CHECK-O0-NEXT:    vfadd.vv v22, v2, v4, v0.t
; CHECK-O0-NEXT:    ld a3, -56(s0)
; CHECK-O0-NEXT:    rdvtype a2
; CHECK-O0-NEXT:    rdvl a1
; CHECK-O0-NEXT:    vsetvli zero, zero, e64,m1
; CHECK-O0-NEXT:    # implicit-def: $v0
; CHECK-O0-NEXT:    vle.v v0, (a3)
; CHECK-O0-NEXT:    vsetvl zero, a1, a2
; CHECK-O0-NEXT:    # implicit-def: $v20m2
; CHECK-O0-NEXT:    vfsub.vv v20, v2, v4, v0.t
; CHECK-O0-NEXT:    ld a3, -56(s0)
; CHECK-O0-NEXT:    rdvtype a2
; CHECK-O0-NEXT:    rdvl a1
; CHECK-O0-NEXT:    vsetvli zero, zero, e64,m1
; CHECK-O0-NEXT:    # implicit-def: $v0
; CHECK-O0-NEXT:    vle.v v0, (a3)
; CHECK-O0-NEXT:    vsetvl zero, a1, a2
; CHECK-O0-NEXT:    # implicit-def: $v18m2
; CHECK-O0-NEXT:    vfmul.vv v18, v2, v4, v0.t
; CHECK-O0-NEXT:    ld a3, -56(s0)
; CHECK-O0-NEXT:    rdvtype a2
; CHECK-O0-NEXT:    rdvl a1
; CHECK-O0-NEXT:    vsetvli zero, zero, e64,m1
; CHECK-O0-NEXT:    # implicit-def: $v0
; CHECK-O0-NEXT:    vle.v v0, (a3)
; CHECK-O0-NEXT:    vsetvl zero, a1, a2
; CHECK-O0-NEXT:    # implicit-def: $v16m2
; CHECK-O0-NEXT:    vfdiv.vv v16, v2, v4, v0.t
; CHECK-O0-NEXT:    ld a3, -56(s0)
; CHECK-O0-NEXT:    rdvtype a2
; CHECK-O0-NEXT:    rdvl a1
; CHECK-O0-NEXT:    vsetvli zero, zero, e64,m1
; CHECK-O0-NEXT:    # implicit-def: $v0
; CHECK-O0-NEXT:    vle.v v0, (a3)
; CHECK-O0-NEXT:    vsetvl zero, a1, a2
; CHECK-O0-NEXT:    rdvtype ra
; CHECK-O0-NEXT:    rdvl t0
; CHECK-O0-NEXT:    vsetvli zero, zero, e64,m2
; CHECK-O0-NEXT:    vmv.v.v v6, v2
; CHECK-O0-NEXT:    vsetvl zero, t0, ra
; CHECK-O0-NEXT:    vfmadd.vv v6, v4, v10, v0.t
; CHECK-O0-NEXT:    ld a3, -56(s0)
; CHECK-O0-NEXT:    rdvtype a2
; CHECK-O0-NEXT:    rdvl a1
; CHECK-O0-NEXT:    vsetvli zero, zero, e64,m1
; CHECK-O0-NEXT:    # implicit-def: $v0
; CHECK-O0-NEXT:    vle.v v0, (a3)
; CHECK-O0-NEXT:    vsetvl zero, a1, a2
; CHECK-O0-NEXT:    # implicit-def: $v4m2
; CHECK-O0-NEXT:    vfsgnjn.vv v4, v2, v2, v0.t
; CHECK-O0-NEXT:    ld a3, -56(s0)
; CHECK-O0-NEXT:    rdvtype a2
; CHECK-O0-NEXT:    rdvl a1
; CHECK-O0-NEXT:    vsetvli zero, zero, e64,m1
; CHECK-O0-NEXT:    # implicit-def: $v0
; CHECK-O0-NEXT:    vle.v v0, (a3)
; CHECK-O0-NEXT:    vsetvl zero, a1, a2
; CHECK-O0-NEXT:    # implicit-def: $v2m2
; CHECK-O0-NEXT:    vfcvt.f.x.v v2, v8, v0.t
; CHECK-O0-NEXT:    ld a3, -56(s0)
; CHECK-O0-NEXT:    rdvtype a2
; CHECK-O0-NEXT:    rdvl a1
; CHECK-O0-NEXT:    vsetvli zero, zero, e64,m1
; CHECK-O0-NEXT:    # implicit-def: $v0
; CHECK-O0-NEXT:    vle.v v0, (a3)
; CHECK-O0-NEXT:    vsetvl zero, a1, a2
; CHECK-O0-NEXT:    vse.v v22, (a0), v0.t
; CHECK-O0-NEXT:    ld a3, -56(s0)
; CHECK-O0-NEXT:    rdvtype a2
; CHECK-O0-NEXT:    rdvl a1
; CHECK-O0-NEXT:    vsetvli zero, zero, e64,m1
; CHECK-O0-NEXT:    # implicit-def: $v0
; CHECK-O0-NEXT:    vle.v v0, (a3)
; CHECK-O0-NEXT:    vsetvl zero, a1, a2
; CHECK-O0-NEXT:    vse.v v20, (a0), v0.t
; CHECK-O0-NEXT:    ld a3, -56(s0)
; CHECK-O0-NEXT:    rdvtype a2
; CHECK-O0-NEXT:    rdvl a1
; CHECK-O0-NEXT:    vsetvli zero, zero, e64,m1
; CHECK-O0-NEXT:    # implicit-def: $v0
; CHECK-O0-NEXT:    vle.v v0, (a3)
; CHECK-O0-NEXT:    vsetvl zero, a1, a2
; CHECK-O0-NEXT:    vse.v v18, (a0), v0.t
; CHECK-O0-NEXT:    ld a3, -56(s0)
; CHECK-O0-NEXT:    rdvtype a2
; CHECK-O0-NEXT:    rdvl a1
; CHECK-O0-NEXT:    vsetvli zero, zero, e64,m1
; CHECK-O0-NEXT:    # implicit-def: $v0
; CHECK-O0-NEXT:    vle.v v0, (a3)
; CHECK-O0-NEXT:    vsetvl zero, a1, a2
; CHECK-O0-NEXT:    vse.v v16, (a0), v0.t
; CHECK-O0-NEXT:    ld a3, -56(s0)
; CHECK-O0-NEXT:    rdvtype a2
; CHECK-O0-NEXT:    rdvl a1
; CHECK-O0-NEXT:    vsetvli zero, zero, e64,m1
; CHECK-O0-NEXT:    # implicit-def: $v0
; CHECK-O0-NEXT:    vle.v v0, (a3)
; CHECK-O0-NEXT:    vsetvl zero, a1, a2
; CHECK-O0-NEXT:    vse.v v6, (a0), v0.t
; CHECK-O0-NEXT:    ld a3, -56(s0)
; CHECK-O0-NEXT:    rdvtype a2
; CHECK-O0-NEXT:    rdvl a1
; CHECK-O0-NEXT:    vsetvli zero, zero, e64,m1
; CHECK-O0-NEXT:    # implicit-def: $v0
; CHECK-O0-NEXT:    vle.v v0, (a3)
; CHECK-O0-NEXT:    vsetvl zero, a1, a2
; CHECK-O0-NEXT:    vse.v v4, (a0), v0.t
; CHECK-O0-NEXT:    ld a3, -56(s0)
; CHECK-O0-NEXT:    rdvtype a2
; CHECK-O0-NEXT:    rdvl a1
; CHECK-O0-NEXT:    vsetvli zero, zero, e64,m1
; CHECK-O0-NEXT:    # implicit-def: $v0
; CHECK-O0-NEXT:    vle.v v0, (a3)
; CHECK-O0-NEXT:    vsetvl zero, a1, a2
; CHECK-O0-NEXT:    vse.v v2, (a0), v0.t
; CHECK-O0-NEXT:    addi sp, s0, -64
; CHECK-O0-NEXT:    ld s0, 48(sp) # 8-byte Folded Reload
; CHECK-O0-NEXT:    ld ra, 56(sp) # 8-byte Folded Reload
; CHECK-O0-NEXT:    addi sp, sp, 64
; CHECK-O0-NEXT:    ret
;
; CHECK-O2-LABEL: test_vp_fp_3:
; CHECK-O2:       # %bb.0:
; CHECK-O2-NEXT:    lui a5, %hi(scratch)
; CHECK-O2-NEXT:    vsetvli zero, a4, e64,m2
; CHECK-O2-NEXT:    vle.v v2, (a0), v0.t
; CHECK-O2-NEXT:    vle.v v4, (a1), v0.t
; CHECK-O2-NEXT:    addi a0, a5, %lo(scratch)
; CHECK-O2-NEXT:    vle.v v6, (a2), v0.t
; CHECK-O2-NEXT:    vle.v v16, (a3), v0.t
; CHECK-O2-NEXT:    vfadd.vv v18, v2, v4, v0.t
; CHECK-O2-NEXT:    vfsub.vv v20, v2, v4, v0.t
; CHECK-O2-NEXT:    vfmul.vv v22, v2, v4, v0.t
; CHECK-O2-NEXT:    vfdiv.vv v8, v2, v4, v0.t
; CHECK-O2-NEXT:    vfmacc.vv v6, v2, v4, v0.t
; CHECK-O2-NEXT:    vfsgnjn.vv v2, v2, v2, v0.t
; CHECK-O2-NEXT:    vfcvt.f.x.v v4, v16, v0.t
; CHECK-O2-NEXT:    vse.v v18, (a0), v0.t
; CHECK-O2-NEXT:    vse.v v20, (a0), v0.t
; CHECK-O2-NEXT:    vse.v v22, (a0), v0.t
; CHECK-O2-NEXT:    vse.v v8, (a0), v0.t
; CHECK-O2-NEXT:    vse.v v6, (a0), v0.t
; CHECK-O2-NEXT:    vse.v v2, (a0), v0.t
; CHECK-O2-NEXT:    vse.v v4, (a0), v0.t
; CHECK-O2-NEXT:    ret
  %store_addr = bitcast i8* @scratch to <vscale x 2 x double>*

  %i0 = call <vscale x 2 x double> @llvm.vp.load.nxv2f64(<vscale x 2 x double>* %a0, i32 8, <vscale x 2 x i1> %m, i32 %n)
  %i1 = call <vscale x 2 x double> @llvm.vp.load.nxv2f64(<vscale x 2 x double>* %a1, i32 8, <vscale x 2 x i1> %m, i32 %n)
  %i2 = call <vscale x 2 x double> @llvm.vp.load.nxv2f64(<vscale x 2 x double>* %a2, i32 8, <vscale x 2 x i1> %m, i32 %n)
  %i3 = call <vscale x 2 x i64> @llvm.vp.load.nxv2i64(<vscale x 2 x i64>* %a3, i32 8, <vscale x 2 x i1> %m, i32 %n)

  %r0 = call <vscale x 2 x double> @llvm.vp.fadd.nxv2f64(<vscale x 2 x double> %i0, <vscale x 2 x double> %i1, metadata !"", metadata !"", <vscale x 2 x i1> %m, i32 %n)
  %r1 = call <vscale x 2 x double> @llvm.vp.fsub.nxv2f64(<vscale x 2 x double> %i0, <vscale x 2 x double> %i1, metadata !"", metadata !"", <vscale x 2 x i1> %m, i32 %n)
  %r2 = call <vscale x 2 x double> @llvm.vp.fmul.nxv2f64(<vscale x 2 x double> %i0, <vscale x 2 x double> %i1, metadata !"", metadata !"", <vscale x 2 x i1> %m, i32 %n)
  %r3 = call <vscale x 2 x double> @llvm.vp.fdiv.nxv2f64(<vscale x 2 x double> %i0, <vscale x 2 x double> %i1, metadata !"", metadata !"", <vscale x 2 x i1> %m, i32 %n)
  ;%r4 = call <vscale x 2 x double> @llvm.vp.frem.nxv2f64(<vscale x 2 x double> %i0, <vscale x 2 x double> %i1, metadata !"", metadata !"", <vscale x 2 x i1> %m, i32 %n)
  %r5 = call <vscale x 2 x double> @llvm.vp.fma.nxv2f64(<vscale x 2 x double> %i0, <vscale x 2 x double> %i1, <vscale x 2 x double> %i2, metadata !"", metadata !"", <vscale x 2 x i1> %m, i32 %n)
  %r6 = call <vscale x 2 x double> @llvm.vp.fneg.nxv2f64(<vscale x 2 x double> %i0, metadata !"", <vscale x 2 x i1> %m, i32 %n)
  %r7 = call <vscale x 2 x double> @llvm.vp.sitofp.nxv2f64.nxv2i64(<vscale x 2 x i64> %i3, metadata !"", metadata !"", <vscale x 2 x i1> %m, i32 %n)

  call void @llvm.vp.store.nxv2f64(<vscale x 2 x double> %r0, <vscale x 2 x double>* %store_addr, i32 8, <vscale x 2 x i1> %m, i32 %n)
  call void @llvm.vp.store.nxv2f64(<vscale x 2 x double> %r1, <vscale x 2 x double>* %store_addr, i32 8, <vscale x 2 x i1> %m, i32 %n)
  call void @llvm.vp.store.nxv2f64(<vscale x 2 x double> %r2, <vscale x 2 x double>* %store_addr, i32 8, <vscale x 2 x i1> %m, i32 %n)
  call void @llvm.vp.store.nxv2f64(<vscale x 2 x double> %r3, <vscale x 2 x double>* %store_addr, i32 8, <vscale x 2 x i1> %m, i32 %n)
  ;call void @llvm.vp.store.nxv2f64(<vscale x 2 x double> %r4, <vscale x 2 x double>* %store_addr, i32 8, <vscale x 2 x i1> %m, i32 %n)
  call void @llvm.vp.store.nxv2f64(<vscale x 2 x double> %r5, <vscale x 2 x double>* %store_addr, i32 8, <vscale x 2 x i1> %m, i32 %n)
  call void @llvm.vp.store.nxv2f64(<vscale x 2 x double> %r6, <vscale x 2 x double>* %store_addr, i32 8, <vscale x 2 x i1> %m, i32 %n)
  call void @llvm.vp.store.nxv2f64(<vscale x 2 x double> %r7, <vscale x 2 x double>* %store_addr, i32 8, <vscale x 2 x i1> %m, i32 %n)

  ret void
}

; load/store (m1)
declare <vscale x 1 x double> @llvm.vp.load.nxv1f64(<vscale x 1 x double>*, i32, <vscale x 1 x i1>, i32)
declare <vscale x 1 x i64> @llvm.vp.load.nxv1i64(<vscale x 1 x i64>*, i32, <vscale x 1 x i1>, i32)
declare void @llvm.vp.store.nxv1f64(<vscale x 1 x double>, <vscale x 1 x double>*, i32, <vscale x 1 x i1>, i32)
; float arith (double, m1)
declare <vscale x 1 x double> @llvm.vp.fadd.nxv1f64(<vscale x 1 x double>, <vscale x 1 x double>, metadata, metadata, <vscale x 1 x i1>, i32)
declare <vscale x 1 x double> @llvm.vp.fsub.nxv1f64(<vscale x 1 x double>, <vscale x 1 x double>, metadata, metadata, <vscale x 1 x i1>, i32)
declare <vscale x 1 x double> @llvm.vp.fmul.nxv1f64(<vscale x 1 x double>, <vscale x 1 x double>, metadata, metadata, <vscale x 1 x i1>, i32)
declare <vscale x 1 x double> @llvm.vp.fdiv.nxv1f64(<vscale x 1 x double>, <vscale x 1 x double>, metadata, metadata, <vscale x 1 x i1>, i32)
declare <vscale x 1 x double> @llvm.vp.frem.nxv1f64(<vscale x 1 x double>, <vscale x 1 x double>, metadata, metadata, <vscale x 1 x i1>, i32)
declare <vscale x 1 x double> @llvm.vp.fma.nxv1f64(<vscale x 1 x double>, <vscale x 1 x double>, <vscale x 1 x double>, metadata, metadata, <vscale x 1 x i1>, i32)
declare <vscale x 1 x double> @llvm.vp.fneg.nxv1f64(<vscale x 1 x double>, metadata, <vscale x 1 x i1>, i32)
declare <vscale x 1 x double> @llvm.vp.sitofp.nxv1f64.nxv1i64(<vscale x 1 x i64>, metadata, metadata, <vscale x 1 x i1>, i32)

; load/store (m1)
declare <vscale x 2 x float> @llvm.vp.load.nxv2f32(<vscale x 2 x float>*, i32, <vscale x 2 x i1>, i32)
declare <vscale x 2 x i32> @llvm.vp.load.nxv2i32(<vscale x 2 x i32>*, i32, <vscale x 2 x i1>, i32)
declare void @llvm.vp.store.nxv2f32(<vscale x 2 x float>, <vscale x 2 x float>*, i32, <vscale x 2 x i1>, i32)
; float arith (float, m1)
declare <vscale x 2 x float> @llvm.vp.fadd.nxv2f32(<vscale x 2 x float>, <vscale x 2 x float>, metadata, metadata, <vscale x 2 x i1>, i32)
declare <vscale x 2 x float> @llvm.vp.fsub.nxv2f32(<vscale x 2 x float>, <vscale x 2 x float>, metadata, metadata, <vscale x 2 x i1>, i32)
declare <vscale x 2 x float> @llvm.vp.fmul.nxv2f32(<vscale x 2 x float>, <vscale x 2 x float>, metadata, metadata, <vscale x 2 x i1>, i32)
declare <vscale x 2 x float> @llvm.vp.fdiv.nxv2f32(<vscale x 2 x float>, <vscale x 2 x float>, metadata, metadata, <vscale x 2 x i1>, i32)
declare <vscale x 2 x float> @llvm.vp.frem.nxv2f32(<vscale x 2 x float>, <vscale x 2 x float>, metadata, metadata, <vscale x 2 x i1>, i32)
declare <vscale x 2 x float> @llvm.vp.fma.nxv2f32(<vscale x 2 x float>, <vscale x 2 x float>, <vscale x 2 x float>, metadata, metadata, <vscale x 2 x i1>, i32)
declare <vscale x 2 x float> @llvm.vp.fneg.nxv2f32(<vscale x 2 x float>, metadata, <vscale x 2 x i1>, i32)
declare <vscale x 2 x float> @llvm.vp.sitofp.nxv2f32.nxv2i32(<vscale x 2 x i32>, metadata, metadata, <vscale x 2 x i1>, i32)

; load/store (m2)
declare <vscale x 2 x double> @llvm.vp.load.nxv2f64(<vscale x 2 x double>*, i32, <vscale x 2 x i1>, i32)
declare <vscale x 2 x i64> @llvm.vp.load.nxv2i64(<vscale x 2 x i64>*, i32, <vscale x 2 x i1>, i32)
declare void @llvm.vp.store.nxv2f64(<vscale x 2 x double>, <vscale x 2 x double>*, i32, <vscale x 2 x i1>, i32)
; float arith (double, m2)
declare <vscale x 2 x double> @llvm.vp.fadd.nxv2f64(<vscale x 2 x double>, <vscale x 2 x double>, metadata, metadata, <vscale x 2 x i1>, i32)
declare <vscale x 2 x double> @llvm.vp.fsub.nxv2f64(<vscale x 2 x double>, <vscale x 2 x double>, metadata, metadata, <vscale x 2 x i1>, i32)
declare <vscale x 2 x double> @llvm.vp.fmul.nxv2f64(<vscale x 2 x double>, <vscale x 2 x double>, metadata, metadata, <vscale x 2 x i1>, i32)
declare <vscale x 2 x double> @llvm.vp.fdiv.nxv2f64(<vscale x 2 x double>, <vscale x 2 x double>, metadata, metadata, <vscale x 2 x i1>, i32)
declare <vscale x 2 x double> @llvm.vp.frem.nxv2f64(<vscale x 2 x double>, <vscale x 2 x double>, metadata, metadata, <vscale x 2 x i1>, i32)
declare <vscale x 2 x double> @llvm.vp.fma.nxv2f64(<vscale x 2 x double>, <vscale x 2 x double>, <vscale x 2 x double>, metadata, metadata, <vscale x 2 x i1>, i32)
declare <vscale x 2 x double> @llvm.vp.fneg.nxv2f64(<vscale x 2 x double>, metadata, <vscale x 2 x i1>, i32)
declare <vscale x 2 x double> @llvm.vp.sitofp.nxv2f64.nxv2i64(<vscale x 2 x i64>, metadata, metadata, <vscale x 2 x i1>, i32)
