{
    "meta": {
        "apiVersion": "v2.0.0",
        "beaconId": "es.elixir.bsc.beacon",
        "receivedRequestSummary": {},
        "returnedGranularity": "",
        "returnedSchemas": [],
        "testMode": true
    },
    "response": {
        "$schema": "https://raw.githubusercontent.com/ga4gh-beacon/beacon-v2/main/framework/json/responses/beaconMapResponse.json",
        "endpointSets": {
            "Analyses": {
                "endpoints": {
                    "genomicVariant": {
                        "returnedEntryType": "genomicVariant",
                        "url": "/analyses/{id}/g_variants"
                    }
                },
                "entryType": "analysis",
                "rootUrl": "/analyses",
                "singleEntryUrl": "/analyses/{id}",
                "filteringTermsUrl": "/analyses/filtering_terms",
                "openAPIEndpointsDefinition": "https://raw.githubusercontent.com/ga4gh-beacon/beacon-v2/main/models/json/beacon-v2-default-model/analyses/endpoints.json"
            },
            "Biosamples": {
                "endpoints": {
                    "analysis": {
                        "returnedEntryType": "analysis",
                        "url": "/biosamples/{id}/analyses"
                    },
                    "genomicVariant": {
                        "returnedEntryType": "genomicVariant",
                        "url": "/biosamples/{id}/g_variants"
                    },
                    "run": {
                        "returnedEntryType": "run",
                        "url": "/biosamples/{id}/runs"
                    }
                },
                "entryType": "biosample",
                "rootUrl": "/biosamples",
                "singleEntryUrl": "/biosamples/{id}",
                "filteringTermsUrl": "/biosamples/filtering_terms"
            },
            "Cohorts": {
                "endpoints": {
                    "individual": {
                        "returnedEntryType": "individual",
                        "url": "/cohorts/{id}/individuals"
                    }
                },
                "entryType": "cohort",
                "rootUrl": "/cohorts",
                "singleEntryUrl": "/cohorts/{id}",
                "filteringTermsUrl": "/cohorts/{id}/filtering_terms"
            },
            "Datasets": {
                "endpoints": {
                    "biosample": {
                        "returnedEntryType": "biosample",
                        "url": "/datasets/{id}/biosamples"
                    },
                    "genomicVariant": {
                        "returnedEntryType": "genomicVariant",
                        "url": "/datasets/{id}/g_variants"
                    },
                    "individual": {
                        "returnedEntryType": "individual",
                        "url": "/datasets/{id}/individuals"
                    }
                },
                "entryType": "dataset",
                "rootUrl": "/datasets",
                "singleEntryUrl": "/datasets/{id}",
                "filteringTermsUrl": "/datasets/{id}/filtering_terms"
            },
            "Variants": {
                "endpoints": {
                    "biosample": {
                        "returnedEntryType": "biosample",
                        "url": "/g_variants/{variantInternalId}/biosamples"
                    },
                    "individual": {
                        "returnedEntryType": "individual",
                        "url": "/g_variants/{variantInternalId}/individuals"
                    }
                },
                "entryType": "genomicVariant",
                "rootUrl": "/g_variants",
                "singleEntryUrl": "/g_variants/{variantInternalId}",
                "filteringTermsUrl": "/g_variants/filtering_terms"
            },
            "Individuals": {
                "endpoints": {
                    "biosample": {
                        "returnedEntryType": "biosample",
                        "url": "/individuals/{id}/biosamples"
                    },
                    "genomicVariant": {
                        "returnedEntryType": "genomicVariant",
                        "url": "/individuals/{id}/g_variants"
                    }
                },
                "entryType": "individual",
                "rootUrl": "/individuals",
                "singleEntryUrl": "/individuals/{id}",
                "filteringTermsUrl": "/individuals/filtering_terms"
            },
            "Runs": {
                "endpoints": {
                    "analysis": {
                        "returnedEntryType": "analysis",
                        "url": "/runs/{id}/analyses"
                    },
                    "genomicVariant": {
                        "returnedEntryType": "genomicVariant",
                        "url": "/runs/{id}/g_variants"
                    }
                },
                "entryType": "run",
                "rootUrl": "/runs",
                "singleEntryUrl": "/runs/{id}",
                "filteringTermsUrl": "/runs/filtering_terms"
            }
        }
    }
}

