{
  "$id": "https://gitlab.bsc.es/inb/ga4gh/beacon-network-data-model/raw/master/json-schemas/beacon-network.json",
  "$schema": "http://json-schema.org/draft-07/schema#",
  "title": "Beacon Network 1.1.0 Data Model Schema",
  "definitions": {
    "ServiceTypes" : {
      "description" : "enumeration of supported types of services",
      "type" : "string",
      "enum": ["GA4GHRegistry", "GA4GHBeaconAggregator", "GA4GHBeacon"]
    },
    "ServiceInfo" : {
      "type" : "object",
      "properties" : {
        "id" : {
          "description" : "unique identifier of the service",
          "type" : "string"
        },
        "name" : {
          "description" : "name of the service",
          "type" : "string"
        },
        "serviceType" : {
          "description" : "controlled vocabulary of services' types",
          "type" : "string"
        },
        "apiVersion" : {
          "description" : "version of the API provided by the service",
          "type" : "string"
        },
        "serviceUrl" : {
          "description" : "URL to the root endpoint for this service",
          "type" : "string"
        },
        "entryPoint" : {
          "description" : "whether this is an entry point in the network",
          "type" : "boolean"
        },
        "organization" : {
          "description" : "organization owning the service",
          "$ref" : "#/definitions/ServiceOrganization"
        },
        "description" : {
          "description" : "description of the service",
          "type" : "string"
        },
        "version" : {
          "description" : "version of the service implementation",
          "type" : "string"
        },
        "open" : {
          "description" : "whether the service accepts queries from the network",
          "type" : "boolean"
        },
        "welcomeUrl" : {
          "description" : "URL to the welcome page for this service",
          "type" : "string"
        },
        "alternativeUrl" : {
          "type" : "string"
        },
        "createDateTime" : {
          "type" : "string"
        },
        "updateDateTime" : {
          "type" : "string"
        }
      }
    },
    "ServiceOrganization" : {
      "type" : "object",
      "properties" : {
        "id" : {
          "type" : "string"
        },
        "name" : {
          "type" : "string"
        },
        "description" : {
          "type" : "string"
        },
        "address" : {
          "type" : "string"
        },
        "welcomeUrl" : {
          "type" : "string"
        },
        "contactUrl" : {
          "type" : "string"
        },
        "logoUrl" : {
          "type" : "string"
        }
      }
    },
    "NetworkInfo" : {
      "type" : "object",
      "properties" : {
        "id" : {
          "type" : "string"
        },
        "name" : {
          "type" : "string"
        },
        "description" : {
          "type" : "string"
        },
        "organization" : {
          "$ref" : "#/definitions/ServiceOrganization"
        },
        "services" : {
          "type" : "array",
          "items" : {
            "$ref" : "#/definitions/ServiceInfo"
          }
        }
      }
    }
  }
}
