{
  "openapi" : "3.0.1",
  "info" : {
    "title" : "Beacon Network 1.1.0 Aggregator REST API",
    "description" : "Beacon Network Aggregator REST API services",
    "contact" : {
      "email" : "redmitry@list.ru"
    },
    "license" : {
      "name" : "LGPL 2.1",
      "url" : "https://www.gnu.org/licenses/old-licenses/lgpl-2.1.html"
    },
    "version" : "0.1"
  },
  "servers" : [ {
    "url" : "https://aggregator.beacons.bsc.es/beacon-network/aggregator/v1.1.0/",
    "variables" : { }
  } ],
  "paths" : {
    "/info" : {
      "get" : {
        "summary" : "returns the ServiceInfo of the service",
        "operationId" : "getInfo",
        "responses" : {
          "default" : {
            "description" : "default response",
            "content" : {
              "application/json" : {
                "schema" : {
                  "$ref" : "https://gitlab.bsc.es/inb/ga4gh/beacon-network-data-model/-/raw/master/json-schemas/beacon-network.json#/definitions/ServiceInfo"
                }
              }
            }
          }
        }
      }
    },
    "/service-info" : {
      "get" : {
        "summary" : "returns the ServiceInfoGA4GH of the service",
        "operationId" : "getServiceInfo",
        "responses" : {
          "default" : {
            "description" : "default response",
            "content" : {
              "application/json" : {
                "schema" : {
                  "$ref" : "https://raw.githubusercontent.com/ga4gh-discovery/ga4gh-service-info/develop/service-info.yaml#/components/schemas/Service"
                }
              }
            }
          }
        }
      }
    },
    "/service_types" : {
      "get" : {
        "summary" : "enumerator of known service types: ['GA4GHRegistry', 'GA4GHBeacon', 'GA4GHBeaconAggregator']",
        "operationId" : "getServiceTypes",
        "responses" : {
          "default" : {
            "description" : "default response",
            "content" : {
              "application/json" : {
                "schema" : {
                  "type" : "array",
                  "items" : {
                    "$ref" : "https://gitlab.bsc.es/inb/ga4gh/beacon-network-data-model/-/raw/master/json-schemas/beacon-network.json#/definitions/ServiceTypes"
                  }
                }
              }
            }
          }
        }
      }
    },
    "/services" : {
      "get" : {
        "operationId" : "getServices",
        "parameters" : [ {
          "name" : "serviceType",
          "in" : "query",
          "schema" : {
            "type" : "string"
          }
        }, {
          "name" : "apiVersion",
          "in" : "query",
          "schema" : {
            "type" : "string"
          }
        } ],
        "responses" : {
          "default" : {
            "description" : "default response",
            "content" : {
              "application/json" : {
                "schema" : {
                  "type" : "array",
                  "items" : {
                    "$ref" : "https://gitlab.bsc.es/inb/ga4gh/beacon-network-data-model/-/raw/master/json-schemas/beacon-network.json#/definitions/ServiceInfo"
                  }
                }
              }
            }
          }
        }
      },
      "delete" : {
        "operationId" : "deleteServices",
        "responses" : {
          "default" : {
            "description" : "default response",
            "content" : {
              "*/*" : { }
            }
          }
        }
      }
    },
    "/services/{id}" : {
      "delete" : {
        "summary" : "remove the service from cache",
        "operationId" : "deleteService",
        "parameters" : [ {
          "name" : "id",
          "in" : "path",
          "required" : true,
          "schema" : {
            "type" : "string"
          }
        } ],
        "responses" : {
          "default" : {
            "description" : "default response",
            "content" : {
              "*/*" : { }
            }
          }
        }
      }
    },
    "/query" : {
      "get" : {
        "operationId" : "query",
        "parameters" : [ {
          "name" : "referenceName",
          "in" : "query",
          "schema" : {
            "type" : "string"
          }
        }, {
          "name" : "start",
          "in" : "query",
          "schema" : {
            "type" : "integer",
            "format" : "int64"
          }
        }, {
          "name" : "startMin",
          "in" : "query",
          "schema" : {
            "type" : "integer",
            "format" : "int64"
          }
        }, {
          "name" : "startMax",
          "in" : "query",
          "schema" : {
            "type" : "integer",
            "format" : "int64"
          }
        }, {
          "name" : "end",
          "in" : "query",
          "schema" : {
            "type" : "integer",
            "format" : "int64"
          }
        }, {
          "name" : "endMin",
          "in" : "query",
          "schema" : {
            "type" : "integer",
            "format" : "int64"
          }
        }, {
          "name" : "endMax",
          "in" : "query",
          "schema" : {
            "type" : "integer",
            "format" : "int64"
          }
        }, {
          "name" : "referenceBases",
          "in" : "query",
          "schema" : {
            "type" : "string"
          }
        }, {
          "name" : "alternateBases",
          "in" : "query",
          "schema" : {
            "type" : "string"
          }
        }, {
          "name" : "variantType",
          "in" : "query",
          "schema" : {
            "type" : "string"
          }
        }, {
          "name" : "assemblyId",
          "in" : "query",
          "schema" : {
            "type" : "string"
          }
        }, {
          "name" : "datasetIds",
          "in" : "query",
          "schema" : {
            "type" : "string"
          }
        }, {
          "name" : "includeDatasetResponses",
          "in" : "query",
          "schema" : {
            "type" : "string"
          }
        } ],
        "responses" : {
          "default" : {
            "description" : "default response",
            "content" : {
              "application/json" : {
                "schema" : {
                  "$ref" : "https://raw.githubusercontent.com/ga4gh-beacon/specification/v1.0.1/beacon.yaml#/components/schemas/BeaconAlleleResponse"
                }
              }
            }
          }
        }
      }
    }
  }
}