[
  {

    "name": "ucsc-dbsnoop",
    "label": "ucsc-dbsnoop",
    "version": [
      "366"
    ],
    "type": "cmd",
    "links": [
      "http://hgdownload.cse.ucsc.edu/admin/exe/",
      "http://hgdownload.cse.ucsc.edu/admin/exe/"
    ],
    "publication": [],
    "download": [
      "https://anaconda.org/bioconda/ucsc-dbsnoop/366/download/linux-64/ucsc-dbsnoop-366-h5eb252a_0.tar.bz2",
      "https://anaconda.org/bioconda/ucsc-dbsnoop/366/download/osx-64/ucsc-dbsnoop-366-h5eb252a_0.tar.bz2",
      "http://hgdownload.cse.ucsc.edu/admin/exe/userApps.v366.src.tgz",
      "http://hgdownload.cse.ucsc.edu/admin/exe/macOSX.x86_64/dbSnoop"
    ],
    "inst_instr": false,
    "test": false,
    "src": [
      "http://hgdownload.cse.ucsc.edu/admin/exe/userApps.v366.src.tgz",
      "http://hgdownload.cse.ucsc.edu/admin/exe/macOSX.x86_64/dbSnoop"
    ],
    "os": [],
    "input": [],
    "output": [],
    "dependencies": [],
    "documentation": [],
    "license": [
      "varies; see http://genome.ucsc.edu/license"
    ],
    "termsUse": [],
    "contribPolicy": false,
    "authors": [],
    "repository": [],
    "description": [
      "Produce an overview of a database."
    ],
    "source": [
      "bioconda"
    ],
    "bioschemas": false,
    "https": false,
    "operational": false,
    "ssl": false,
    "edam_topics": [],
    "edam_operations": [],
    "semantics": {},
    "tags": []
  },
  {

    "name": "ucsc-dbsnoop",
    "label": "ucsc-dbsnoop",
    "tags": [],
    "version": [
      "357"
    ],
    "type": "cmd",
    "links": [
      "http://hgdownload.cse.ucsc.edu/admin/exe/",
      "http://hgdownload.cse.ucsc.edu/admin/exe/"
    ],
    "publication": [],
    "download": [
      "https://anaconda.org/bioconda/ucsc-dbsnoop/357/download/linux-64/ucsc-dbsnoop-357-0.tar.bz2",
      "https://anaconda.org/bioconda/ucsc-dbsnoop/357/download/osx-64/ucsc-dbsnoop-357-0.tar.bz2",
      "https://anaconda.org/bioconda/ucsc-dbsnoop/357/download/osx-64/ucsc-dbsnoop-357-h5eb252a_2.tar.bz2",
      "http://hgdownload.cse.ucsc.edu/admin/exe/userApps.v357.src.tgz",
      "http://hgdownload.cse.ucsc.edu/admin/exe/macOSX.x86_64/dbSnoop"
    ],
    "inst_instr": false,
    "test": false,
    "src": [
      "http://hgdownload.cse.ucsc.edu/admin/exe/userApps.v357.src.tgz",
      "http://hgdownload.cse.ucsc.edu/admin/exe/macOSX.x86_64/dbSnoop"
    ],
    "os": [],
    "input": [],
    "output": [],
    "dependencies": [],
    "documentation": [],
    "license": [
      "varies; see http://genome.ucsc.edu/license"
    ],
    "termsUse": [],
    "contribPolicy": false,
    "authors": [],
    "repository": [],
    "description": [
      "Produce an overview of a database."
    ],
    "source": [
      "bioconda"
    ],
    "bioschemas": false,
    "https": false,
    "operational": false,
    "ssl": false,
    "edam_topics": [],
    "edam_operations": [],
    "semantics": {}
  },
  {
    "name": "ucsc-dbsnoop",
    "label": "ucsc-dbsnoop",
    "tags": [],
    "version": [
      "332"
    ],
    "type": "cmd",
    "links": [
      "http://hgdownload.cse.ucsc.edu/admin/exe/",
      "http://hgdownload.cse.ucsc.edu/admin/exe/"
    ],
    "publication": [],
    "download": [
      "https://anaconda.org/bioconda/ucsc-dbsnoop/332/download/linux-64/ucsc-dbsnoop-332-0.tar.bz2",
      "https://anaconda.org/bioconda/ucsc-dbsnoop/332/download/osx-64/ucsc-dbsnoop-332-0.tar.bz2",
      "http://hgdownload.cse.ucsc.edu/admin/exe/macOSX.x86_64/dbSnoop"
    ],
    "inst_instr": false,
    "test": false,
    "src": [
      "http://hgdownload.cse.ucsc.edu/admin/exe/macOSX.x86_64/dbSnoop"
    ],
    "os": [],
    "input": [],
    "output": [],
    "dependencies": [],
    "documentation": [],
    "license": [
      "varies; see http://genome.ucsc.edu/license"
    ],
    "termsUse": [],
    "contribPolicy": false,
    "authors": [],
    "repository": [],
    "description": [
      "Produce an overview of a database."
    ],
    "source": [
      "bioconda"
    ],
    "bioschemas": false,
    "https": false,
    "operational": false,
    "ssl": false,
    "edam_topics": [],
    "edam_operations": [],
    "semantics": {}
  },
  {
    "name": "ucsc-dbsnoop",
    "label": "ucsc-dbsnoop",
    "tags": [],
    "version": [
      "377"
    ],
    "type": "cmd",
    "links": [
      "http://hgdownload.cse.ucsc.edu/admin/exe/",
      "http://hgdownload.cse.ucsc.edu/admin/exe/"
    ],
    "publication": [],
    "download": [
      "https://anaconda.org/bioconda/ucsc-dbsnoop/377/download/osx-64/ucsc-dbsnoop-377-h8b15c51_0.tar.bz2",
      "http://hgdownload.cse.ucsc.edu/admin/exe/userApps.v377.src.tgz"
    ],
    "inst_instr": false,
    "test": false,
    "src": [
      "http://hgdownload.cse.ucsc.edu/admin/exe/userApps.v377.src.tgz"
    ],
    "os": [],
    "input": [],
    "output": [],
    "dependencies": [],
    "documentation": [],
    "license": [
      "varies; see http://genome.ucsc.edu/license"
    ],
    "termsUse": [],
    "contribPolicy": false,
    "authors": [],
    "repository": [],
    "description": [
      "Produce an overview of a database."
    ],
    "source": [
      "bioconda"
    ],
    "bioschemas": false,
    "https": false,
    "operational": false,
    "ssl": false,
    "edam_topics": [],
    "edam_operations": [],
    "semantics": {}
  },
  {
    "name": "ucsc-dbsnoop",
    "label": "ucsc-dbsnoop",
    "version": [
      "357"
    ],
    "tags": [],
    "type": "cmd",
    "links": [],
    "publication": [],
    "download": [],
    "inst_instr": false,
    "test": false,
    "src": [],
    "os": [],
    "input": [],
    "output": [],
    "dependencies": [],
    "documentation": [],
    "license": [],
    "termsUse": [],
    "contribPolicy": false,
    "authors": [],
    "repository": [],
    "description": [],
    "source": [
      "opeb_metrics"
    ],
    "bioschemas": false,
    "https": false,
    "operational": true,
    "ssl": null,
    "edam_topics": [],
    "edam_operations": [],
    "semantics": {}
  },
  {
    "name": "ucsc-dbsnoop",
    "label": "ucsc-dbsnoop",
    "tags": [],
    "version": [
      "366"
    ],
    "type": "cmd",
    "links": [],
    "publication": [],
    "download": [],
    "inst_instr": false,
    "test": false,
    "src": [],
    "os": [],
    "input": [],
    "output": [],
    "dependencies": [],
    "documentation": [],
    "license": [],
    "termsUse": [],
    "contribPolicy": false,
    "authors": [],
    "repository": [],
    "description": [],
    "source": [
      "opeb_metrics"
    ],
    "bioschemas": false,
    "https": false,
    "operational": true,
    "ssl": null,
    "edam_topics": [],
    "edam_operations": [],
    "semantics": {}
  },
  {
    "name": "ucsc-dbsnoop",
    "label": "ucsc-dbsnoop",
    "tags": [],
    "version": [
      "332"
    ],
    "type": "cmd",
    "links": [],
    "publication": [],
    "download": [],
    "inst_instr": false,
    "test": false,
    "src": [],
    "os": [],
    "input": [],
    "output": [],
    "dependencies": [],
    "documentation": [],
    "license": [],
    "termsUse": [],
    "contribPolicy": false,
    "authors": [],
    "repository": [],
    "description": [],
    "source": [
      "opeb_metrics"
    ],
    "bioschemas": false,
    "https": false,
    "operational": true,
    "ssl": null,
    "edam_topics": [],
    "edam_operations": [],
    "semantics": {}
  },
  {
    "name": "ucsc-dbsnoop",
    "label": "ucsc-dbsnoop",
    "tags": [],
    "version": [
      "377"
    ],
    "type": "cmd",
    "links": [],
    "publication": [],
    "download": [],
    "inst_instr": false,
    "test": false,
    "src": [],
    "os": [],
    "input": [],
    "output": [],
    "dependencies": [],
    "documentation": [],
    "license": [],
    "termsUse": [],
    "contribPolicy": false,
    "authors": [],
    "repository": [],
    "description": [],
    "source": [
      "opeb_metrics"
    ],
    "bioschemas": false,
    "https": false,
    "operational": true,
    "ssl": null,
    "edam_topics": [],
    "edam_operations": [],
    "semantics": {}
  },
  {
    "name": "ucsc-dbsnoop",
    "label": "ucsc-dbsnoop",
    "tags": [],
    "version": [
      "None"
    ],
    "type": "cmd",
    "links": [
      "http://hgdownload.cse.ucsc.edu/admin/exe/",
      "http://hgdownload.cse.ucsc.edu/admin/exe/userApps.archive/userApps.v377.src.tgz"
    ],
    "publication": [],
    "download": [
      "http://hgdownload.cse.ucsc.edu/admin/exe/userApps.archive/userApps.v377.src.tgz"
    ],
    "inst_instr": true,
    "test": false,
    "src": [
      "http://hgdownload.cse.ucsc.edu/admin/exe/userApps.archive/userApps.v377.src.tgz"
    ],
    "os": [
      "Linux",
      "Mac",
      "Windows"
    ],
    "input": [],
    "output": [],
    "dependencies": [
      "make",
      "compiler_c",
      "libpng",
      "libuuid",
      "mysql-connector-c",
      "openssl",
      "zlib",
      "libpng",
      "libuuid",
      "mysql-connector-c",
      "openssl",
      "zlib"
    ],
    "documentation": [],
    "license": [
      "varies; see http://genome.ucsc.edu/license"
    ],
    "termsUse": [
      "varies; see http://genome.ucsc.edu/license"
    ],
    "contribPolicy": false,
    "authors": [],
    "repository": [],
    "description": [],
    "source": [
      "bioconda_recipes"
    ],
    "bioschemas": null,
    "https": null,
    "operational": null,
    "ssl": null,
    "edam_topics": [],
    "edam_operations": [],
    "semantics": {}
  },
  {
    "name": "ucsc-dbsnoop",
    "label": "ucsc-dbsnoop",
    "tags": [],
    "version": [
      "332"
    ],
    "type": "cmd",
    "links": [
      "https://conda.anaconda.org/bioconda/linux-64/ucsc-dbsnoop-332-0.tar.bz2"
    ],
    "publication": [],
    "download": [
      "https://conda.anaconda.org/bioconda/linux-64/ucsc-dbsnoop-332-0.tar.bz2"
    ],
    "inst_instr": true,
    "test": null,
    "src": [],
    "os": [
      "Linux",
      "Mac",
      "Windows"
    ],
    "input": [],
    "output": [],
    "dependencies": [
      "libgcc",
      "libpng",
      "mysql",
      "openssl",
      "zlib"
    ],
    "documentation": [],
    "license": [
      "varies; see http://genome.ucsc.edu/license"
    ],
    "termsUse": null,
    "contribPolicy": null,
    "authors": [],
    "repository": [],
    "description": null,
    "source": [
      "bioconda_conda"
    ],
    "bioschemas": null,
    "https": null,
    "operational": null,
    "ssl": null,
    "edam_topics": [],
    "edam_operations": [],
    "semantics": {}
  },
  {
    "name": "ucsc-dbsnoop",
    "label": "ucsc-dbsnoop",
    "tags": [],
    "version": [
      "357"
    ],
    "type": "cmd",
    "links": [
      "https://conda.anaconda.org/bioconda/linux-64/ucsc-dbsnoop-357-1.tar.bz2"
    ],
    "publication": [],
    "download": [
      "https://conda.anaconda.org/bioconda/linux-64/ucsc-dbsnoop-357-1.tar.bz2"
    ],
    "inst_instr": true,
    "test": null,
    "src": [],
    "os": [
      "Linux",
      "Mac",
      "Windows"
    ],
    "input": [],
    "output": [],
    "dependencies": [
      "libgcc",
      "libpng",
      "libuuid",
      "mysql-connector-c",
      "openssl",
      "zlib 1.2.11*"
    ],
    "documentation": [],
    "license": [
      "varies; see http://genome.ucsc.edu/license"
    ],
    "termsUse": null,
    "contribPolicy": null,
    "authors": [],
    "repository": [],
    "description": null,
    "source": [
      "bioconda_conda"
    ],
    "bioschemas": null,
    "https": null,
    "operational": null,
    "ssl": null,
    "edam_topics": [],
    "edam_operations": [],
    "semantics": {}
  },
  {
    "name": "ucsc-dbsnoop",
    "label": "ucsc-dbsnoop",
    "tags": [],
    "version": [
      "366"
    ],
    "type": "cmd",
    "links": [
      "https://conda.anaconda.org/bioconda/linux-64/ucsc-dbsnoop-366-h5eb252a_0.tar.bz2"
    ],
    "publication": [],
    "download": [
      "https://conda.anaconda.org/bioconda/linux-64/ucsc-dbsnoop-366-h5eb252a_0.tar.bz2"
    ],
    "inst_instr": true,
    "test": null,
    "src": [],
    "os": [
      "Linux",
      "Mac",
      "Windows"
    ],
    "input": [],
    "output": [],
    "dependencies": [
      "libgcc-ng >=4.9",
      "libpng >=1.6.34,<1.7.0a0",
      "libuuid",
      "mysql-connector-c",
      "openssl >=1.0.2o,<1.0.3a",
      "zlib >=1.2.11,<1.3.0a0"
    ],
    "documentation": [],
    "license": [
      "varies; see http://genome.ucsc.edu/license"
    ],
    "termsUse": null,
    "contribPolicy": null,
    "authors": [],
    "repository": [],
    "description": null,
    "source": [
      "bioconda_conda"
    ],
    "bioschemas": null,
    "https": null,
    "operational": null,
    "ssl": null,
    "edam_topics": [],
    "edam_operations": [],
    "semantics": {}
  },
  {
    "name": "ucsc-dbsnoop",
    "label": "ucsc-dbsnoop",
    "tags": [],
    "version": [
      "377"
    ],
    "type": "cmd",
    "links": [
      "https://conda.anaconda.org/bioconda/linux-64/ucsc-dbsnoop-377-ha8a8165_3.tar.bz2"
    ],
    "publication": [],
    "download": [
      "https://conda.anaconda.org/bioconda/linux-64/ucsc-dbsnoop-377-ha8a8165_3.tar.bz2"
    ],
    "inst_instr": true,
    "test": null,
    "src": [],
    "os": [
      "Linux",
      "Mac",
      "Windows"
    ],
    "input": [],
    "output": [],
    "dependencies": [
      "libgcc-ng >=9.4.0",
      "libpng >=1.6.37,<1.7.0a0",
      "libuuid >=2.32.1,<3.0a0",
      "libzlib >=1.2.11,<1.3.0a0",
      "mysql-connector-c >=6.1.11,<6.1.12.0a0",
      "openssl >=1.1.1l,<1.1.2a",
      "zlib >=1.2.11,<1.3.0a0"
    ],
    "documentation": [],
    "license": [
      "varies; see http://genome.ucsc.edu/license"
    ],
    "termsUse": null,
    "contribPolicy": null,
    "authors": [],
    "repository": [],
    "description": null,
    "source": [
      "bioconda_conda"
    ],
    "bioschemas": null,
    "https": null,
    "operational": null,
    "ssl": null,
    "edam_topics": [],
    "edam_operations": [],
    "semantics": {}
  }
]